{"text_format":"1","workbook":"xlsx","n_sheets":18,"sheets":["NOVO","MENU","DADOS","BDI","ORÇAMENTO","EVENTOS","CÁLCULO","CRONOPLE","CRONO","QCI","PLE","BM","RRE","OFÍCIO","PO-PLE","CFF-PLE","PO-BM","CFF-BM"],"not_rendered":{"charts":0,"images":2,"macros":1,"external_links":0,"defined_names":363,"comments":7,"pivot_tables":0},"unopened":[],"bounds":{"document_bytes":16777216,"sheet_cells":100000,"rows_first":2000,"rows_last":500,"rows_between":2000,"halvings":0,"cell_chars":16384,"cell_head_chars":4096},"cells_cut":0,"cells_raw":0,"read":"whole","date_system":"1900"}

{"sheet":"NOVO","index":0,"n_rows":177,"n_cols":4,"rows_kept":177,"cut":false,"hidden":false,"merged":[]}
[]
[]
[null,"Novidades da Versão"]
[]
[]
["V3.00"]
[null,"GERAL"]
[null,null,{"$f":"IF(D8<>\"\",\"▪\",\"\")","v":"▪"},"Lançamento: Adequação à Portaria 424/2016. Acompanhamento por Eventos."]
[null,null,{"$f":"IF(D9<>\"\",\"▪\",\"\")","v":""}]
["V3.01"]
[null,"GERAL"]
[null,null,{"$f":"IF(D12<>\"\",\"▪\",\"\")","v":"▪"},"Ajustes de formatações."]
[null,"PO"]
[null,null,{"$f":"IF(D14<>\"\",\"▪\",\"\")","v":"▪"},"Correção da aplicação do BDI não desonerado."]
[null,null,{"$f":"IF(D15<>\"\",\"▪\",\"\")","v":"▪"},"Inclusão de coluna exclusiva \"Preço Unitário Edital\", para o Modo 'Orçamento Licitado'."]
[]
["V3.02"]
[null,"GERAL"]
[null,null,{"$f":"IF(D19<>\"\",\"▪\",\"\")","v":"▪"},"Ajustes de formatações."]
[null,null,{"$f":"IF(D20<>\"\",\"▪\",\"\")","v":"▪"},"Correção do Problema de Guias ocultas no BROFFICE."]
[null,"ORÇAMENTO"]
[null,null,{"$f":"IF(D22<>\"\",\"▪\",\"\")","v":"▪"},"Ampliada obtenção de dados da Planilha Referência de 20.000 para 65.536 linhas."]
[null,"CRONOGRAMA"]
[null,null,{"$f":"IF(D24<>\"\",\"▪\",\"\")","v":"▪"},"Correção na formulação do total acumulado por Repasse, CP e Outros"]
[null,"QCI"]
[null,null,{"$f":"IF(D26<>\"\",\"▪\",\"\")","v":"▪"},"Correção na formulação do arredondamento no rateio dos valores do QCI."]
[null,"RRE"]
[null,null,{"$f":"IF(D28<>\"\",\"▪\",\"\")","v":"▪"},"Correção na formulação do total por Repasse, CP e Outros."]
[]
["V3.03"]
[null,"GERAL"]
[null,null,{"$f":"IF(D32<>\"\",\"▪\",\"\")","v":"▪"},"Correção do Problema de Guias ocultas no BROFFICE."]
[null,"CÁLCULO"]
[null,null,{"$f":"IF(D34<>\"\",\"▪\",\"\")","v":"▪"},"Corrigida lentidão e travamento ao incluir e excluir frentes."]
[]
[]
["V3.04"]
[null,"BDI"]
[null,null,{"$f":"IF(D39<>\"\",\"▪\",\"\")","v":"▪"},"Correção da CPRB que exibia 4,5% mesmo quando não desonerado."]
[null,"CRONOGRAMA"]
[null,null,{"$f":"IF(D41<>\"\",\"▪\",\"\")","v":"▪"},"Correção da distribuição de Repasse, CP e Outros para as metas manuais."]
[null,"QCI"]
[null,null,{"$f":"IF(D43<>\"\",\"▪\",\"\")","v":"▪"},"Adicionado botão para adotar a CP do QCI como CP do contrato (zera saldo a reprogramar de CP)."]
[]
["V3.05"]
[null,"GERAL"]
[null,null,{"$f":"IF(D47<>\"\",\"▪\",\"\")","v":"▪"},"Corrigido modo de Cálculo da Planilha para Automático."]
[]
["V3.06"]
[null,"GERAL"]
[null,null,{"$f":"IF(D51<>\"\",\"▪\",\"\")","v":"▪"},"Adicionado modo de arredondamento para compatibilidade com o TransfereGOV, altera na aba DADOS"]
[null,null,{"$f":"IF(D52<>\"\",\"▪\",\"\")","v":"▪"},"A planilha passará a ser disponibilizada com o formato .xlsm. Deve ser usado arquivo referência 1.9 ou superior, também no formato .xlsm"]
[]
["V3.07"]
[null,"GERAL"]
[null,null,{"$f":"IF(D56<>\"\",\"▪\",\"\")","v":"▪"},"Alterada a posição da aba NOVO para antes da aba MENU."]
[null,null,{"$f":"IF(D57<>\"\",\"▪\",\"\")","v":"▪"},"Alterada a posição da aba CÁLCULO para depois da aba EVENTOS. Pois, no caso de acompanhamento por PLE, a lista supensa na coluna \"Nº  Agrupador de Eventos\" na aba CÁLCULO depende do preenchimento prévio da aba EVENTOS."]
[null,null,"▪","Alterada a posição da aba CRONO para depois da aba CRONOPLE. Pois, no caso de acompanhamento por PLE, a aba CRONO tem o preenchimento automático a partir da aba CRONOPLE."]
[null,null,"▪","Alterada a posição da aba PLE para depois da aba QCI. Com a finalidade de deixar agrupadas todas as abas de acompanhamento (PLE, BM, RRE, OFÍCIO)."]
[null,null,"▪","Acrescentados botões de navegação (cor azul claro) em várias abas. Em relação a esses botões, também foram ajustados os links, nomes e formatação."]
[null,null,"▪","Criada macro para exibir apenas as abas pertinentes (exemplo: caso o acompanhamento seja por PLE, a aba BM fica oculta)."]
[null,null,"▪","Ajuste na macro para correção automática do Nº AGRUPADOR DE EVENTOS na aba CÁLCULO, quando se ADCIONAR ou EXCLUIR LINHAS na aba EVENTOS."]
[null,"MENU"]
[null,null,{"$f":"IF(D64<>\"\",\"▪\",\"\")","v":"▪"},"Acrescentado o botão \"IMPORTAR DE OUTROS MODELOS CAIXA\": PO (MO27476); PLE (MO27477); e QCI (MO41211)."]
[null,null,{"$f":"IF(D65<>\"\",\"▪\",\"\")","v":"▪"},"Acrescentado o botão de seleção \"Importar Fórmulas para o Custo Unitário (aba ORÇAMENTO)\". "]
[null,null,null,"Caso selecionada, será importada a fórmula (se houver) do custo unitário; Caso desmarcada, será importado somente o valor."]
[null,null,{"$f":"IF(D67<>\"\",\"▪\",\"\")","v":"▪"},"Acrescentado o botão de seleção \"Importar Fórmulas para as Quantidades da PLQ (aba CÁLCULO)\". "]
[null,null,null,"Caso selecionada, será importada a fórmula (se houver) do quantitativo; Caso desmarcada, será importado somente o valor."]
[null,null,{"$f":"IF(D69<>\"\",\"▪\",\"\")","v":"▪"},"Atualizada a macro de Importação para incluir a importar da coluna \"Nº Agrupador de Eventos\" da aba CÁLCULO."]
[null,null,{"$f":"IF(D70<>\"\",\"▪\",\"\")","v":"▪"},"Atualizada a macro de Imprimir Documentos (para englobar as abas EVENTOS e CRONOPLE)."]
[null,"BDI"]
[null,null,{"$f":"IF(D72<>\"\",\"▪\",\"\")","v":"▪"},"Ajuste automático do valor da CPRB em função da data base do orçamento (para atendimento do Art. 9-A da Lei 12.546 de 14/12/2011)."]
[null,"EVENTOS"]
[null,null,{"$f":"IF(D74<>\"\",\"▪\",\"\")","v":"▪"},"Acrescentados os dados de identificação do Contrato de Repasse."]
[null,null,{"$f":"IF(D75<>\"\",\"▪\",\"\")","v":"▪"},"Acrescentadas as colunas dos totais dos Eventos por Frentes de Obra."]
[null,null,{"$f":"IF(D76<>\"\",\"▪\",\"\")","v":"▪"},"Acrescentados os dados de Local, Data e Responsável Técnico."]
[null,null,{"$f":"IF(D77<>\"\",\"▪\",\"\")","v":"▪"},"Acrescentado FILTRO para exibir apenas as linhas preenchidas."]
[null,"CRONOPLE"]
[null,null,{"$f":"IF(D79<>\"\",\"▪\",\"\")","v":"▪"},"Acrescentados os dados de identificação do Contrato de Repasse."]
[null,null,{"$f":"IF(D80<>\"\",\"▪\",\"\")","v":"▪"},"Acrescentado o quadro \"Cronograma\" com percentual e valor da parcela e percentual e valor acumulado."]
[null,null,{"$f":"IF(D81<>\"\",\"▪\",\"\")","v":"▪"},"Acrescentados os dados de Local, Data e Responsável Técnico."]
[null,null,{"$f":"IF(D82<>\"\",\"▪\",\"\")","v":"▪"},"Acrescentado FILTRO para exibir apenas as linhas preenchidas."]
[null,"RRE"]
[null,null,{"$f":"IF(D84<>\"\",\"▪\",\"\")","v":"▪"},"Correção na fórmula da data, para replicar a “Data de fechamento do RRE” na aba DADOS."]
[null,"OFÍCIO"]
[null,null,{"$f":"IF(D86<>\"\",\"▪\",\"\")","v":"▪"},"Exclusão do quadro \"Resumo de Valores por CTEF\"."]
[]
["V3.08"]
[null,"GERAL"]
[null,null,{"$f":"IF(D90<>\"\",\"▪\",\"\")","v":"▪"},"Incluídos alertas de erro de preenchimento em todas as abas."]
[null,"MENU"]
[null,null,{"$f":"IF(D92<>\"\",\"▪\",\"\")","v":"▪"},"Incluído botão de macro para gerar arquivo (em xlsx) para upload da PO e CFF no TransfereGOV."]
[null,null,{"$f":"IF(D93<>\"\",\"▪\",\"\")","v":"▪"},"Ajustada a macro \"Importar de outra Planilha Múltipla\" para importar o Cronograma da aba CRONO. Também foram incluídas as importações dos campos: Data do preenchimento (DADOS), Data de fechamento do RRE (DADOS); nº da 1ª Parcela do Cronograma (CRONO), mês da 1ª Parcela do Cronograma (CRONO), nº da Medição (BM) e nº da Medição (PLE)."]
[null,null,{"$f":"IF(D94<>\"\",\"▪\",\"\")","v":"▪"},"Incluída a informação do progresso na macro \"Importar de outra Planilha Múltipla\", por meio de uma barra de progresso (janela que será exibida na tela) e da indicação das etapas de importação na barra de status do Excel (canto inferior esquerdo da janela do Excel)."]
[null,"BDI"]
[null,null,{"$f":"IF(D96<>\"\",\"▪\",\"\")","v":"▪"},"Incluídos botões de navegação para os formulários de BDI (BDI 1, BDI 2, BDI 3)."]
[null,"ORÇAMENTO"]
[null,null,{"$f":"IF(D98<>\"\",\"▪\",\"\")","v":"▪"},"Incluído botão de macro para padronizar as siglas de unidades, conforme lista de siglas válidas no TransfereGOV."]
[null,"EVENTOS"]
[null,null,{"$f":"IF(D100<>\"\",\"▪\",\"\")","v":"▪"},"O Título de Evento \"Administração Local\" com preenchimento automático proporcional agora é exibido apenas no modo Arredondamento de Frentes \"Tradicional\" e para a opção Agrupadores de Eventos \"Definir Manualmente\"."]
[null,null,{"$f":"IF(D101<>\"\",\"▪\",\"\")","v":"▪"},"Não é mais possível deixar Eventos em branco (sem nome ou sem valor)."]
[null,"CÁLCULO"]
[null,null,{"$f":"IF(D103<>\"\",\"▪\",\"\")","v":"▪"},"Não é mais possível deixar Frentes de Obra em branco (sem nome ou sem quantidades)."]
[null,"CRONOPLE"]
[null,null,{"$f":"IF(D105<>\"\",\"▪\",\"\")","v":"▪"},"Incluído campo para selecionar o Título do Evento referente à Administração Local (acompanhamento por PLE)."]
[null,null,{"$f":"IF(D106<>\"\",\"▪\",\"\")","v":"▪"},"Incluída linha com o percentual acumulado da Administração Local em cada período."]
[null,"CRONO"]
[null,null,{"$f":"IF(D108<>\"\",\"▪\",\"\")","v":"▪"},"Ajustada a fórmula do % acumulado a partir da parcela 13 (para manter o padrão da fórmula das parcelas 1 a 12)."]
[null,null,{"$f":"IF(D109<>\"\",\"▪\",\"\")","v":"▪"},"Incluído campo para selecionar o Macrosserviço referente à Administração Local (acompanhamento por BM)."]
[null,null,{"$f":"IF(D110<>\"\",\"▪\",\"\")","v":"▪"},"Incluída linha com o percentual acumulado da Administração Local em cada parcela."]
[null,"RRE"]
[null,null,{"$f":"IF(D112<>\"\",\"▪\",\"\")","v":"▪"},"Corrigida a fórmula do % no quadro \"Percentual previsto em:\". Que estava limitada a buscar o % previsto até a parcela 12."]
[null,"PLE"]
[null,null,{"$f":"IF(D114<>\"\",\"▪\",\"\")","v":"▪"},"Incluída linha com o percentual acumulado da Administração Local em cada medição."]
[null,"BM"]
[null,null,{"$f":"IF(D116<>\"\",\"▪\",\"\")","v":"▪"},"Incluído campo com o percentual medido acumulado da Administração Local."]
[]
["V3.09"]
[null,"MENU"]
[null,null,{"$f":"IF(D120<>\"\",\"▪\",\"\")","v":"▪"},"Atualizada a macro \"Gerar arquivo para upload no TransfereGOV\" para ajustar os códigos de composições SINAPI (acrescentar zeros a esquerda até completar dez dígitos) para Data base igual ou superior a JAN/2025."]
[null,"ORÇAMENTO"]
[null,null,{"$f":"IF(D122<>\"\",\"▪\",\"\")","v":"▪"},"Acrescentada formatação condicional na coluna \"Descrição\" para exibir os textos de alerta de erro, textos que começam com \"(\", na cor vermelha."]
[null,"BDI"]
[null,null,{"$f":"IF(D124<>\"\",\"▪\",\"\")","v":"▪"},"Corrigida a macro dos botões de navegação para os formulários do BDI."]
[]
["V3.10"]
[null,"GERAL"]
[null,null,{"$f":"IF(D128<>\"\",\"▪\",\"\")","v":"▪"},"Corrigidas as fórmulas da v3.08 / v3.09 que eram incompatíveis com as versões do Excel anteriores ao Office 365."]
[]
["V3.11"]
[null,"MENU"]
[null,null,{"$f":"IF(D132<>\"\",\"▪\",\"\")","v":"▪"},"Ajuste na macro \"Importar de outra Planilha Múltipla\" para tratar o erro \"tipos incompatíveis\"."]
[null,null,{"$f":"IF(D133<>\"\",\"▪\",\"\")","v":"▪"},"Ajuste na macro \"Gerar arquivo para upload no TransfereGOV\" para informar no status o número da linha que está sendo mesclada."]
[null,"CRONO"]
[null,null,{"$f":"IF(D135<>\"\",\"▪\",\"\")","v":"▪"},"Correção nas fórmulas dos valores no período da 13ª parcela do cronograma."]
[null,"RRE"]
[null,null,{"$f":"IF(D137<>\"\",\"▪\",\"\")","v":"▪"},"Correção nas fórmulas dos valores acumulados no caso de Administração Local de preenchimento manual."]
[]
["V3.12"]
[null,"MENU"]
[null,null,{"$f":"IF(D141<>\"\",\"▪\",\"\")","v":"▪"},"Atualização na macro \"Gerar arquivo para upload no TransfereGOV\" em virtude de alteração no upload no TransfereGOV (código sem zeros a esquerda)."]
[null,"BDI"]
[null,null,{"$f":"IF(D143<>\"\",\"▪\",\"\")","v":"▪"},"Revisão nos alertas de erro de preenchimento."]
[null,"ORÇAMENTO"]
[null,null,{"$f":"IF(D145<>\"\",\"▪\",\"\")","v":"▪"},"Revisão nos alertas de erro de preenchimento."]
[null,"EVENTOS"]
[null,null,{"$f":"IF(D147<>\"\",\"▪\",\"\")","v":"▪"},"Revisão na lista suspensa de opções da forma de definição dos agrupadores de eventos."]
[null,"CÁLCULO"]
[null,null,{"$f":"IF(D149<>\"\",\"▪\",\"\")","v":"▪"},"Revisão nos alertas de erro de preenchimento."]
[null,"CRONOPLE"]
[null,null,{"$f":"IF(D151<>\"\",\"▪\",\"\")","v":"▪"},"Correção na macro \"Atualizar Linhas\"."]
[null,"CRONO"]
[null,null,{"$f":"IF(D153<>\"\",\"▪\",\"\")","v":"▪"},"Correção na fórmula dos porcentuais de Administração Local, no caso de agrupadores de eventos automáticos."]
[]
["V3.13"]
[null,"GERAL"]
[null,null,{"$f":"IF(D157<>\"\",\"▪\",\"\")","v":"▪"},"Ajuste em todas as listas suspensas (substituindo valores ou textos por um intervalo com os dados)."]
[null,"MENU"]
[null,null,{"$f":"IF(D159<>\"\",\"▪\",\"\")","v":"▪"},"Correção do valor total na macro \"Gerar arquivo para upload no TransfereGOV\". No arquivo para upload o valor total era preenchido apenas com o valor da meta 1."]
[null,null,{"$f":"IF(D160<>\"\",\"▪\",\"\")","v":"▪"},"Correção nos arredondamentos na macro \"Gerar arquivo para upload no TransfereGOV\". No caso de preenchimento das quantidades com mais de duas casas decimais na PLQ, os valores calculados no Tgov ficavam diferentes dos valores calculados na Múltipla."]
[null,null,{"$f":"IF(D161<>\"\",\"▪\",\"\")","v":"▪"},"Atualização na macro \"Gerar arquivo para upload no TransfereGOV\". No caso de alertas de erro de preenchimento nas abas BDI e ORÇAMENTO a caixa de mensagem informa o erro encontrado e pergunta ao usuário se quer \"Corrigir o erro agora?\", caso o usuário responda \"Não\" a macro continua os procedimentos e gera o arquivo com o erro de preenchimento."]
[null,"ORÇAMENTO"]
[null,null,{"$f":"IF(D163<>\"\",\"▪\",\"\")","v":"▪"},"Atualização no preenchimento da coluna BDI. Possibilidade de preencher diretamente um percentual na célula."]
[null,null,{"$f":"IF(D164<>\"\",\"▪\",\"\")","v":"▪"},"Ajuste no alerta de erro \"Acima Ref.\", dispensado caso a Fonte de Recursos seja diferente de \"OGU\"."]
[null,null,{"$f":"IF(D165<>\"\",\"▪\",\"\")","v":"▪"},"Incluído alerta de erro caso a data base do arquivo referência seja diferente da indicada no nome do mesmo arquivo."]
[null,null,{"$f":"IF(D166<>\"\",\"▪\",\"\")","v":"▪"},"Incluído alerta de erro caso os arredondamentos de todos os valores não estejam selecionados (para contratos no transferegov)."]
[null,null,{"$f":"IF(D167<>\"\",\"▪\",\"\")","v":"▪"},"Incluído alerta de erro \"Justificar BDI\", caso não seja adotado um BDI da lista suspensa."]
[null,"CÁLCULO"]
[null,null,{"$f":"IF(D169<>\"\",\"▪\",\"\")","v":"▪"},"Incluído alerta de erro \"Verificar as quantidades preenchidas na linha...\", caso a soma das quantidades preenchidas seja diferente da soma das quantidades arredondadas com duas casas decimais."]
[null,null,{"$f":"IF(D170<>\"\",\"▪\",\"\")","v":"▪"},"Incluído alerta de erro \"Preencha as quantidades com no máximo duas casas decimais\", caso o alerta de erro acima aparece em alguma linha."]
[null,null,"▪","Incluída formatação condicional para indicar as quantidades na PLQ com mais de duas casas decimais (o texto ficará na cor vermelha)."]
[null,"CRONOPLE"]
[null,null,{"$f":"IF(D173<>\"\",\"▪\",\"\")","v":"▪"},"Correção na macro \"Atualizar Linhas\"."]
[null,"PLE"]
[null,null,{"$f":"IF(D175<>\"\",\"▪\",\"\")","v":"▪"},"Correção na fórmula na coluna Filtro."]
[null,"RRE"]
[null,null,{"$f":"IF(D177<>\"\",\"▪\",\"\")","v":"▪"},"Correção nas fórmulas dos valores acumulados (o valor da administração local era duplicado em alguns casos)."]

{"sheet":"MENU","index":1,"n_rows":24,"n_cols":15,"rows_kept":24,"cut":false,"hidden":false,"merged":[[19,1,19,7],[7,1,7,7],[1,4,2,6],[15,1,15,7]]}
[null,null,null,null,null,null,null,null,null,"PM",true]
[null,null,null,null,{"$f":"CHOOSE(MATCH(Objeto,{\"PM\",\"PO\"}),\"PLANILHA MÚLTIPLA \",\"PLANILHA ORÇAMENTÁRIA \")& Versao","v":"PLANILHA MÚLTIPLA v3.13"},null,null,null,null,"v3.13",true]
[null,null,null,null,null,null,null,null,null,null,null,null,null,null,1]
[null,null,null,null,null,null,null,null,null,{"$f":"IF(VALUE(MENU!$O$4)=2,\"BM\",\"PLE\")","v":"PLE"},null,null,null,null,1]
[null,null,null,null,null,null,null,null,null,"Proposto"]
[null,null,null,null,"DADOS DO CONTRATO",null,"NOVIDADES DA VERSÃO",null,null,"Licitado"]
[null,null,null,null,null,null,null,null,null,"PLE"]
[null,{"$f":"IF($O$3<>2,\"DOCUMENTAÇÃO DA PROPOSTA\",\"PROPOSTA: Para visualizar/preencher esta seção, altere o TIPO DE ORÇAMENTO para 'Proposto'\")","v":"DOCUMENTAÇÃO DA PROPOSTA"},null,null,null,null,null,null,null,"BM",null,"LEGENDA:"]
[null,null,null,null,null,null,null,null,null,null,null,"Cores das células:"]
[null,null,{"$f":"IF(TIPOORCAMENTO<>\"Proposto\",\"\",\"                    BDI                    \")","v":"                    BDI                    "},null,{"$f":"IF(TIPOORCAMENTO<>\"Proposto\",\"\",\"             ORÇAMENTO             \")","v":"             ORÇAMENTO             "},null,{"$f":"IF(TIPOORCAMENTO<>\"Proposto\",\"\",\"MEMÓRIA DE CÁLCULO / PLQ\")","v":"MEMÓRIA DE CÁLCULO / PLQ"},null,null,null,null,null,null,"Fundo amarelo: células para preencher"]
[]
[null,null,{"$f":"IF(TIPOORCAMENTO<>\"Proposto\",\"\",\"                    QCI                    \")","v":"                    QCI                    "},null,{"$f":"IF(TIPOORCAMENTO<>\"Proposto\",\"\",\"CRONOGRAMA FÍSICO-FINANCEIRO\")","v":"CRONOGRAMA FÍSICO-FINANCEIRO"},null,null,null,null,null,null,null,null,"Fundo azul: células para seleção de opções"]
[]
[null,null,{"$f":"IF(TIPOORCAMENTO<>\"Proposto\",\"\",\"Obs: Composições e Cotações devem ser preenchidas diretamente no arquivo Referência \"&IF(ISBLANK(Import.DataBase),\"mm-aaaa\",TEXT(Import.DataBase,\"mm-aaaa\"))&\".xlsm.\")","v":"Obs: Composições e Cotações devem ser preenchidas diretamente no arquivo Referência 02-2026.xlsm."}]
[null,null,null,null,null,null,null,null,null,null,null,"Cores dos botões:"]
[null,{"$f":"IF($O$3<>2,\"PÓS-LICITADO: Para visualizar/preencher esta seção, altere o TIPO DE ORÇAMENTO para 'Licitado'\",\"RESULTADO DO PROCESSO LICITATÓRIO\")","v":"PÓS-LICITADO: Para visualizar/preencher esta seção, altere o TIPO DE ORÇAMENTO para 'Licitado'"},null,null,null,null,null,null,null,null,null,null,null,"Fundo azul claro: navegação entre abas"]
[]
[null,null,{"$f":"IF(TIPOORCAMENTO<>\"Licitado\",\"\",\"             ORÇAMENTO             \")","v":""},null,{"$f":"IF(TIPOORCAMENTO<>\"Licitado\",\"\",\"                    QCI                    \")","v":""},null,{"$f":"IF(TIPOORCAMENTO<>\"Licitado\",\"\",\"CRONOGRAMA FÍSICO-FINANCEIRO\")","v":""},null,null,null,null,null,null,"Fundo laranja: execução de macro"]
[]
[null,{"$f":"IF($O$3<>2,\"ACOMPANHAMENTO: Para visualizar/preencher esta seção, altere o TIPO DE ORÇAMENTO para 'Licitado'\",\"ACOMPANHAMENTO DO EMPREENDIMENTO\")","v":"ACOMPANHAMENTO: Para visualizar/preencher esta seção, altere o TIPO DE ORÇAMENTO para 'Licitado'"}]
[]
[null,null,{"$f":"IF(OR(_xlfn.SINGLE(TIPOORCAMENTO)<>\"Licitado\",ACOMPANHAMENTO<>\"PLE\"),\"\",\"PLAN. DE LEVANT. DE EVENTOS - PLE\")","v":""},null,{"$f":"IF(TIPOORCAMENTO<>\"Licitado\",\"\",\"                    RRE                    \")","v":""},null,{"$f":"IF(OR(_xlfn.SINGLE(TIPOORCAMENTO)<>\"Licitado\",ACOMPANHAMENTO<>\"BM\"),\"\",\"  BOLETIM DE MEDIÇÃO - BM  \")","v":""}]
[]
[null,null,null,null,{"$f":"IF(TIPOORCAMENTO<>\"Licitado\",\"\",\"OF. DE SOLICITAÇÃO DE DESBLOQUEIO\")","v":""}]

{"sheet":"DADOS","index":2,"n_rows":220,"n_cols":49,"rows_kept":220,"cut":false,"hidden":false,"merged":[[49,1,49,2],[58,1,58,2],[0,13,0,45],[2,1,2,2],[14,1,14,2],[20,1,20,2],[26,1,26,2],[34,1,34,2],[45,1,45,2]]}
[null,"A. DOCUMENTAÇÃO DA PROPOSTA",null,{"$f":"IF(D3<>\"\",\"Falta preencher os Dados do Contrato\",IF(D15<>\"\",\"Falta preencher os Dados do Empreendimento\",IF(D21<>\"\",\"Falta preencher os Dados do Responsável pelo Orçamento\",IF(D27<>\"\",\"Falta preencher os Dados do Responsável pelo Tomador\",IF(D31<>\"\",\"Falta definir o método de arredondamento das frentes de obra\",IF(D35<>\"\",\"Falta preencher os Dados da Licitação\",IF(D46<>\"\",\"Falta preencher os Dados da Obra\",IF(D50<>\"\",\"Falta preencher os Dados do Responsável pela Fiscalização\",\"\"))))))))","v":"Falta preencher os Dados do Contrato"},null,null,"Fonte de recursos:","Regime previdenciário","Regime de Execução","Arredondamento",null,null,null,"Sub-Itens de Investimento",null,null,null,null,null,null,null,null,null,null,null,null,null,null,null,null,null,null,null,null,null,null,null,null,null,null,null,null,null,null,null,null,null,"Unidades válidas no Tgov"]
[null,null,null,null,null,null,"(SELECIONAR)","(SELECIONAR)","(SELECIONAR)","Tradicional",null,"Itens de Investimento","Unidades habitacionais",{"$f":"COUNTA(M:M)-1","v":3},"Equipamentos comunitários",{"$f":"COUNTA(O:O)-1","v":6},"Pavimentação",{"$f":"COUNTA(Q:Q)-1","v":6},"Drenagem ",{"$f":"COUNTA(S:S)-1","v":6},"Abastecimento de água",{"$f":"COUNTA(U:U)-1","v":11},"Esgotamento sanitário",{"$f":"COUNTA(W:W)-1","v":8},"Energia elétrica e iluminação pública",{"$f":"COUNTA(Y:Y)-1","v":4},"Coleta e tratamento de resíduos sólidos",{"$f":"COUNTA(AA:AA)-1","v":6},"Contenção e estabilização de encostas ",{"$f":"COUNTA(AC:AC)-1","v":2},"Regularização fundiária",{"$f":"COUNTA(AE:AE)-1","v":2},"Aquisição de terreno",{"$f":"COUNTA(AG:AG)-1","v":2},"Aquisição de equipamentos e insumos",{"$f":"COUNTA(AI:AI)-1","v":1},"Elaboração de estudos e projetos",{"$f":"COUNTA(AK:AK)-1","v":1},"Instrumentos e ações em planejamento e gestão pública",{"$f":"COUNTA(AM:AM)-1","v":1},"Ações complementares às obras",{"$f":"COUNTA(AO:AO)-1","v":3},"Gerenciamento",{"$f":"COUNTA(AQ:AQ)-1","v":1},"Trabalho social",{"$f":"COUNTA(AS:AS)-1","v":4},null,"Sigla","Descrição"]
[null,"Dados do Contrato (Inicial)",null,{"$f":"IF(COUNTIF(D4:D13,\"◄\")=0,\"\",\"Falta preencher a linha \"&MATCH(\"◄\",D4:D13,0)+ROW(D3))","v":"Falta preencher a linha 7"},null,null,"OGU","NÃO SE APLICA","INDEFINIDO / NÃO SE APLICA","TransfereGOV",null,"Unidades habitacionais","Aquisição","un","Convivência comunitária, assistência social e/ou comunitária","m²","Capeamento de vias","m²","Obras de microdrenagem ","m","Captação subterrânea","m³/s","Ligações domiciliares e/ou intradomiciliares","un","Iluminação pública - luminárias","un","Acondicionamento ","un","Estabilização de taludes","m²","Desapropriacões/Indenizações","m²","Aquisição de terreno","m²","Aquisição de equipamentos e insumos","un","Elaboração de estudos e projetos","un","Instrumentos e ações em planejamento e gestão pública","un","Avaliação pós intervenção","un","Gerenciamento","%CT","Projeto de Trabalho Social Preliminar","nº fam",null,"%CT","%CT"]
[null,"Fonte de recursos:","OGU",{"$f":"IF(OR(OFFSET(D4,0,-1)=\"\",OFFSET(D4,0,-1)=\"(SELECIONAR)\"),\"◄\",\"\")","v":""},null,null,"FGTS","DESONERADO","EMPREITADA POR PREÇO GLOBAL",null,null,"Equipamentos comunitários","Construção","un","Educação e cultura","m²","Recapeamento de vias","m²","Desassoreamento de cursos de água","m","Captação superficial","m³/s","Rede coletora e/ou condominial","m","Ligações domiciliares","un","Aterro sanitário e/ou disposição final","m³","Obras complementares a ações de redução de risco e/ou contenções","m²","Projeto de Regularização Fundiária","m²","Benfeitorias","m²",null,null,null,null,null,null,"Demolições","un",null,null,"Projeto de Trabalho Social","nº fam",null,"°C","GRAU CELSIUS"]
[null,"Proponente/Tomador:","MUNICÍPIO DE SÃO VALENTIN",{"$f":"IF(OFFSET(D5,0,-1)=\"\",\"◄\",\"\")","v":""},null,null,null,"NÃO DESONERADO","EMPREITADA POR PREÇO UNITÁRIO",null,null,"Pavimentação","Reforma e/ou melhoria","un","Esportes","m²","Obras de artes especiais","m","Canalização de cursos de água","m","Estação de bombeamento de água bruta","m³/s","Coletor tronco e/ou interceptores","m","Linhas de distribuição - baixa tensão ","m","Erradicação de lixões","m³",null,null,null,null,null,null,null,null,null,null,null,null,"Plano de Reassentamento e medidas compensatórias","un",null,null,"Plano de Desenvolvimento Socioterritorial","nº fam",null,"°F","GRAU FAHRENHEIT"]
[null,"Município/UF:","SÃO VALENTIM/RS","",null,null,null,null,"EMPREITADA INTEGRAL",null,null,"Drenagem ",null,null,"Lazer e turismo","m²","Pavimentação de calçadas","m²","Recomposição de vegetação ciliar, renaturalização de cursos de água ou restauração de margens","m²","Adução","m","Emissário","m","Linhas de transmissão - alta tensão ","m","Sistema de coleta seletiva tradicional, transporte e/ou equipamentos","un",null,null,null,null,null,null,null,null,null,null,null,null,null,null,null,null,"Plano de Gestão Condominial","nº fam",null,"100M","100 METROS"]
[null,"Nº da Operação (0000000-00):",null,"◄",null,null,null,null,"TAREFA",null,null,"Abastecimento de água",null,null,"Saúde","m²","Pavimentação de vias","m²","Reservatório de amortecimento de cheias","m³","Estação de Tratamento de Água (ETA)","m³/s","Estação Elevatória","m³/s",null,null,"Tratamento local ","un",null,null,null,null,null,null,null,null,null,null,null,null,null,null,null,null,null,null,null,"18L","18 LITROS"]
[null,"Nº do TransfereGOV (000000):",null,{"$f":"IF(AND(Import.TipoArredondamento=\"TransfereGOV\",OFFSET(D8,0,-1)=\"\"),\"◄\",\"\")","v":"◄"},null,null,null,null,"CONTRATAÇÃO INTEGRADA",null,null,"Esgotamento sanitário",null,null,"Segurança pública","m²","Sinalização","m²","Estação de Bombeamento","m³/s","Estação de bombeamento de água tratada","m³/s","Estação de Tratamento de Esgoto (ETE)","m³/s",null,null,"Usinas de reciclagem ","m²",null,null,null,null,null,null,null,null,null,null,null,null,null,null,null,null,null,null,null,"200KG","200 QUILOS"]
[null,{"$f":"IF(C4=\"FGTS\",\"Valor de Financiamento Contratado (R$):\",\"Valor do Repasse Contratado (R$):\")","v":"Valor do Repasse Contratado (R$):"},null,"◄",null,null,null,null,"ADM. DIRETA",null,null,"Energia elétrica e iluminação pública",null,null,null,null,null,null,null,null,"Linha de recalque","m","Sistema simplificado de tratamento","m³/s",null,null,null,null,null,null,null,null,null,null,null,null,null,null,null,null,null,null,null,null,null,null,null,"250G","250 GRAMAS"]
[null,"Valor de Contrapartida Contratada (R$):",null,"◄",null,null,null,null,null,null,null,"Coleta e tratamento de resíduos sólidos",null,null,null,null,null,null,null,null,"Reservação","m³","Unidades sanitárias","un",null,null,null,null,null,null,null,null,null,null,null,null,null,null,null,null,null,null,null,null,null,null,null,"310ML","310 MILILITROS"]
[null,"% mínimo de Contrapartida:",null,"◄",null,null,null,null,null,null,null,"Contenção e estabilização de encostas ",null,null,null,null,null,null,null,null,"Rede de distribuição","m",null,null,null,null,null,null,null,null,null,null,null,null,null,null,null,null,null,null,null,null,null,null,null,null,null,"50KG","50 QUILOS"]
[null,"R$ mínimo de Contrapartida (se houver):",null,null,null,null,null,null,null,null,null,"Regularização fundiária",null,null,null,null,null,null,null,null,"Ligações domiciliares e/ou intradomiciliares","un",null,null,null,null,null,null,null,null,null,null,null,null,null,null,null,null,null,null,null,null,null,null,null,null,null,"A","AMPÈRE"]
[null,"% máximo de Contrapartida:",null,null,null,null,null,null,null,null,null,"Aquisição de terreno",null,null,null,null,null,null,null,null,"Sistema simplificado de abastecimento","m",null,null,null,null,null,null,null,null,null,null,null,null,null,null,null,null,null,null,null,null,null,null,null,null,null,"ACA/ACC","A.CORR.ALTERN/CONT."]
[null,null,null,null,null,null,null,null,null,null,null,"Aquisição de equipamentos e insumos",null,null,null,null,null,null,null,null,null,null,null,null,null,null,null,null,null,null,null,null,null,null,null,null,null,null,null,null,null,null,null,null,null,null,null,"AH","AMPÈRE HORA"]
[null,"Dados do Empreendimento e Orçamento",null,{"$f":"IF(COUNTIF(D16:D19,\"◄\")=0,\"\",\"Falta preencher a linha \"&MATCH(\"◄\",D16:D19,0)+ROW(D15))","v":"Falta preencher a linha 17"},null,null,null,null,null,null,null,"Elaboração de estudos e projetos",null,null,null,null,null,null,null,null,null,null,null,null,null,null,null,null,null,null,null,null,null,null,null,null,null,null,null,null,null,null,null,null,null,null,null,"AH/H/V","AMPÉRE-H/H/VOLT"]
[null,"Nome/apelido:","COBERTURA RUA PEDRO DASSOLER",{"$f":"IF(OFFSET(D16,0,-1)=\"\",\"◄\",\"\")","v":""},null,null,null,null,null,null,null,"Instrumentos e ações em planejamento e gestão pública",null,null,null,null,null,null,null,null,null,null,null,null,null,null,null,null,null,null,null,null,null,null,null,null,null,null,null,null,null,null,null,null,null,null,null,"AM","AMPOLA"]
[null,"Descrição do Objeto do Lote / CTEF:",null,"◄",null,null,null,null,null,null,null,"Ações complementares às obras",null,null,null,null,null,null,null,null,null,null,null,null,null,null,null,null,null,null,null,null,null,null,null,null,null,null,null,null,null,null,null,null,null,null,null,"AM0/4ML","AMPOLA COM 0,4 Ml"]
[null,"Regime previdenciário previsto para a obra:","(SELECIONAR)",{"$f":"IF(OR(OFFSET(D18,0,-1)=\"\",OFFSET(D18,0,-1)=\"(SELECIONAR)\"),\"◄\",\"\")","v":"◄"},null,null,null,null,null,null,null,"Gerenciamento",null,null,null,null,null,null,null,null,null,null,null,null,null,null,null,null,null,null,null,null,null,null,null,null,null,null,null,null,null,null,null,null,null,null,null,"AM0/5ML","AMPOLA COM 0,5 mL"]
[null,"Data base do Orçamento:","2026-02-01","",null,null,null,null,null,null,null,"Trabalho social",null,null,null,null,null,null,null,null,null,null,null,null,null,null,null,null,null,null,null,null,null,null,null,null,null,null,null,null,null,null,null,null,null,null,null,"AM1/5ML","AMPOLA COM 1,5 mL"]
[null,null,null,null,null,null,null,null,null,null,null,null,null,null,null,null,null,null,null,null,null,null,null,null,null,null,null,null,null,null,null,null,null,null,null,null,null,null,null,null,null,null,null,null,null,null,null,"AM10ML","AMPOLA COM 10 mL"]
[null,"Responsável pelo Orçamento",null,{"$f":"IF(COUNTIF(D22:D25,\"◄\")=0,\"\",\"Falta preencher a linha \"&MATCH(\"◄\",D22:D25,0)+ROW(D21))","v":"Falta preencher a linha 22"},null,null,null,null,null,null,null,null,null,null,null,null,null,null,null,null,null,null,null,null,null,null,null,null,null,null,null,null,null,null,null,null,null,null,null,null,null,null,null,null,null,null,null,"AM1ML","AMPOLA COM 1 mL"]
[null,"Nome:",null,{"$f":"IF(OFFSET(D22,0,-1)=\"\",\"◄\",\"\")","v":"◄"},null,null,null,null,null,null,null,null,null,null,null,null,null,null,null,null,null,null,null,null,null,null,null,null,null,null,null,null,null,null,null,null,null,null,null,null,null,null,null,null,null,null,null,"AM2/5ML","AMPOLA COM 2,5 mL"]
[null,"CREA/CAU:",null,"◄",null,null,null,null,null,null,null,null,null,null,null,null,null,null,null,null,null,null,null,null,null,null,null,null,null,null,null,null,null,null,null,null,null,null,null,null,null,null,null,null,null,null,null,"AM2ML","AMPOLA COM 2 mL"]
[null,"ART/RRT:",null,"◄",null,null,null,null,null,null,null,null,null,null,null,null,null,null,null,null,null,null,null,null,null,null,null,null,null,null,null,null,null,null,null,null,null,null,null,null,null,null,null,null,null,null,null,"AM3ML","AMPOLA COM 3 mL"]
[null,"Data do preenchimento:",null,"",null,null,null,null,null,null,null,null,null,null,null,null,null,null,null,null,null,null,null,null,null,null,null,null,null,null,null,null,null,null,null,null,null,null,null,null,null,null,null,null,null,null,null,"AM4ML","AMPOLA COM 4 mL"]
[null,null,null,null,null,null,null,null,null,null,null,null,null,null,null,null,null,null,null,null,null,null,null,null,null,null,null,null,null,null,null,null,null,null,null,null,null,null,null,null,null,null,null,null,null,null,null,"AM5ML","AMPOLA COM 5 mL"]
[null,"Responsável pelo Tomador (Prefeito, no caso de Municípios)",null,{"$f":"IF(COUNTIF(D28:D29,\"◄\")=0,\"\",\"Falta preencher a linha \"&MATCH(\"◄\",D28:D29,0)+ROW(D27))","v":"Falta preencher a linha 28"},null,null,null,null,null,null,null,null,null,null,null,null,null,null,null,null,null,null,null,null,null,null,null,null,null,null,null,null,null,null,null,null,null,null,null,null,null,null,null,null,null,null,null,"AM6ML","AMPOLA COM 6 mL"]
[null,"Nome:",null,{"$f":"IF(OFFSET(D28,0,-1)=\"\",\"◄\",\"\")","v":"◄"},null,null,null,null,null,null,null,null,null,null,null,null,null,null,null,null,null,null,null,null,null,null,null,null,null,null,null,null,null,null,null,null,null,null,null,null,null,null,null,null,null,null,null,"AM7ML","AMPOLA COM 7 mL"]
[null,"Cargo:",null,"◄",null,null,null,null,null,null,null,null,null,null,null,null,null,null,null,null,null,null,null,null,null,null,null,null,null,null,null,null,null,null,null,null,null,null,null,null,null,null,null,null,null,null,null,"ANO","ANO/ANOS"]
[null,null,null,null,null,null,null,null,null,null,null,null,null,null,null,null,null,null,null,null,null,null,null,null,null,null,null,null,null,null,null,null,null,null,null,null,null,null,null,null,null,null,null,null,null,null,null,"ANOS","ANO/ANOS"]
[null,"Arredondamento das frentes:","TransfereGOV",{"$f":"IF(OFFSET(D31,0,-1)=\"\",\"◄ Falta definir o método de arredondamento.\",\"\")","v":""},null,null,null,null,null,null,null,null,null,null,null,null,null,null,null,null,null,null,null,null,null,null,null,null,null,null,null,null,null,null,null,null,null,null,null,null,null,null,null,null,null,null,null,"ARR","ARROBA"]
[null,null,null,null,null,null,null,null,null,null,null,null,null,null,null,null,null,null,null,null,null,null,null,null,null,null,null,null,null,null,null,null,null,null,null,null,null,null,null,null,null,null,null,null,null,null,null,"AWG","AMERICAN WIRE GAUGE"]
[null,"B. RESULTADO DO PROCESSO LICITATÓRIO",null,null,null,null,null,null,null,null,null,null,null,null,null,null,null,null,null,null,null,null,null,null,null,null,null,null,null,null,null,null,null,null,null,null,null,null,null,null,null,null,null,null,null,null,null,"BAR","BARRIL"]
[null,null,null,null,null,null,null,null,null,null,null,null,null,null,null,null,null,null,null,null,null,null,null,null,null,null,null,null,null,null,null,null,null,null,null,null,null,null,null,null,null,null,null,null,null,null,null,"BAR.","BAR"]
[null,"Licitação",null,{"$f":"IF(COUNTIF(D36:D39,\"◄\")=0,\"\",\"Falta preencher a linha \"&MATCH(\"◄\",D36:D39,0)+ROW(D35))","v":""},null,null,null,null,null,null,null,null,null,null,null,null,null,null,null,null,null,null,null,null,null,null,null,null,null,null,null,null,null,null,null,null,null,null,null,null,null,null,null,null,null,null,null,"BD","BALDE"]
[null,"Data de emissão dos documentos de licitação:",null,{"$f":"IF(AND(TIPOORCAMENTO=\"Licitado\",OFFSET(D36,0,-1)=\"\"),\"◄\",\"\")","v":""},null,null,null,null,null,null,null,null,null,null,null,null,null,null,null,null,null,null,null,null,null,null,null,null,null,null,null,null,null,null,null,null,null,null,null,null,null,null,null,null,null,null,null,"BIS","BISNAGA"]
[null,"Nº do CTEF (contrato com empresa):",null,{"$f":"IF(AND(TIPOORCAMENTO=\"Licitado\",OFFSET(D37,0,-1)=\"\"),\"◄\",\"\")","v":""},null,null,null,null,null,null,null,null,null,null,null,null,null,null,null,null,null,null,null,null,null,null,null,null,null,null,null,null,null,null,null,null,null,null,null,null,null,null,null,null,null,null,null,"BIS/GL","BISNAGA POR GALÃO"]
[null,"Nome da empresa:",null,{"$f":"IF(AND(TIPOORCAMENTO=\"Licitado\",OFFSET(D38,0,-1)=\"\"),\"◄\",\"\")","v":""},null,null,null,null,null,null,null,null,null,null,null,null,null,null,null,null,null,null,null,null,null,null,null,null,null,null,null,null,null,null,null,null,null,null,null,null,null,null,null,null,null,null,null,"BIS1/65G","BISNAGA COM 1,65 g"]
[null,"CNPJ da empresa:",null,{"$f":"IF(AND(TIPOORCAMENTO=\"Licitado\",OFFSET(D39,0,-1)=\"\"),\"◄\",\"\")","v":""},null,null,null,null,null,null,null,null,null,null,null,null,null,null,null,null,null,null,null,null,null,null,null,null,null,null,null,null,null,null,null,null,null,null,null,null,null,null,null,null,null,null,null,"BIS1/8G","BISNAGA COM 1,8 g"]
[null,"Regime de execução do CTEF:","(SELECIONAR)",{"$f":"IF(AND(TIPOORCAMENTO=\"Licitado\",OR(OFFSET(D40,0,-1)=\"\",OFFSET(D40,0,-1)=\"(SELECIONAR)\")),\"◄\",\"\")","v":""},null,null,null,null,null,null,null,null,null,null,null,null,null,null,null,null,null,null,null,null,null,null,null,null,null,null,null,null,null,null,null,null,null,null,null,null,null,null,null,null,null,null,null,"BIS100G","BISNAGA COM 100 g"]
[null,"Data base do CTEF:",null,{"$f":"IF(AND(TIPOORCAMENTO=\"Licitado\",OFFSET(D41,0,-1)=\"\"),\"◄\",\"\")","v":""},null,null,null,null,null,null,null,null,null,null,null,null,null,null,null,null,null,null,null,null,null,null,null,null,null,null,null,null,null,null,null,null,null,null,null,null,null,null,null,null,null,null,null,"BIS10G","BISNAGA COM 10 g"]
[null,null,null,null,null,null,null,null,null,null,null,null,null,null,null,null,null,null,null,null,null,null,null,null,null,null,null,null,null,null,null,null,null,null,null,null,null,null,null,null,null,null,null,null,null,null,null,"BIS135G","BISNAGA COM 135 g"]
[null,null,null,null,null,null,null,null,null,null,null,null,null,null,null,null,null,null,null,null,null,null,null,null,null,null,null,null,null,null,null,null,null,null,null,null,null,null,null,null,null,null,null,null,null,null,null,"BIS13G","BISNAGA COM 13 g"]
[null,"C. ACOMPANHAMENTO DO EMPREENDIMENTO",null,null,null,null,null,null,null,null,null,null,null,null,null,null,null,null,null,null,null,null,null,null,null,null,null,null,null,null,null,null,null,null,null,null,null,null,null,null,null,null,null,null,null,null,null,"BIS14G","BISNAGA COM 14 g"]
[null,null,null,null,null,null,null,null,null,null,null,null,null,null,null,null,null,null,null,null,null,null,null,null,null,null,null,null,null,null,null,null,null,null,null,null,null,null,null,null,null,null,null,null,null,null,null,"BIS15G","BISNAGA COM 15 g"]
[null,"Dados da obra",null,{"$f":"IF(COUNTIF(D47:D48,\"◄\")=0,\"\",\"Falta preencher a linha \"&MATCH(\"◄\",D47:D48,0)+ROW(D46))","v":""},null,null,null,null,null,null,null,null,null,null,null,null,null,null,null,null,null,null,null,null,null,null,null,null,null,null,null,null,null,null,null,null,null,null,null,null,null,null,null,null,null,null,null,"BIS1G","BISNAGA COM 1 g"]
[null,"Data do Início da Obra:",null,{"$f":"IF(AND(TIPOORCAMENTO=\"Licitado\",OFFSET(D47,0,-1)=\"\",IFERROR(RRE!$O$28,0)>0),\"◄\",\"\")","v":""},null,null,null,null,null,null,null,null,null,null,null,null,null,null,null,null,null,null,null,null,null,null,null,null,null,null,null,null,null,null,null,null,null,null,null,null,null,null,null,null,null,null,null,"BIS20G","BISNAGA COM 20 g"]
[null,"Data de fechamento do RRE:",null,{"$f":"IF(AND(TIPOORCAMENTO=\"Licitado\",OFFSET(D48,0,-1)=\"\",IFERROR(RRE!$O$28,0)>0),\"◄\",\"\")","v":""},null,null,null,null,null,null,null,null,null,null,null,null,null,null,null,null,null,null,null,null,null,null,null,null,null,null,null,null,null,null,null,null,null,null,null,null,null,null,null,null,null,null,null,"BIS25G","BISNAGA COM 25 g"]
[null,null,null,null,null,null,null,null,null,null,null,null,null,null,null,null,null,null,null,null,null,null,null,null,null,null,null,null,null,null,null,null,null,null,null,null,null,null,null,null,null,null,null,null,null,null,null,"BIS28/8G","BISNAGA COM 28,8 g"]
[null,"Responsável pela Fiscalização",null,{"$f":"IF(COUNTIF(D51:D54,\"◄\")=0,\"\",\"Falta preencher a linha \"&MATCH(\"◄\",D51:D54,0)+ROW(D50))","v":""},null,null,null,null,null,null,null,null,null,null,null,null,null,null,null,null,null,null,null,null,null,null,null,null,null,null,null,null,null,null,null,null,null,null,null,null,null,null,null,null,null,null,null,"BIS28G","BISNAGA COM 28 g"]
[null,"Nome:",null,{"$f":"IF(AND(TIPOORCAMENTO=\"Licitado\",OFFSET(D51,0,-1)=\"\",IFERROR(RRE!$O$28,0)>0),\"◄\",\"\")","v":""},null,null,null,null,null,null,null,null,null,null,null,null,null,null,null,null,null,null,null,null,null,null,null,null,null,null,null,null,null,null,null,null,null,null,null,null,null,null,null,null,null,null,null,"BIS2G","BISNAGA COM 2 g"]
[null,"Profissão:",null,{"$f":"IF(AND(TIPOORCAMENTO=\"Licitado\",OFFSET(D52,0,-1)=\"\",IFERROR(RRE!$O$28,0)>0),\"◄\",\"\")","v":""},null,null,null,null,null,null,null,null,null,null,null,null,null,null,null,null,null,null,null,null,null,null,null,null,null,null,null,null,null,null,null,null,null,null,null,null,null,null,null,null,null,null,null,"BIS3/5G","BISNAGA COM 3,5 g"]
[null,"CREA/CAU (para obras/projetos):",null,{"$f":"IF(AND(TIPOORCAMENTO=\"Licitado\",OFFSET(D53,0,-1)=\"\",IFERROR(RRE!$O$28,0)>0),\"◄\",\"\")","v":""},null,null,null,null,null,null,null,null,null,null,null,null,null,null,null,null,null,null,null,null,null,null,null,null,null,null,null,null,null,null,null,null,null,null,null,null,null,null,null,null,null,null,null,"BIS30G","BISNAGA COM 30 g"]
[null,"ART/RRT (para obras/projetos):",null,{"$f":"IF(AND(TIPOORCAMENTO=\"Licitado\",OFFSET(D54,0,-1)=\"\",IFERROR(RRE!$O$28,0)>0),\"◄\",\"\")","v":""},null,null,null,null,null,null,null,null,null,null,null,null,null,null,null,null,null,null,null,null,null,null,null,null,null,null,null,null,null,null,null,null,null,null,null,null,null,null,null,null,null,null,null,"BIS30ML","BISNAGA COM 30 mL"]
[null,null,null,null,null,null,null,null,null,null,null,null,null,null,null,null,null,null,null,null,null,null,null,null,null,null,null,null,null,null,null,null,null,null,null,null,null,null,null,null,null,null,null,null,null,null,null,"BIS40G","BISNAGA COM 40 g"]
[null,null,null,null,null,null,null,null,null,null,null,null,null,null,null,null,null,null,null,null,null,null,null,null,null,null,null,null,null,null,null,null,null,null,null,null,null,null,null,null,null,null,null,null,null,null,null,"BIS43G","BISNAGA COM 43 g"]
[null,"D. ACOMPANHAMENTO CAIXA",null,null,null,null,null,null,null,null,null,null,null,null,null,null,null,null,null,null,null,null,null,null,null,null,null,null,null,null,null,null,null,null,null,null,null,null,null,null,null,null,null,null,null,null,null,"BIS45G","BISNAGA COM 45 g"]
[null,null,null,null,null,null,null,null,null,null,null,null,null,null,null,null,null,null,null,null,null,null,null,null,null,null,null,null,null,null,null,null,null,null,null,null,null,null,null,null,null,null,null,null,null,null,null,"BIS47G","BISNAGA COM 47 g"]
[null,"Responsável Gerencial",null,null,null,null,null,null,null,null,null,null,null,null,null,null,null,null,null,null,null,null,null,null,null,null,null,null,null,null,null,null,null,null,null,null,null,null,null,null,null,null,null,null,null,null,null,"BIS4G","BISNAGA COM 4 g"]
[null,"Nome:",null,null,null,null,null,null,null,null,null,null,null,null,null,null,null,null,null,null,null,null,null,null,null,null,null,null,null,null,null,null,null,null,null,null,null,null,null,null,null,null,null,null,null,null,null,"BIS50G","BISNAGA COM 50 g"]
[null,"Função:",null,null,null,null,null,null,null,null,null,null,null,null,null,null,null,null,null,null,null,null,null,null,null,null,null,null,null,null,null,null,null,null,null,null,null,null,null,null,null,null,null,null,null,null,null,"BIS55G","BISNAGA COM 55 g"]
[null,null,null,null,null,null,null,null,null,null,null,null,null,null,null,null,null,null,null,null,null,null,null,null,null,null,null,null,null,null,null,null,null,null,null,null,null,null,null,null,null,null,null,null,null,null,null,"BIS56G","BISNAGA COM 56 g"]
[null,null,null,null,null,null,null,null,null,null,null,null,null,null,null,null,null,null,null,null,null,null,null,null,null,null,null,null,null,null,null,null,null,null,null,null,null,null,null,null,null,null,null,null,null,null,null,"BIS5G","BISNAGA COM 5 g"]
[null,null,null,null,null,null,null,null,null,null,null,null,null,null,null,null,null,null,null,null,null,null,null,null,null,null,null,null,null,null,null,null,null,null,null,null,null,null,null,null,null,null,null,null,null,null,null,"BIS60G","BISNAGA COM 60 g"]
[null,null,null,null,null,null,null,null,null,null,null,null,null,null,null,null,null,null,null,null,null,null,null,null,null,null,null,null,null,null,null,null,null,null,null,null,null,null,null,null,null,null,null,null,null,null,null,"BIS6G","BISNAGA COM 6 g"]
[null,null,null,null,null,null,null,null,null,null,null,null,null,null,null,null,null,null,null,null,null,null,null,null,null,null,null,null,null,null,null,null,null,null,null,null,null,null,null,null,null,null,null,null,null,null,null,"BIS7/5G","BISNAGA COM 7,5 g"]
[null,null,null,null,null,null,null,null,null,null,null,null,null,null,null,null,null,null,null,null,null,null,null,null,null,null,null,null,null,null,null,null,null,null,null,null,null,null,null,null,null,null,null,null,null,null,null,"BIS70G","BISNAGA COM 70 g"]
[null,null,null,null,null,null,null,null,null,null,null,null,null,null,null,null,null,null,null,null,null,null,null,null,null,null,null,null,null,null,null,null,null,null,null,null,null,null,null,null,null,null,null,null,null,null,null,"BIS80G","BISNAGA COM 80 g"]
[null,null,null,null,null,null,null,null,null,null,null,null,null,null,null,null,null,null,null,null,null,null,null,null,null,null,null,null,null,null,null,null,null,null,null,null,null,null,null,null,null,null,null,null,null,null,null,"BIS90G","BISNAGA COM 90 g"]
[null,null,null,null,null,null,null,null,null,null,null,null,null,null,null,null,null,null,null,null,null,null,null,null,null,null,null,null,null,null,null,null,null,null,null,null,null,null,null,null,null,null,null,null,null,null,null,"BIT","BITS"]
[null,null,null,null,null,null,null,null,null,null,null,null,null,null,null,null,null,null,null,null,null,null,null,null,null,null,null,null,null,null,null,null,null,null,null,null,null,null,null,null,null,null,null,null,null,null,null,"BL","BLOCO"]
[null,null,null,null,null,null,null,null,null,null,null,null,null,null,null,null,null,null,null,null,null,null,null,null,null,null,null,null,null,null,null,null,null,null,null,null,null,null,null,null,null,null,null,null,null,null,null,"BLIS","BLISTER"]
[null,null,null,null,null,null,null,null,null,null,null,null,null,null,null,null,null,null,null,null,null,null,null,null,null,null,null,null,null,null,null,null,null,null,null,null,null,null,null,null,null,null,null,null,null,null,null,"BLIS21CP","BLISTER COM 21 COMPRIMIDOS"]
[null,null,null,null,null,null,null,null,null,null,null,null,null,null,null,null,null,null,null,null,null,null,null,null,null,null,null,null,null,null,null,null,null,null,null,null,null,null,null,null,null,null,null,null,null,null,null,"BLIS35CP","BLISTER COM 35 COMPRIMIDOS"]
[null,null,null,null,null,null,null,null,null,null,null,null,null,null,null,null,null,null,null,null,null,null,null,null,null,null,null,null,null,null,null,null,null,null,null,null,null,null,null,null,null,null,null,null,null,null,null,"BOB","BOBINA"]
[null,null,null,null,null,null,null,null,null,null,null,null,null,null,null,null,null,null,null,null,null,null,null,null,null,null,null,null,null,null,null,null,null,null,null,null,null,null,null,null,null,null,null,null,null,null,null,"BOL","BOLSA"]
[null,null,null,null,null,null,null,null,null,null,null,null,null,null,null,null,null,null,null,null,null,null,null,null,null,null,null,null,null,null,null,null,null,null,null,null,null,null,null,null,null,null,null,null,null,null,null,"BOM","BOMBONA"]
[null,null,null,null,null,null,null,null,null,null,null,null,null,null,null,null,null,null,null,null,null,null,null,null,null,null,null,null,null,null,null,null,null,null,null,null,null,null,null,null,null,null,null,null,null,null,null,"BPM","BATIDA POR MINUTO"]
[null,null,null,null,null,null,null,null,null,null,null,null,null,null,null,null,null,null,null,null,null,null,null,null,null,null,null,null,null,null,null,null,null,null,null,null,null,null,null,null,null,null,null,null,null,null,null,"BPS","BYTE POR SEGUNDO"]
[null,null,null,null,null,null,null,null,null,null,null,null,null,null,null,null,null,null,null,null,null,null,null,null,null,null,null,null,null,null,null,null,null,null,null,null,null,null,null,null,null,null,null,null,null,null,null,"BR","BARRA"]
[null,null,null,null,null,null,null,null,null,null,null,null,null,null,null,null,null,null,null,null,null,null,null,null,null,null,null,null,null,null,null,null,null,null,null,null,null,null,null,null,null,null,null,null,null,null,null,"BRI","BARRICA"]
[null,null,null,null,null,null,null,null,null,null,null,null,null,null,null,null,null,null,null,null,null,null,null,null,null,null,null,null,null,null,null,null,null,null,null,null,null,null,null,null,null,null,null,null,null,null,null,"BTJ","BOTIJÃO"]
[null,null,null,null,null,null,null,null,null,null,null,null,null,null,null,null,null,null,null,null,null,null,null,null,null,null,null,null,null,null,null,null,null,null,null,null,null,null,null,null,null,null,null,null,null,null,null,"BTU","BRITISH THERMAL UNIT"]
[null,null,null,null,null,null,null,null,null,null,null,null,null,null,null,null,null,null,null,null,null,null,null,null,null,null,null,null,null,null,null,null,null,null,null,null,null,null,null,null,null,null,null,null,null,null,null,"BTU/H","BTU POR HORA"]
[null,null,null,null,null,null,null,null,null,null,null,null,null,null,null,null,null,null,null,null,null,null,null,null,null,null,null,null,null,null,null,null,null,null,null,null,null,null,null,null,null,null,null,null,null,null,null,"BWG","FIEIRA DE BIRMINGHAN"]
[null,null,null,null,null,null,null,null,null,null,null,null,null,null,null,null,null,null,null,null,null,null,null,null,null,null,null,null,null,null,null,null,null,null,null,null,null,null,null,null,null,null,null,null,null,null,null,"C","CENTENA"]
[null,null,null,null,null,null,null,null,null,null,null,null,null,null,null,null,null,null,null,null,null,null,null,null,null,null,null,null,null,null,null,null,null,null,null,null,null,null,null,null,null,null,null,null,null,null,null,"CA","CARTUCHO"]
[null,null,null,null,null,null,null,null,null,null,null,null,null,null,null,null,null,null,null,null,null,null,null,null,null,null,null,null,null,null,null,null,null,null,null,null,null,null,null,null,null,null,null,null,null,null,null,"CAD","CADERNO"]
[null,null,null,null,null,null,null,null,null,null,null,null,null,null,null,null,null,null,null,null,null,null,null,null,null,null,null,null,null,null,null,null,null,null,null,null,null,null,null,null,null,null,null,null,null,null,null,"CAL/G","CALORIA/GRAMA"]
[null,null,null,null,null,null,null,null,null,null,null,null,null,null,null,null,null,null,null,null,null,null,null,null,null,null,null,null,null,null,null,null,null,null,null,null,null,null,null,null,null,null,null,null,null,null,null,"CAPS","CÁPSULA"]
[null,null,null,null,null,null,null,null,null,null,null,null,null,null,null,null,null,null,null,null,null,null,null,null,null,null,null,null,null,null,null,null,null,null,null,null,null,null,null,null,null,null,null,null,null,null,null,"CAR","CARACTER"]
[null,null,null,null,null,null,null,null,null,null,null,null,null,null,null,null,null,null,null,null,null,null,null,null,null,null,null,null,null,null,null,null,null,null,null,null,null,null,null,null,null,null,null,null,null,null,null,"CC","CILINDRADA"]
[null,null,null,null,null,null,null,null,null,null,null,null,null,null,null,null,null,null,null,null,null,null,null,null,null,null,null,null,null,null,null,null,null,null,null,null,null,null,null,null,null,null,null,null,null,null,null,"CD","CANDELA"]
[null,null,null,null,null,null,null,null,null,null,null,null,null,null,null,null,null,null,null,null,null,null,null,null,null,null,null,null,null,null,null,null,null,null,null,null,null,null,null,null,null,null,null,null,null,null,null,"CD/M2","CANDELA/METRO 2"]
[null,null,null,null,null,null,null,null,null,null,null,null,null,null,null,null,null,null,null,null,null,null,null,null,null,null,null,null,null,null,null,null,null,null,null,null,null,null,null,null,null,null,null,null,null,null,null,"CENTO","CENTO"]
[null,null,null,null,null,null,null,null,null,null,null,null,null,null,null,null,null,null,null,null,null,null,null,null,null,null,null,null,null,null,null,null,null,null,null,null,null,null,null,null,null,null,null,null,null,null,null,"CG","CENTIGRAMA"]
[null,null,null,null,null,null,null,null,null,null,null,null,null,null,null,null,null,null,null,null,null,null,null,null,null,null,null,null,null,null,null,null,null,null,null,null,null,null,null,null,null,null,null,null,null,null,null,"CH","CHAPA"]
[null,null,null,null,null,null,null,null,null,null,null,null,null,null,null,null,null,null,null,null,null,null,null,null,null,null,null,null,null,null,null,null,null,null,null,null,null,null,null,null,null,null,null,null,null,null,null,"CHI","CHI"]
[null,null,null,null,null,null,null,null,null,null,null,null,null,null,null,null,null,null,null,null,null,null,null,null,null,null,null,null,null,null,null,null,null,null,null,null,null,null,null,null,null,null,null,null,null,null,null,"CHP","CHP"]
[null,null,null,null,null,null,null,null,null,null,null,null,null,null,null,null,null,null,null,null,null,null,null,null,null,null,null,null,null,null,null,null,null,null,null,null,null,null,null,null,null,null,null,null,null,null,null,"CHP","CHP"]
[null,null,null,null,null,null,null,null,null,null,null,null,null,null,null,null,null,null,null,null,null,null,null,null,null,null,null,null,null,null,null,null,null,null,null,null,null,null,null,null,null,null,null,null,null,null,null,"CI","CURIE"]
[null,null,null,null,null,null,null,null,null,null,null,null,null,null,null,null,null,null,null,null,null,null,null,null,null,null,null,null,null,null,null,null,null,null,null,null,null,null,null,null,null,null,null,null,null,null,null,"CIL","CILINDRO"]
[null,null,null,null,null,null,null,null,null,null,null,null,null,null,null,null,null,null,null,null,null,null,null,null,null,null,null,null,null,null,null,null,null,null,null,null,null,null,null,null,null,null,null,null,null,null,null,"CIN","CINQUENTA"]
[null,null,null,null,null,null,null,null,null,null,null,null,null,null,null,null,null,null,null,null,null,null,null,null,null,null,null,null,null,null,null,null,null,null,null,null,null,null,null,null,null,null,null,null,null,null,null,"CJ","CONJUNTO"]
[null,null,null,null,null,null,null,null,null,null,null,null,null,null,null,null,null,null,null,null,null,null,null,null,null,null,null,null,null,null,null,null,null,null,null,null,null,null,null,null,null,null,null,null,null,null,null,"CL","CENTILITRO"]
[null,null,null,null,null,null,null,null,null,null,null,null,null,null,null,null,null,null,null,null,null,null,null,null,null,null,null,null,null,null,null,null,null,null,null,null,null,null,null,null,null,null,null,null,null,null,null,"CM","CENTÍMETRO"]
[null,null,null,null,null,null,null,null,null,null,null,null,null,null,null,null,null,null,null,null,null,null,null,null,null,null,null,null,null,null,null,null,null,null,null,null,null,null,null,null,null,null,null,null,null,null,null,"CM/POL","CENTÍMETRO/POLEGADA"]
[null,null,null,null,null,null,null,null,null,null,null,null,null,null,null,null,null,null,null,null,null,null,null,null,null,null,null,null,null,null,null,null,null,null,null,null,null,null,null,null,null,null,null,null,null,null,null,"CM2","CENTIMETRO QUADRADO"]
[null,null,null,null,null,null,null,null,null,null,null,null,null,null,null,null,null,null,null,null,null,null,null,null,null,null,null,null,null,null,null,null,null,null,null,null,null,null,null,null,null,null,null,null,null,null,null,"CM2/H","CENT.QUAD/HORA"]
[null,null,null,null,null,null,null,null,null,null,null,null,null,null,null,null,null,null,null,null,null,null,null,null,null,null,null,null,null,null,null,null,null,null,null,null,null,null,null,null,null,null,null,null,null,null,null,"CM2/M","CENT.QUADRADO/METRO"]
[null,null,null,null,null,null,null,null,null,null,null,null,null,null,null,null,null,null,null,null,null,null,null,null,null,null,null,null,null,null,null,null,null,null,null,null,null,null,null,null,null,null,null,null,null,null,null,"CM3","CENTÍMETRO CÚBICO"]
[null,null,null,null,null,null,null,null,null,null,null,null,null,null,null,null,null,null,null,null,null,null,null,null,null,null,null,null,null,null,null,null,null,null,null,null,null,null,null,null,null,null,null,null,null,null,null,"CM³/H","CENT.CÚBICO POR HORA"]
[null,null,null,null,null,null,null,null,null,null,null,null,null,null,null,null,null,null,null,null,null,null,null,null,null,null,null,null,null,null,null,null,null,null,null,null,null,null,null,null,null,null,null,null,null,null,null,"CM³/MIN","CM³/MINUTO"]
[null,null,null,null,null,null,null,null,null,null,null,null,null,null,null,null,null,null,null,null,null,null,null,null,null,null,null,null,null,null,null,null,null,null,null,null,null,null,null,null,null,null,null,null,null,null,null,"CNT","RECIPIENTE"]
[null,null,null,null,null,null,null,null,null,null,null,null,null,null,null,null,null,null,null,null,null,null,null,null,null,null,null,null,null,null,null,null,null,null,null,null,null,null,null,null,null,null,null,null,null,null,null,"CO","CONTEINER"]
[null,null,null,null,null,null,null,null,null,null,null,null,null,null,null,null,null,null,null,null,null,null,null,null,null,null,null,null,null,null,null,null,null,null,null,null,null,null,null,null,null,null,null,null,null,null,null,"COL","COLEÇÃO"]
[null,null,null,null,null,null,null,null,null,null,null,null,null,null,null,null,null,null,null,null,null,null,null,null,null,null,null,null,null,null,null,null,null,null,null,null,null,null,null,null,null,null,null,null,null,null,null,"COMP","COMPRIMENTO"]
[null,null,null,null,null,null,null,null,null,null,null,null,null,null,null,null,null,null,null,null,null,null,null,null,null,null,null,null,null,null,null,null,null,null,null,null,null,null,null,null,null,null,null,null,null,null,null,"COMPR","COMPRIMIDO"]
[null,null,null,null,null,null,null,null,null,null,null,null,null,null,null,null,null,null,null,null,null,null,null,null,null,null,null,null,null,null,null,null,null,null,null,null,null,null,null,null,null,null,null,null,null,null,null,"CÓPIA","CÓPIA"]
[null,null,null,null,null,null,null,null,null,null,null,null,null,null,null,null,null,null,null,null,null,null,null,null,null,null,null,null,null,null,null,null,null,null,null,null,null,null,null,null,null,null,null,null,null,null,null,"COPO","COPO"]
[null,null,null,null,null,null,null,null,null,null,null,null,null,null,null,null,null,null,null,null,null,null,null,null,null,null,null,null,null,null,null,null,null,null,null,null,null,null,null,null,null,null,null,null,null,null,null,"CP","CENTIPOISE"]
[null,null,null,null,null,null,null,null,null,null,null,null,null,null,null,null,null,null,null,null,null,null,null,null,null,null,null,null,null,null,null,null,null,null,null,null,null,null,null,null,null,null,null,null,null,null,null,"CPL","CARACTERES POR LINHA"]
[null,null,null,null,null,null,null,null,null,null,null,null,null,null,null,null,null,null,null,null,null,null,null,null,null,null,null,null,null,null,null,null,null,null,null,null,null,null,null,null,null,null,null,null,null,null,null,"CPM","CÓPIA POR MINUTO"]
[null,null,null,null,null,null,null,null,null,null,null,null,null,null,null,null,null,null,null,null,null,null,null,null,null,null,null,null,null,null,null,null,null,null,null,null,null,null,null,null,null,null,null,null,null,null,null,"CPS","CARACTER POR SEGUNDO"]
[null,null,null,null,null,null,null,null,null,null,null,null,null,null,null,null,null,null,null,null,null,null,null,null,null,null,null,null,null,null,null,null,null,null,null,null,null,null,null,null,null,null,null,null,null,null,null,"CRT","CARRETEL"]
[null,null,null,null,null,null,null,null,null,null,null,null,null,null,null,null,null,null,null,null,null,null,null,null,null,null,null,null,null,null,null,null,null,null,null,null,null,null,null,null,null,null,null,null,null,null,null,"CS","GRADEADO DE JAULA"]
[null,null,null,null,null,null,null,null,null,null,null,null,null,null,null,null,null,null,null,null,null,null,null,null,null,null,null,null,null,null,null,null,null,null,null,null,null,null,null,null,null,null,null,null,null,null,null,"CST","CENTISTOCKS"]
[null,null,null,null,null,null,null,null,null,null,null,null,null,null,null,null,null,null,null,null,null,null,null,null,null,null,null,null,null,null,null,null,null,null,null,null,null,null,null,null,null,null,null,null,null,null,null,"CT","CARTAO"]
[null,null,null,null,null,null,null,null,null,null,null,null,null,null,null,null,null,null,null,null,null,null,null,null,null,null,null,null,null,null,null,null,null,null,null,null,null,null,null,null,null,null,null,null,null,null,null,"CTE","CARTELA"]
[null,null,null,null,null,null,null,null,null,null,null,null,null,null,null,null,null,null,null,null,null,null,null,null,null,null,null,null,null,null,null,null,null,null,null,null,null,null,null,null,null,null,null,null,null,null,null,"CV","CAVALO VAPOR"]
[null,null,null,null,null,null,null,null,null,null,null,null,null,null,null,null,null,null,null,null,null,null,null,null,null,null,null,null,null,null,null,null,null,null,null,null,null,null,null,null,null,null,null,null,null,null,null,"CX","CAIXA"]
[null,null,null,null,null,null,null,null,null,null,null,null,null,null,null,null,null,null,null,null,null,null,null,null,null,null,null,null,null,null,null,null,null,null,null,null,null,null,null,null,null,null,null,null,null,null,null,"CX100UN","CAIXA COM 100 UNIDADES"]
[null,null,null,null,null,null,null,null,null,null,null,null,null,null,null,null,null,null,null,null,null,null,null,null,null,null,null,null,null,null,null,null,null,null,null,null,null,null,null,null,null,null,null,null,null,null,null,"CX40UN","CAIXA COM 40 UNIDADES"]
[null,null,null,null,null,null,null,null,null,null,null,null,null,null,null,null,null,null,null,null,null,null,null,null,null,null,null,null,null,null,null,null,null,null,null,null,null,null,null,null,null,null,null,null,null,null,null,"D","DIA"]
[null,null,null,null,null,null,null,null,null,null,null,null,null,null,null,null,null,null,null,null,null,null,null,null,null,null,null,null,null,null,null,null,null,null,null,null,null,null,null,null,null,null,null,null,null,null,null,"DAG","DECAGRAMA"]
[null,null,null,null,null,null,null,null,null,null,null,null,null,null,null,null,null,null,null,null,null,null,null,null,null,null,null,null,null,null,null,null,null,null,null,null,null,null,null,null,null,null,null,null,null,null,null,"DAL","DECALITRO"]
[null,null,null,null,null,null,null,null,null,null,null,null,null,null,null,null,null,null,null,null,null,null,null,null,null,null,null,null,null,null,null,null,null,null,null,null,null,null,null,null,null,null,null,null,null,null,null,"DAM","DECAMETRO"]
[null,null,null,null,null,null,null,null,null,null,null,null,null,null,null,null,null,null,null,null,null,null,null,null,null,null,null,null,null,null,null,null,null,null,null,null,null,null,null,null,null,null,null,null,null,null,null,"DAN","DECANEWTON"]
[null,null,null,null,null,null,null,null,null,null,null,null,null,null,null,null,null,null,null,null,null,null,null,null,null,null,null,null,null,null,null,null,null,null,null,null,null,null,null,null,null,null,null,null,null,null,null,"DB","DECIBEL"]
[null,null,null,null,null,null,null,null,null,null,null,null,null,null,null,null,null,null,null,null,null,null,null,null,null,null,null,null,null,null,null,null,null,null,null,null,null,null,null,null,null,null,null,null,null,null,null,"DBM","DECIBEL MILIWATT"]
[null,null,null,null,null,null,null,null,null,null,null,null,null,null,null,null,null,null,null,null,null,null,null,null,null,null,null,null,null,null,null,null,null,null,null,null,null,null,null,null,null,null,null,null,null,null,null,"DG","DECIGRAMA"]
[null,null,null,null,null,null,null,null,null,null,null,null,null,null,null,null,null,null,null,null,null,null,null,null,null,null,null,null,null,null,null,null,null,null,null,null,null,null,null,null,null,null,null,null,null,null,null,"DGT","DÍGITO"]
[null,null,null,null,null,null,null,null,null,null,null,null,null,null,null,null,null,null,null,null,null,null,null,null,null,null,null,null,null,null,null,null,null,null,null,null,null,null,null,null,null,null,null,null,null,null,null,"DIA","DIA"]
[null,null,null,null,null,null,null,null,null,null,null,null,null,null,null,null,null,null,null,null,null,null,null,null,null,null,null,null,null,null,null,null,null,null,null,null,null,null,null,null,null,null,null,null,null,null,null,"DIAS","DIAS"]
[null,null,null,null,null,null,null,null,null,null,null,null,null,null,null,null,null,null,null,null,null,null,null,null,null,null,null,null,null,null,null,null,null,null,null,null,null,null,null,null,null,null,null,null,null,null,null,"DISCO","DISCO"]
[null,null,null,null,null,null,null,null,null,null,null,null,null,null,null,null,null,null,null,null,null,null,null,null,null,null,null,null,null,null,null,null,null,null,null,null,null,null,null,null,null,null,null,null,null,null,null,"DL","DECALITRO"]
[null,null,null,null,null,null,null,null,null,null,null,null,null,null,null,null,null,null,null,null,null,null,null,null,null,null,null,null,null,null,null,null,null,null,null,null,null,null,null,null,null,null,null,null,null,null,null,"DM","DECIMETRO"]
[null,null,null,null,null,null,null,null,null,null,null,null,null,null,null,null,null,null,null,null,null,null,null,null,null,null,null,null,null,null,null,null,null,null,null,null,null,null,null,null,null,null,null,null,null,null,null,"DM2","DECIMETRO QUADRADO"]
[null,null,null,null,null,null,null,null,null,null,null,null,null,null,null,null,null,null,null,null,null,null,null,null,null,null,null,null,null,null,null,null,null,null,null,null,null,null,null,null,null,null,null,null,null,null,null,"DM3","DECIMETRO CUBICO"]
[null,null,null,null,null,null,null,null,null,null,null,null,null,null,null,null,null,null,null,null,null,null,null,null,null,null,null,null,null,null,null,null,null,null,null,null,null,null,null,null,null,null,null,null,null,null,null,"DM3","DECIMETRO CUBICO"]
[null,null,null,null,null,null,null,null,null,null,null,null,null,null,null,null,null,null,null,null,null,null,null,null,null,null,null,null,null,null,null,null,null,null,null,null,null,null,null,null,null,null,null,null,null,null,null,"DOSES","DOSES"]
[null,null,null,null,null,null,null,null,null,null,null,null,null,null,null,null,null,null,null,null,null,null,null,null,null,null,null,null,null,null,null,null,null,null,null,null,null,null,null,null,null,null,null,null,null,null,null,"DPI","PONTOS DE DEFINIÇÃO"]
[null,null,null,null,null,null,null,null,null,null,null,null,null,null,null,null,null,null,null,null,null,null,null,null,null,null,null,null,null,null,null,null,null,null,null,null,null,null,null,null,null,null,null,null,null,null,null,"DPT","DIOPTRIA"]
[null,null,null,null,null,null,null,null,null,null,null,null,null,null,null,null,null,null,null,null,null,null,null,null,null,null,null,null,null,null,null,null,null,null,null,null,null,null,null,null,null,null,null,null,null,null,null,"DRAG","DRÁGEA"]
[null,null,null,null,null,null,null,null,null,null,null,null,null,null,null,null,null,null,null,null,null,null,null,null,null,null,null,null,null,null,null,null,null,null,null,null,null,null,null,null,null,null,null,null,null,null,null,"DZ","DUZIA"]
[null,null,null,null,null,null,null,null,null,null,null,null,null,null,null,null,null,null,null,null,null,null,null,null,null,null,null,null,null,null,null,null,null,null,null,null,null,null,null,null,null,null,null,null,null,null,null,"EMB","EMBALAGEM"]
[null,null,null,null,null,null,null,null,null,null,null,null,null,null,null,null,null,null,null,null,null,null,null,null,null,null,null,null,null,null,null,null,null,null,null,null,null,null,null,null,null,null,null,null,null,null,null,"EMB/H","EMBALAGEM POR HORA"]
[null,null,null,null,null,null,null,null,null,null,null,null,null,null,null,null,null,null,null,null,null,null,null,null,null,null,null,null,null,null,null,null,null,null,null,null,null,null,null,null,null,null,null,null,null,null,null,"EMP","EMPLASTRO"]
[null,null,null,null,null,null,null,null,null,null,null,null,null,null,null,null,null,null,null,null,null,null,null,null,null,null,null,null,null,null,null,null,null,null,null,null,null,null,null,null,null,null,null,null,null,null,null,"ENV","ENVELOPE"]
[null,null,null,null,null,null,null,null,null,null,null,null,null,null,null,null,null,null,null,null,null,null,null,null,null,null,null,null,null,null,null,null,null,null,null,null,null,null,null,null,null,null,null,null,null,null,null,"ENV27/9G","ENVELOPE COM 27,9 g"]
[null,null,null,null,null,null,null,null,null,null,null,null,null,null,null,null,null,null,null,null,null,null,null,null,null,null,null,null,null,null,null,null,null,null,null,null,null,null,null,null,null,null,null,null,null,null,null,"ENV30G","ENVELOPE COM 30 g"]
[null,null,null,null,null,null,null,null,null,null,null,null,null,null,null,null,null,null,null,null,null,null,null,null,null,null,null,null,null,null,null,null,null,null,null,null,null,null,null,null,null,null,null,null,null,null,null,"EQP","EQUIPAMENTO"]
[null,null,null,null,null,null,null,null,null,null,null,null,null,null,null,null,null,null,null,null,null,null,null,null,null,null,null,null,null,null,null,null,null,null,null,null,null,null,null,null,null,null,null,null,null,null,null,"EST","ESTUDANTE"]
[null,null,null,null,null,null,null,null,null,null,null,null,null,null,null,null,null,null,null,null,null,null,null,null,null,null,null,null,null,null,null,null,null,null,null,null,null,null,null,null,null,null,null,null,null,null,null,"EV","ELÉTRON-VOLT"]
[null,null,null,null,null,null,null,null,null,null,null,null,null,null,null,null,null,null,null,null,null,null,null,null,null,null,null,null,null,null,null,null,null,null,null,null,null,null,null,null,null,null,null,null,null,null,null,"F","FARAD"]
[null,null,null,null,null,null,null,null,null,null,null,null,null,null,null,null,null,null,null,null,null,null,null,null,null,null,null,null,null,null,null,null,null,null,null,null,null,null,null,null,null,null,null,null,null,null,null,"FCK","FCK"]
[null,null,null,null,null,null,null,null,null,null,null,null,null,null,null,null,null,null,null,null,null,null,null,null,null,null,null,null,null,null,null,null,null,null,null,null,null,null,null,null,null,null,null,null,null,null,null,"FD","FARDO"]
[null,null,null,null,null,null,null,null,null,null,null,null,null,null,null,null,null,null,null,null,null,null,null,null,null,null,null,null,null,null,null,null,null,null,null,null,null,null,null,null,null,null,null,null,null,null,null,"FL","FOLHA"]
[null,null,null,null,null,null,null,null,null,null,null,null,null,null,null,null,null,null,null,null,null,null,null,null,null,null,null,null,null,null,null,null,null,null,null,null,null,null,null,null,null,null,null,null,null,null,null,"FLAC","FLACONETE"]
[null,null,null,null,null,null,null,null,null,null,null,null,null,null,null,null,null,null,null,null,null,null,null,null,null,null,null,null,null,null,null,null,null,null,null,null,null,null,null,null,null,null,null,null,null,null,null,"FLS/H","FOLHAS POR HORA"]
[null,null,null,null,null,null,null,null,null,null,null,null,null,null,null,null,null,null,null,null,null,null,null,null,null,null,null,null,null,null,null,null,null,null,null,null,null,null,null,null,null,null,null,null,null,null,null,"FPM","FLASH POR MINUTO"]
[null,null,null,null,null,null,null,null,null,null,null,null,null,null,null,null,null,null,null,null,null,null,null,null,null,null,null,null,null,null,null,null,null,null,null,null,null,null,null,null,null,null,null,null,null,null,null,"FPS","FOTOS P/SEGUNDO"]
[null,null,null,null,null,null,null,null,null,null,null,null,null,null,null,null,null,null,null,null,null,null,null,null,null,null,null,null,null,null,null,null,null,null,null,null,null,null,null,null,null,null,null,null,null,null,null,"FR","FRASCO"]
[null,null,null,null,null,null,null,null,null,null,null,null,null,null,null,null,null,null,null,null,null,null,null,null,null,null,null,null,null,null,null,null,null,null,null,null,null,null,null,null,null,null,null,null,null,null,null,"FR1000ML","FRASCO COM 1000 mL"]
[null,null,null,null,null,null,null,null,null,null,null,null,null,null,null,null,null,null,null,null,null,null,null,null,null,null,null,null,null,null,null,null,null,null,null,null,null,null,null,null,null,null,null,null,null,null,null,"FR100DS","FRASCO COM 100 DOSES"]
[null,null,null,null,null,null,null,null,null,null,null,null,null,null,null,null,null,null,null,null,null,null,null,null,null,null,null,null,null,null,null,null,null,null,null,null,null,null,null,null,null,null,null,null,null,null,null,"FR100ML","FRASCO COM 100 mL"]
[null,null,null,null,null,null,null,null,null,null,null,null,null,null,null,null,null,null,null,null,null,null,null,null,null,null,null,null,null,null,null,null,null,null,null,null,null,null,null,null,null,null,null,null,null,null,null,"FR105ML","FRASCO COM 105 mL"]
[null,null,null,null,null,null,null,null,null,null,null,null,null,null,null,null,null,null,null,null,null,null,null,null,null,null,null,null,null,null,null,null,null,null,null,null,null,null,null,null,null,null,null,null,null,null,null,"FR10ML","FRASCO COM 10 mL"]
[null,null,null,null,null,null,null,null,null,null,null,null,null,null,null,null,null,null,null,null,null,null,null,null,null,null,null,null,null,null,null,null,null,null,null,null,null,null,null,null,null,null,null,null,null,null,null,"FR110ML","FRASCO COM 110 mL"]
[null,null,null,null,null,null,null,null,null,null,null,null,null,null,null,null,null,null,null,null,null,null,null,null,null,null,null,null,null,null,null,null,null,null,null,null,null,null,null,null,null,null,null,null,null,null,null,"FR1200MG","FRASCO COM 1200 MG"]
[null,null,null,null,null,null,null,null,null,null,null,null,null,null,null,null,null,null,null,null,null,null,null,null,null,null,null,null,null,null,null,null,null,null,null,null,null,null,null,null,null,null,null,null,null,null,null,"FR120DS","FRASCO COM 120 DOSES"]
[null,null,null,null,null,null,null,null,null,null,null,null,null,null,null,null,null,null,null,null,null,null,null,null,null,null,null,null,null,null,null,null,null,null,null,null,null,null,null,null,null,null,null,null,null,null,null,"FR120ML","FRASCO COM 120 mL"]
[null,null,null,null,null,null,null,null,null,null,null,null,null,null,null,null,null,null,null,null,null,null,null,null,null,null,null,null,null,null,null,null,null,null,null,null,null,null,null,null,null,null,null,null,null,null,null,"FR125ML","FRASCO COM 125 mL"]
[null,null,null,null,null,null,null,null,null,null,null,null,null,null,null,null,null,null,null,null,null,null,null,null,null,null,null,null,null,null,null,null,null,null,null,null,null,null,null,null,null,null,null,null,null,null,null,"FR130DS","FRASCO COM 130 DOSES"]
[null,null,null,null,null,null,null,null,null,null,null,null,null,null,null,null,null,null,null,null,null,null,null,null,null,null,null,null,null,null,null,null,null,null,null,null,null,null,null,null,null,null,null,null,null,null,null,"FR1500MG","FRASCO COM 1500 MG"]
[null,null,null,null,null,null,null,null,null,null,null,null,null,null,null,null,null,null,null,null,null,null,null,null,null,null,null,null,null,null,null,null,null,null,null,null,null,null,null,null,null,null,null,null,null,null,null,"FR150DS","FRASCO COM 150 DOSES"]
[null,null,null,null,null,null,null,null,null,null,null,null,null,null,null,null,null,null,null,null,null,null,null,null,null,null,null,null,null,null,null,null,null,null,null,null,null,null,null,null,null,null,null,null,null,null,null,"FR150ML","FRASCO COM 150 mL"]
[null,null,null,null,null,null,null,null,null,null,null,null,null,null,null,null,null,null,null,null,null,null,null,null,null,null,null,null,null,null,null,null,null,null,null,null,null,null,null,null,null,null,null,null,null,null,null,"FR15ML","FRASCO COM 15 mL"]
[null,null,null,null,null,null,null,null,null,null,null,null,null,null,null,null,null,null,null,null,null,null,null,null,null,null,null,null,null,null,null,null,null,null,null,null,null,null,null,null,null,null,null,null,null,null,null,"FR160ML","FRASCO COM 160 mL"]
[null,null,null,null,null,null,null,null,null,null,null,null,null,null,null,null,null,null,null,null,null,null,null,null,null,null,null,null,null,null,null,null,null,null,null,null,null,null,null,null,null,null,null,null,null,null,null,"FR200DS","FRASCO COM 200 DOSES"]
[null,null,null,null,null,null,null,null,null,null,null,null,null,null,null,null,null,null,null,null,null,null,null,null,null,null,null,null,null,null,null,null,null,null,null,null,null,null,null,null,null,null,null,null,null,null,null,"FR200ML","FRASCO COM 200 mL"]
[null,null,null,null,null,null,null,null,null,null,null,null,null,null,null,null,null,null,null,null,null,null,null,null,null,null,null,null,null,null,null,null,null,null,null,null,null,null,null,null,null,null,null,null,null,null,null,"FR20ML","FRASCO COM 20 mL"]
[null,null,null,null,null,null,null,null,null,null,null,null,null,null,null,null,null,null,null,null,null,null,null,null,null,null,null,null,null,null,null,null,null,null,null,null,null,null,null,null,null,null,null,null,null,null,null,"FR240ML","FRASCO COM 240 mL"]
[null,null,null,null,null,null,null,null,null,null,null,null,null,null,null,null,null,null,null,null,null,null,null,null,null,null,null,null,null,null,null,null,null,null,null,null,null,null,null,null,null,null,null,null,null,null,null,"FR250ML","FRASCO COM 250 mL"]
[null,null,null,null,null,null,null,null,null,null,null,null,null,null,null,null,null,null,null,null,null,null,null,null,null,null,null,null,null,null,null,null,null,null,null,null,null,null,null,null,null,null,null,null,null,null,null,"FR300DS","FRASCO COM 300 DOSES"]
[null,null,null,null,null,null,null,null,null,null,null,null,null,null,null,null,null,null,null,null,null,null,null,null,null,null,null,null,null,null,null,null,null,null,null,null,null,null,null,null,null,null,null,null,null,null,null,"FR300ML","FRASCO COM 300 mL"]
[null,null,null,null,null,null,null,null,null,null,null,null,null,null,null,null,null,null,null,null,null,null,null,null,null,null,null,null,null,null,null,null,null,null,null,null,null,null,null,null,null,null,null,null,null,null,null,"FR30DS","FRASCO COM 30 DOSES"]
[null,null,null,null,null,null,null,null,null,null,null,null,null,null,null,null,null,null,null,null,null,null,null,null,null,null,null,null,null,null,null,null,null,null,null,null,null,null,null,null,null,null,null,null,null,null,null,"FR30G","FRASCO COM 30 g"]
[null,null,null,null,null,null,null,null,null,null,null,null,null,null,null,null,null,null,null,null,null,null,null,null,null,null,null,null,null,null,null,null,null,null,null,null,null,null,null,null,null,null,null,null,null,null,null,"FR30ML","FRASCO COM 30 mL"]
[null,null,null,null,null,null,null,null,null,null,null,null,null,null,null,null,null,null,null,null,null,null,null,null,null,null,null,null,null,null,null,null,null,null,null,null,null,null,null,null,null,null,null,null,null,null,null,"FR340ML","FRASCO COM 340 mL"]
[null,null,null,null,null,null,null,null,null,null,null,null,null,null,null,null,null,null,null,null,null,null,null,null,null,null,null,null,null,null,null,null,null,null,null,null,null,null,null,null,null,null,null,null,null,null,null,"FR350ML","FRASCO COM 350 mL"]
[null,null,null,null,null,null,null,null,null,null,null,null,null,null,null,null,null,null,null,null,null,null,null,null,null,null,null,null,null,null,null,null,null,null,null,null,null,null,null,null,null,null,null,null,null,null,null,"FR40ML","FRASCO COM 40 mL"]
[null,null,null,null,null,null,null,null,null,null,null,null,null,null,null,null,null,null,null,null,null,null,null,null,null,null,null,null,null,null,null,null,null,null,null,null,null,null,null,null,null,null,null,null,null,null,null,"FR45ML","FRASCO COM 45 mL"]
[null,null,null,null,null,null,null,null,null,null,null,null,null,null,null,null,null,null,null,null,null,null,null,null,null,null,null,null,null,null,null,null,null,null,null,null,null,null,null,null,null,null,null,null,null,null,null,"FR500ML","FRASCO COM 500 mL"]
[null,null,null,null,null,null,null,null,null,null,null,null,null,null,null,null,null,null,null,null,null,null,null,null,null,null,null,null,null,null,null,null,null,null,null,null,null,null,null,null,null,null,null,null,null,null,null,"H","HORA"]
[null,null,null,null,null,null,null,null,null,null,null,null,null,null,null,null,null,null,null,null,null,null,null,null,null,null,null,null,null,null,null,null,null,null,null,null,null,null,null,null,null,null,null,null,null,null,null,"KG","QUILOGRAMA"]
[null,null,null,null,null,null,null,null,null,null,null,null,null,null,null,null,null,null,null,null,null,null,null,null,null,null,null,null,null,null,null,null,null,null,null,null,null,null,null,null,null,null,null,null,null,null,null,"KM","QUILOMETRO"]
[null,null,null,null,null,null,null,null,null,null,null,null,null,null,null,null,null,null,null,null,null,null,null,null,null,null,null,null,null,null,null,null,null,null,null,null,null,null,null,null,null,null,null,null,null,null,null,"M","METRO"]
[null,null,null,null,null,null,null,null,null,null,null,null,null,null,null,null,null,null,null,null,null,null,null,null,null,null,null,null,null,null,null,null,null,null,null,null,null,null,null,null,null,null,null,null,null,null,null,"M2","METRO QUADRADO"]
[null,null,null,null,null,null,null,null,null,null,null,null,null,null,null,null,null,null,null,null,null,null,null,null,null,null,null,null,null,null,null,null,null,null,null,null,null,null,null,null,null,null,null,null,null,null,null,"M3","METRO CÚBICO"]
[null,null,null,null,null,null,null,null,null,null,null,null,null,null,null,null,null,null,null,null,null,null,null,null,null,null,null,null,null,null,null,null,null,null,null,null,null,null,null,null,null,null,null,null,null,null,null,"M3XKM","M3XKM"]
[null,null,null,null,null,null,null,null,null,null,null,null,null,null,null,null,null,null,null,null,null,null,null,null,null,null,null,null,null,null,null,null,null,null,null,null,null,null,null,null,null,null,null,null,null,null,null,"MES","MES"]
[null,null,null,null,null,null,null,null,null,null,null,null,null,null,null,null,null,null,null,null,null,null,null,null,null,null,null,null,null,null,null,null,null,null,null,null,null,null,null,null,null,null,null,null,null,null,null,"MÊS","MÊS/MESES"]
[null,null,null,null,null,null,null,null,null,null,null,null,null,null,null,null,null,null,null,null,null,null,null,null,null,null,null,null,null,null,null,null,null,null,null,null,null,null,null,null,null,null,null,null,null,null,null,"MESES","MÊS/MESES"]
[null,null,null,null,null,null,null,null,null,null,null,null,null,null,null,null,null,null,null,null,null,null,null,null,null,null,null,null,null,null,null,null,null,null,null,null,null,null,null,null,null,null,null,null,null,null,null,"OUTRAS","OUTRAS"]
[null,null,null,null,null,null,null,null,null,null,null,null,null,null,null,null,null,null,null,null,null,null,null,null,null,null,null,null,null,null,null,null,null,null,null,null,null,null,null,null,null,null,null,null,null,null,null,"PAR","PAR"]
[null,null,null,null,null,null,null,null,null,null,null,null,null,null,null,null,null,null,null,null,null,null,null,null,null,null,null,null,null,null,null,null,null,null,null,null,null,null,null,null,null,null,null,null,null,null,null,"PC","PEÇA"]
[null,null,null,null,null,null,null,null,null,null,null,null,null,null,null,null,null,null,null,null,null,null,null,null,null,null,null,null,null,null,null,null,null,null,null,null,null,null,null,null,null,null,null,null,null,null,null,"T","TONELADA"]
[null,null,null,null,null,null,null,null,null,null,null,null,null,null,null,null,null,null,null,null,null,null,null,null,null,null,null,null,null,null,null,null,null,null,null,null,null,null,null,null,null,null,null,null,null,null,null,"TXKM","TXKM"]
[null,null,null,null,null,null,null,null,null,null,null,null,null,null,null,null,null,null,null,null,null,null,null,null,null,null,null,null,null,null,null,null,null,null,null,null,null,null,null,null,null,null,null,null,null,null,null,"UN","UNIDADE"]

{"sheet":"BDI","index":3,"n_rows":146,"n_cols":26,"rows_kept":146,"cut":false,"hidden":false,"merged":[[128,9,128,12],[119,9,119,18],[122,9,122,18],[124,9,124,12],[124,15,124,18],[125,9,125,12],[127,9,127,12],[115,13,115,15],[107,9,107,16],[107,20,107,22],[108,9,108,16],[108,20,108,22],[109,9,109,16],[111,10,111,18],[117,9,117,18],[5,8,9,8],[113,9,113,18],[106,9,106,16],[114,12,115,12],[104,9,104,16],[102,9,102,16],[68,9,68,16],[114,13,114,15],[114,16,115,16],[101,9,101,16],[101,20,101,22],[104,20,104,22],[105,9,105,16],[105,20,105,22],[103,9,103,16],[103,20,103,22],[102,20,102,22],[106,20,106,22],[98,24,99,24],[98,25,99,25],[98,9,99,16],[98,17,99,17],[98,18,99,18],[98,23,99,23],[100,9,100,16],[100,20,100,22],[95,9,95,18],[96,9,96,18],[98,20,99,22],[65,9,65,16],[65,20,65,22],[66,20,66,22],[67,9,67,16],[67,20,67,22],[93,9,93,18],[84,9,84,12],[84,15,84,18],[66,9,66,16],[77,9,77,18],[69,9,69,16],[71,10,71,18],[88,9,88,12],[68,20,68,22],[85,9,85,12],[87,9,87,12],[73,9,73,18],[74,12,75,12],[79,9,79,18],[82,9,82,18],[75,13,75,15],[74,13,74,15],[74,16,75,16],[55,9,55,18],[56,9,56,18],[63,9,63,16],[63,20,63,22],[61,9,61,16],[61,20,61,22],[62,9,62,16],[62,20,62,22],[64,9,64,16],[64,20,64,22],[58,24,59,24],[58,25,59,25],[58,9,59,16],[58,17,59,17],[58,18,59,18],[58,20,59,22],[58,23,59,23],[60,9,60,16],[60,20,60,22],[48,9,48,12],[53,9,53,18],[44,9,44,12],[44,15,44,18],[45,9,45,12],[47,9,47,12],[34,13,34,15],[34,16,35,16],[39,9,39,18],[42,9,42,18],[26,9,26,16],[26,20,26,22],[27,9,27,16],[27,20,27,22],[23,9,23,16],[23,20,23,22],[35,13,35,15],[37,9,37,18],[29,9,29,16],[31,10,31,18],[28,9,28,16],[28,20,28,22],[33,9,33,18],[34,12,35,12],[22,9,22,16],[22,20,22,22],[20,9,20,16],[20,20,20,22],[21,9,21,16],[21,20,21,22],[24,9,24,16],[24,20,24,22],[25,9,25,16],[25,20,25,22],[18,23,19,23],[18,24,19,24],[16,9,16,18],[18,25,19,25],[18,20,19,22],[18,9,19,16],[18,17,19,17],[18,18,19,18],[13,9,13,18],[15,9,15,18],[4,9,4,10],[4,11,4,12],[4,13,4,18],[0,17,0,18],[1,17,1,18],[3,9,3,10],[3,11,3,12],[3,13,3,18],[10,9,10,16],[10,17,10,18],[6,9,6,18],[7,9,7,18],[9,9,9,16],[9,17,9,18]]}
[null,null,null,null,"MIN","MED","MAX",null,null,null,null,null,null,null,{"$f":"\"Quadro de Composição do BDI\"","v":"Quadro de Composição do BDI"},null,null,"Grau de Sigilo"]
["Construção e Reforma de Edifícios","AC",{"$f":"CONCATENATE(A2,\"-\",B2)","v":"Construção e Reforma de Edifícios-AC"},null,0.03,0.04,5.5E-2,null,null,null,null,null,null,null,null,null,null,"#PUBLICO"]
[{"$f":"A2","v":"Construção e Reforma de Edifícios"},"SG","Construção e Reforma de Edifícios-SG",null,8.0000000000000002E-3,8.0000000000000002E-3,0.01]
[{"$f":"A3","v":"Construção e Reforma de Edifícios"},"R","Construção e Reforma de Edifícios-R",null,9.7000000000000003E-3,1.2699999999999999E-2,1.2699999999999999E-2,null,null,"Nº OPERAÇÃO",null,"Nº TRANSFEREGOV",null,"PROPONENTE / TOMADOR"]
[{"$f":"A4","v":"Construção e Reforma de Edifícios"},"DF","Construção e Reforma de Edifícios-DF",null,5.8999999999999999E-3,1.23E-2,1.3899999999999999E-2,null,null,{"$f":"Import.CR","v":0},null,{"$f":"Import.TransfereGOV","v":0},null,{"$f":"Import.Proponente","v":"MUNICÍPIO DE SÃO VALENTIN"}]
[{"$f":"A5","v":"Construção e Reforma de Edifícios"},"L","Construção e Reforma de Edifícios-L",null,6.1600000000000002E-2,7.400000000000001E-2,8.9600000000000013E-2,null,"FILTRO"]
[{"$f":"A6","v":"Construção e Reforma de Edifícios"},"BDI PAD","Construção e Reforma de Edifícios-BDI PAD",null,0.2034,0.22120000000000001,0.25,null,null,"APELIDO DO EMPREENDIMENTO / DESCRIÇÃO DO LOTE",null,null,null,null,null,null,null,null,null,null,{"$f":"IF(OR(U10<>\"\",U11<>\"\"),\"Falta preencher os percentuais do ISS\",IF(U14<>\"\",\"Falta preencher o BDI 1\",IF(U54<>\"\",\"Falta preencher o BDI 2\",IF(U94<>\"\",\"Falta preencher o BDI 3\",\"\"))))","v":""}]
["Construção de Praças Urbanas, Rodovias, Ferrovias e recapeamento e pavimentação de vias urbanas","AC","Construção de Praças Urbanas, Rodovias, Ferrovias e recapeamento e pavimentação de vias urbanas-AC",null,3.7999999999999999E-2,4.0099999999999997E-2,4.6699999999999998E-2,null,null,{"$f":"Import.Apelido&\" / \"&Import.DescLote","v":"COBERTURA RUA PEDRO DASSOLER / "},null,null,null,null,null,null,null,null,null,null,{"$f":"IF(U29=\"FORA DO INTERVALO\",\"BDI 1 fora do intervalo\",IF(U69=\"FORA DO INTERVALO\",\"BDI 2 fora do intervalo\",IF(U109=\"FORA DO INTERVALO\",\"BDI 3 fora do intervalo\",\"\")))","v":""}]
["Construção de Praças Urbanas, Rodovias, Ferrovias e recapeamento e pavimentação de vias urbanas","SG","Construção de Praças Urbanas, Rodovias, Ferrovias e recapeamento e pavimentação de vias urbanas-SG",null,3.2000000000000002E-3,4.0000000000000001E-3,7.4000000000000003E-3]
["Construção de Praças Urbanas, Rodovias, Ferrovias e recapeamento e pavimentação de vias urbanas","R","Construção de Praças Urbanas, Rodovias, Ferrovias e recapeamento e pavimentação de vias urbanas-R",null,5.0000000000000001E-3,5.6000000000000008E-3,9.7000000000000003E-3,null,null,"Conforme legislação tributária municipal, definir estimativa de percentual da base de cálculo para o ISS:",null,null,null,null,null,null,null,1,null,null,{"$f":"IF(R10=\"\",\"Falta definir a base de cálculo para o ISS\",\"\")","v":""}]
["Construção de Praças Urbanas, Rodovias, Ferrovias e recapeamento e pavimentação de vias urbanas","DF","Construção de Praças Urbanas, Rodovias, Ferrovias e recapeamento e pavimentação de vias urbanas-DF",null,1.0200000000000001E-2,1.11E-2,1.21E-2,null,"↓","Sobre a base de cálculo, definir a respectiva alíquota do ISS (entre 2% e 5%):",null,null,null,null,null,null,null,0.03,null,null,{"$f":"IF(R11=\"\",\"Falta definir a alíquota do ISS\",\"\")","v":""}]
["Construção de Praças Urbanas, Rodovias, Ferrovias e recapeamento e pavimentação de vias urbanas","L","Construção de Praças Urbanas, Rodovias, Ferrovias e recapeamento e pavimentação de vias urbanas-L",null,6.6400000000000001E-2,7.2999999999999995E-2,8.6899999999999991E-2,null,"F"]
["Construção de Praças Urbanas, Rodovias, Ferrovias e recapeamento e pavimentação de vias urbanas","BDI PAD","Construção de Praças Urbanas, Rodovias, Ferrovias e recapeamento e pavimentação de vias urbanas-BDI PAD",null,0.19600000000000001,0.2097,0.24230000000000002,null,"F"]
["Construção de Redes de Abastecimento de Água, Coleta de Esgoto","AC","Construção de Redes de Abastecimento de Água, Coleta de Esgoto-AC",null,3.4300000000000004E-2,4.9299999999999997E-2,6.7099999999999993E-2,null,"F","BDI 1",null,null,null,null,null,null,null,null,null,null,{"$f":"IF(COUNTIF(ORÇAMENTO!$V$15:$V$27,BDI_1.Título)=0,\"\",IF(OR(Import.BDI.Tipo1=\"(SELECIONAR)\",Import.BDI.Tipo1=\"\",U17<>\"\",AND($J17<>$A$145,OR(S21=\"\",S22=\"\",AND($J17<>$A$146,OR(S23=\"\",S24=\"\")),S25=\"\",S26=\"\"))),\"Falta preencher o BDI 1\",\"\"))","v":""}]
[{"$f":"A14","v":"Construção de Redes de Abastecimento de Água, Coleta de Esgoto"},"SG","Construção de Redes de Abastecimento de Água, Coleta de Esgoto-SG",null,2.8000000000000004E-3,4.8999999999999998E-3,7.4999999999999997E-3,null,"F"]
[{"$f":"A15","v":"Construção de Redes de Abastecimento de Água, Coleta de Esgoto"},"R","Construção de Redes de Abastecimento de Água, Coleta de Esgoto-R",null,0.01,1.3899999999999999E-2,1.7399999999999999E-2,null,"F","TIPO DE OBRA"]
[{"$f":"A16","v":"Construção de Redes de Abastecimento de Água, Coleta de Esgoto"},"DF","Construção de Redes de Abastecimento de Água, Coleta de Esgoto-DF",null,9.3999999999999986E-3,9.8999999999999991E-3,1.1699999999999999E-2,null,"F","Construção e Reforma de Edifícios",null,null,null,null,null,null,null,null,null,{"$f":"IF(U17=\"\",\"\",\"◄\")","v":""},{"$f":"IF(AND(OR(S29>0,COUNTIF(ORÇAMENTO!$V$15:$V$27,BDI_1.Título)>0),OR(Import.BDI.Tipo1=\"(SELECIONAR)\",Import.BDI.Tipo1=\"\")),\"Selecione o Tipo de obra\",\"\")","v":""}]
[{"$f":"A17","v":"Construção de Redes de Abastecimento de Água, Coleta de Esgoto"},"L","Construção de Redes de Abastecimento de Água, Coleta de Esgoto-L",null,6.7400000000000002E-2,8.0399999999999985E-2,9.4E-2,null,"F"]
[{"$f":"A18","v":"Construção de Redes de Abastecimento de Água, Coleta de Esgoto"},"BDI PAD","Construção de Redes de Abastecimento de Água, Coleta de Esgoto-BDI PAD",null,0.20760000000000001,0.24179999999999999,0.26440000000000002,null,"F","Itens",null,null,null,null,null,null,null,"Siglas","% Adotado",null,"Situação",null,null,"1º Quartil","Médio","3º Quartil"]
["Construção e Manutenção de Estações e Redes de Distribuição de Energia Elétrica","AC","Construção e Manutenção de Estações e Redes de Distribuição de Energia Elétrica-AC",null,5.2900000000000003E-2,5.9200000000000003E-2,7.9299999999999995E-2,null,"F"]
[{"$f":"A20","v":"Construção e Manutenção de Estações e Redes de Distribuição de Energia Elétrica"},"SG","Construção e Manutenção de Estações e Redes de Distribuição de Energia Elétrica-SG",null,2.5000000000000001E-3,5.1000000000000004E-3,5.6000000000000008E-3,null,"F",{"$f":"IF($J$17=$A$146,\"Encargos Sociais incidentes sobre a mão de obra\",\"Administração Central\")","v":"Administração Central"},null,null,null,null,null,null,null,{"$f":"IF($J17=$A$146,\"K1\",\"AC\")","v":"AC"},3.5000000000000003E-2,{"$f":"IF(AND($U$14<>\"\",$U$17=\"\",R21<>\"\",S21=\"\"),\"◄\",\"\")","v":""},{"$f":"IFERROR(IF(T21=\"◄\",\"FALTA PREENCHER\",IF(AND(OR(S21>=X21,X21=\"-\"),OR(S21<=Z21,Z21=\"-\")),\"OK\",\"FORA DO INTERVALO\")),\"-\")","v":"OK"},null,null,{"$f":"VLOOKUP(CONCATENATE(J17,\"-\",R21),$C$2:$G$136,3,FALSE)","v":0.03},{"$f":"VLOOKUP(CONCATENATE(J17,\"-\",R21),$C$2:$G$136,4,FALSE)","v":0.04},{"$f":"VLOOKUP(CONCATENATE(J17,\"-\",R21),$C$2:$G$136,5,FALSE)","v":5.5E-2}]
[{"$f":"A21","v":"Construção e Manutenção de Estações e Redes de Distribuição de Energia Elétrica"},"R","Construção e Manutenção de Estações e Redes de Distribuição de Energia Elétrica-R",null,0.01,1.4800000000000001E-2,1.9699999999999999E-2,null,"F",{"$f":"IF($J$17=$A$146,\"Administração Central da empresa ou consultoria - overhead\",\"Seguro e Garantia\")","v":"Seguro e Garantia"},null,null,null,null,null,null,null,{"$f":"IF($J17=$A$146,\"K2\",\"SG\")","v":"SG"},8.5000000000000006E-3,{"$f":"IF(AND($U$14<>\"\",$U$17=\"\",R22<>\"\",S22=\"\"),\"◄\",\"\")","v":""},{"$f":"IFERROR(IF(T22=\"◄\",\"FALTA PREENCHER\",IF(AND(OR(S22>=X22,X22=\"-\"),OR(S22<=Z22,Z22=\"-\")),\"OK\",\"FORA DO INTERVALO\")),\"-\")","v":"OK"},null,null,{"$f":"VLOOKUP(CONCATENATE(J17,\"-\",R22),$C$2:$G$136,3,FALSE)","v":8.0000000000000002E-3},{"$f":"VLOOKUP(CONCATENATE(J17,\"-\",R22),$C$2:$G$136,4,FALSE)","v":8.0000000000000002E-3},{"$f":"VLOOKUP(CONCATENATE(J17,\"-\",R22),$C$2:$G$136,5,FALSE)","v":0.01}]
[{"$f":"A22","v":"Construção e Manutenção de Estações e Redes de Distribuição de Energia Elétrica"},"DF","Construção e Manutenção de Estações e Redes de Distribuição de Energia Elétrica-DF",null,1.01E-2,1.0700000000000001E-2,1.11E-2,null,"F","Risco",null,null,null,null,null,null,null,{"$f":"IF($J17=$A$146,\"\",\"R\")","v":"R"},1.0999999999999999E-2,"","OK",null,null,{"$f":"VLOOKUP(CONCATENATE(J17,\"-\",R23),$C$2:$G$136,3,FALSE)","v":9.7000000000000003E-3},{"$f":"VLOOKUP(CONCATENATE(J17,\"-\",R23),$C$2:$G$136,4,FALSE)","v":1.2699999999999999E-2},{"$f":"VLOOKUP(CONCATENATE(J17,\"-\",R23),$C$2:$G$136,5,FALSE)","v":1.2699999999999999E-2}]
[{"$f":"A23","v":"Construção e Manutenção de Estações e Redes de Distribuição de Energia Elétrica"},"L","Construção e Manutenção de Estações e Redes de Distribuição de Energia Elétrica-L",null,0.08,8.3100000000000007E-2,9.5100000000000004E-2,null,"F","Despesas Financeiras",null,null,null,null,null,null,null,{"$f":"IF($J17=$A$146,\"\",\"DF\")","v":"DF"},1.0999999999999999E-2,"","OK",null,null,{"$f":"VLOOKUP(CONCATENATE(J17,\"-\",R24),$C$2:$G$136,3,FALSE)","v":5.8999999999999999E-3},{"$f":"VLOOKUP(CONCATENATE(J17,\"-\",R24),$C$2:$G$136,4,FALSE)","v":1.23E-2},{"$f":"VLOOKUP(CONCATENATE(J17,\"-\",R24),$C$2:$G$136,5,FALSE)","v":1.3899999999999999E-2}]
[{"$f":"A24","v":"Construção e Manutenção de Estações e Redes de Distribuição de Energia Elétrica"},"BDI PAD","Construção e Manutenção de Estações e Redes de Distribuição de Energia Elétrica-BDI PAD",null,0.24,0.25840000000000002,0.27860000000000001,null,"F",{"$f":"IF($J$17=$A$146,\"Margem bruta da empresa de consultoria\",\"Lucro\")","v":"Lucro"},null,null,null,null,null,null,null,{"$f":"IF($J17=$A$146,\"K3\",\"L\")","v":"L"},8.0399999999999999E-2,"","OK",null,null,{"$f":"VLOOKUP(CONCATENATE(J17,\"-\",R25),$C$2:$G$136,3,FALSE)","v":6.1600000000000002E-2},{"$f":"VLOOKUP(CONCATENATE(J17,\"-\",R25),$C$2:$G$136,4,FALSE)","v":7.400000000000001E-2},{"$f":"VLOOKUP(CONCATENATE(J17,\"-\",R25),$C$2:$G$136,5,FALSE)","v":8.9600000000000013E-2}]
["Obras Portuárias, Marítimas e Fluviais","AC","Obras Portuárias, Marítimas e Fluviais-AC",null,0.04,5.5199999999999999E-2,7.85E-2,null,"F","Tributos (impostos COFINS 3%, e  PIS 0,65%)",null,null,null,null,null,null,null,"CP",3.6499999999999998E-2,"","OK",null,null,{"$f":"Y26","v":3.6499999999999998E-2},{"$f":"IF($J17=$A$145,\"-\",3.65%)","v":3.6499999999999998E-2},{"$f":"Y26","v":3.6499999999999998E-2}]
[{"$f":"A26","v":"Obras Portuárias, Marítimas e Fluviais"},"SG","Obras Portuárias, Marítimas e Fluviais-SG",null,8.1000000000000013E-3,1.2199999999999999E-2,1.9900000000000001E-2,null,"F","Tributos (ISS, variável de acordo com o município)",null,null,null,null,null,null,null,"ISS",{"$f":"IF(AND($J17<>$A$145,COUNTA(OFFSET(S20,1,0,6))>0),$R$11*$R$10,0)","v":0.03},null,"OK",null,null,0,2.5000000000000001E-2,0.05]
[{"$f":"A27","v":"Obras Portuárias, Marítimas e Fluviais"},"R","Obras Portuárias, Marítimas e Fluviais-R",null,1.46E-2,2.3199999999999998E-2,3.1600000000000003E-2,null,"F","Tributos (Contribuição Previdenciária sobre a Receita Bruta - Lei 12.546 de 14/12/2011 - Desoneração)",null,null,null,null,null,null,null,"CPRB",{"$f":"IF(BDI.Opcao<>\"Desonerado\",0,IF(AND($J17<>$A$145,COUNTA(OFFSET(S20,1,0,6))>0),IF(YEAR(Import.DataBase)<2025,4.5%,IF(YEAR(Import.DataBase)=2025,3.6%,IF(YEAR(Import.DataBase)=2026,2.7%,IF(YEAR(Import.DataBase)=2027,1.8%,0%)))),0%))","v":0},null,"OK",null,null,{"$f":"$S28","v":0},{"$f":"$S28","v":0},{"$f":"$S28","v":0}]
[{"$f":"A28","v":"Obras Portuárias, Marítimas e Fluviais"},"DF","Obras Portuárias, Marítimas e Fluviais-DF",null,9.3999999999999986E-3,1.0200000000000001E-2,1.3300000000000001E-2,null,"F","BDI SEM desoneração (Fórmula Acórdão TCU)",null,null,null,null,null,null,null,"BDI PAD",{"$f":"IF($J17=$A$145,0,ROUND((((1+S21+S22+S23)*(1+S24)*(1+S25)/(1-(S26+S27)))-1),4))","v":0.2339},null,{"$f":"IFERROR(IF(AND(OR(S29>=X29,X29=\"-\"),OR(S29<=Z29,Z29=\"-\")),\"OK\",\"FORA DO INTERVALO\"),IF(S29=0,\"OK\",\"Selecione o Tipo de obra\"))","v":"OK"},null,null,{"$f":"IF($J17=$A$145,0,VLOOKUP(CONCATENATE($J17,\"-\",$R29),$C$2:$G$136,3,FALSE))","v":0.2034},{"$f":"IF($J17=$A$145,0,VLOOKUP(CONCATENATE($J17,\"-\",$R29),$C$2:$G$136,4,FALSE))","v":0.22120000000000001},{"$f":"IF($J17=$A$145,0,VLOOKUP(CONCATENATE($J17,\"-\",$R29),$C$2:$G$136,5,FALSE))","v":0.25}]
[{"$f":"A29","v":"Obras Portuárias, Marítimas e Fluviais"},"L","Obras Portuárias, Marítimas e Fluviais-L",null,7.1399999999999991E-2,8.4000000000000005E-2,0.1043,null,"F","BDI COM desoneração",null,null,null,null,null,null,null,"BDI DES",{"$f":"IF($J17=$A$145,0,ROUND((((1+S21+S22+S23)*(1+S24)*(1+S25)/(1-(S26+S27+S28)))-1),4))","v":0.2339}]
[{"$f":"A30","v":"Obras Portuárias, Marítimas e Fluviais"},"BDI PAD","Obras Portuárias, Marítimas e Fluviais-BDI PAD",null,0.22800000000000001,0.27479999999999999,0.3095,null,"F"]
["Fornecimento de Materiais e Equipamentos (aquisição indireta - em conjunto com licitação de obras)","AC","Fornecimento de Materiais e Equipamentos (aquisição indireta - em conjunto com licitação de obras)-AC",null,1.4999999999999999E-2,3.4500000000000003E-2,4.4900000000000002E-2,null,"F",{"$f":"IF(U29<>\"ok\",\"X\",\"\")","v":""},{"$f":"IF(U29<>\"ok\",\"Anexo: Relatório Técnico Circunstanciado justificando a adoção do percentual de cada parcela do BDI.\",\"\")","v":""}]
[{"$f":"A32","v":"Fornecimento de Materiais e Equipamentos (aquisição indireta - em conjunto com licitação de obras)"},"SG","Fornecimento de Materiais e Equipamentos (aquisição indireta - em conjunto com licitação de obras)-SG",null,3.0000000000000001E-3,4.7999999999999996E-3,8.199999999999999E-3,null,"F"]
[{"$f":"A33","v":"Fornecimento de Materiais e Equipamentos (aquisição indireta - em conjunto com licitação de obras)"},"R","Fornecimento de Materiais e Equipamentos (aquisição indireta - em conjunto com licitação de obras)-R",null,5.6000000000000008E-3,8.5000000000000006E-3,8.8999999999999999E-3,null,"F","Os valores de BDI foram calculados com o emprego da fórmula:"]
[{"$f":"A34","v":"Fornecimento de Materiais e Equipamentos (aquisição indireta - em conjunto com licitação de obras)"},"DF","Fornecimento de Materiais e Equipamentos (aquisição indireta - em conjunto com licitação de obras)-DF",null,8.5000000000000006E-3,8.5000000000000006E-3,1.11E-2,null,"F",null,null,null,"BDI =",{"$f":"IF($J17=$A$146,\"(1+K1+K2)*(1+K3)\",\"(1+AC + S + R + G)*(1 + DF)*(1+L)\")","v":"(1+AC + S + R + G)*(1 + DF)*(1+L)"},null,null," - 1"]
[{"$f":"A35","v":"Fornecimento de Materiais e Equipamentos (aquisição indireta - em conjunto com licitação de obras)"},"L","Fornecimento de Materiais e Equipamentos (aquisição indireta - em conjunto com licitação de obras)-L",null,3.5000000000000003E-2,5.1100000000000007E-2,6.2199999999999998E-2,null,"F",null,null,null,null,"(1-CP-ISS-CRPB)"]
[{"$f":"A36","v":"Fornecimento de Materiais e Equipamentos (aquisição indireta - em conjunto com licitação de obras)"},"BDI PAD","Fornecimento de Materiais e Equipamentos (aquisição indireta - em conjunto com licitação de obras)-BDI PAD",null,0.111,0.14019999999999999,0.16800000000000001,null,"F"]
["Fornecimento de Materiais e Equipamentos (aquisição direta)","AC","Fornecimento de Materiais e Equipamentos (aquisição direta)-AC",null,"-","-","-",null,"F",{"$f":"CONCATENATE(\"Declaro para os devidos fins que, conforme legislação tributária municipal, a base de cálculo deste tipo de obra corresponde à \",$R$10*100,\"%, com a respectiva alíquota de \",$R$11*100,\"%.\")","v":"Declaro para os devidos fins que, conforme legislação tributária municipal, a base de cálculo deste tipo de obra corresponde à 100%, com a respectiva alíquota de 3%."}]
["Fornecimento de Materiais e Equipamentos (aquisição direta)","SG","Fornecimento de Materiais e Equipamentos (aquisição direta)-SG",null,"-","-","-",null,"F"]
["Fornecimento de Materiais e Equipamentos (aquisição direta)","R","Fornecimento de Materiais e Equipamentos (aquisição direta)-R",null,"-","-","-",null,"F",{"$f":"CONCATENATE(\"Declaro para os devidos fins que o regime de Contribuição Previdenciária sobre a Receita Bruta adotado para elaboração do orçamento foi \",IF(DESONERACAO=\"Sim\",\"COM\",\"SEM\"),\" Desoneração, e que esta é a alternativa mais adequada para a Administração Pública.\")","v":"Declaro para os devidos fins que o regime de Contribuição Previdenciária sobre a Receita Bruta adotado para elaboração do orçamento foi SEM Desoneração, e que esta é a alternativa mais adequada para a Administração Pública."}]
["Fornecimento de Materiais e Equipamentos (aquisição direta)","DF","Fornecimento de Materiais e Equipamentos (aquisição direta)-DF",null,"-","-","-",null,"F"]
["Fornecimento de Materiais e Equipamentos (aquisição direta)","L","Fornecimento de Materiais e Equipamentos (aquisição direta)-L",null,"-","-","-",null,"F","Observações:"]
["Fornecimento de Materiais e Equipamentos (aquisição direta)","BDI PAD","Fornecimento de Materiais e Equipamentos (aquisição direta)-BDI PAD",null,"-","-","-",null,"F"]
["Estudos e Projetos, Planos e Gerenciamento e outros correlatos","K1","Estudos e Projetos, Planos e Gerenciamento e outros correlatos-K1",null,"-","-","-",null,"F"]
[{"$f":"A44","v":"Estudos e Projetos, Planos e Gerenciamento e outros correlatos"},"K2","Estudos e Projetos, Planos e Gerenciamento e outros correlatos-K2",null,"-",0.2,"-",null,"F",{"$f":"Import.Município","v":"SÃO VALENTIM/RS"},null,null,null,null,null,{"$f":"DADOS!$C$25","v":"00:00:00"}]
[{"$f":"A45","v":"Estudos e Projetos, Planos e Gerenciamento e outros correlatos"},null,"Estudos e Projetos, Planos e Gerenciamento e outros correlatos-",null,"-","-","-",null,"F","Local",null,null,null,null,null,"Data"]
[{"$f":"A46","v":"Estudos e Projetos, Planos e Gerenciamento e outros correlatos"},null,"Estudos e Projetos, Planos e Gerenciamento e outros correlatos-",null,"-","-","-",null,"F"]
[{"$f":"A47","v":"Estudos e Projetos, Planos e Gerenciamento e outros correlatos"},"K3","Estudos e Projetos, Planos e Gerenciamento e outros correlatos-K3",null,"-",0.12,"-",null,"F"]
[{"$f":"A48","v":"Estudos e Projetos, Planos e Gerenciamento e outros correlatos"},"BDI PAD","Estudos e Projetos, Planos e Gerenciamento e outros correlatos-BDI PAD",null,"-","-","-",null,"F","Responsável Técnico"]
[null,null,null,null,null,null,null,null,"F","Nome:",{"$f":"Import.RespOrçamento","v":0}]
[null,null,null,null,null,null,null,null,"F","CREA/CAU:",0]
[null,null,null,null,null,null,null,null,"F","ART/RRT:",0]
[null,null,null,null,null,null,null,null,"F"]
[null,null,null,null,null,null,null,null,{"$f":"IF($S$69=0,\"\",\"F\")","v":""},"BDI 2",null,null,null,null,null,null,null,null,null,null,{"$f":"IF(COUNTIF(ORÇAMENTO!$V$15:$V$27,BDI_2.Título)=0,\"\",IF(OR(Import.BDI.Tipo2=\"(SELECIONAR)\",Import.BDI.Tipo2=\"\",U57<>\"\",AND($J57<>$A$145,OR(S61=\"\",S62=\"\",AND($J57<>$A$146,OR(S63=\"\",S64=\"\")),S65=\"\",S66=\"\"))),\"Falta preencher o BDI 2\",\"\"))","v":""}]
[null,null,null,null,null,null,null,null,{"$f":"IF($S$69=0,\"\",\"F\")","v":""}]
[null,null,null,null,null,null,null,null,"","TIPO DE OBRA"]
[null,null,null,null,null,null,null,null,"","(SELECIONAR)",null,null,null,null,null,null,null,null,null,{"$f":"IF(U57=\"\",\"\",\"◄\")","v":""},{"$f":"IF(AND(OR(S69>0,COUNTIF(ORÇAMENTO!$V$15:$V$27,BDI_2.Título)>0),OR(Import.BDI.Tipo2=\"(SELECIONAR)\",Import.BDI.Tipo2=\"\")),\"Selecione o Tipo de obra\",\"\")","v":""}]
[null,null,null,null,null,null,null,null,""]
[null,null,null,null,null,null,null,null,"","Itens",null,null,null,null,null,null,null,"Siglas","% Adotado",null,"Situação",null,null,"1º Quartil","Médio","3º Quartil"]
[null,null,null,null,null,null,null,null,""]
[null,null,null,null,null,null,null,null,"",{"$f":"IF($J$17=$A$146,\"Encargos Sociais incidentes sobre a mão de obra\",\"Administração Central\")","v":"Administração Central"},null,null,null,null,null,null,null,{"$f":"IF($J57=$A$146,\"K1\",\"AC\")","v":"AC"},null,{"$f":"IF(AND($U$54<>\"\",$U$57=\"\",R61<>\"\",S61=\"\"),\"◄\",\"\")","v":""},{"$f":"IFERROR(IF(T61=\"◄\",\"FALTA PREENCHER\",IF(AND(OR(S61>=X61,X61=\"-\"),OR(S61<=Z61,Z61=\"-\")),\"OK\",\"FORA DO INTERVALO\")),\"-\")","v":"-"},null,null,{"$f":"VLOOKUP(CONCATENATE(J57,\"-\",R61),$C$2:$G$136,3,FALSE)","v":{"$error":"#N/A"}},{"$f":"VLOOKUP(CONCATENATE(J57,\"-\",R61),$C$2:$G$136,4,FALSE)","v":{"$error":"#N/A"}},{"$f":"VLOOKUP(CONCATENATE(J57,\"-\",R61),$C$2:$G$136,5,FALSE)","v":{"$error":"#N/A"}}]
[null,null,null,null,null,null,null,null,"",{"$f":"IF($J$17=$A$146,\"Administração Central da empresa ou consultoria - overhead\",\"Seguro e Garantia\")","v":"Seguro e Garantia"},null,null,null,null,null,null,null,{"$f":"IF($J57=$A$146,\"K2\",\"SG\")","v":"SG"},null,{"$f":"IF(AND($U$54<>\"\",$U$57=\"\",R62<>\"\",S62=\"\"),\"◄\",\"\")","v":""},{"$f":"IFERROR(IF(T62=\"◄\",\"FALTA PREENCHER\",IF(AND(OR(S62>=X62,X62=\"-\"),OR(S62<=Z62,Z62=\"-\")),\"OK\",\"FORA DO INTERVALO\")),\"-\")","v":"-"},null,null,{"$f":"VLOOKUP(CONCATENATE(J57,\"-\",R62),$C$2:$G$136,3,FALSE)","v":{"$error":"#N/A"}},{"$f":"VLOOKUP(CONCATENATE(J57,\"-\",R62),$C$2:$G$136,4,FALSE)","v":{"$error":"#N/A"}},{"$f":"VLOOKUP(CONCATENATE(J57,\"-\",R62),$C$2:$G$136,5,FALSE)","v":{"$error":"#N/A"}}]
[null,null,null,null,null,null,null,null,"","Risco",null,null,null,null,null,null,null,{"$f":"IF($J57=$A$146,\"\",\"R\")","v":"R"},null,"","-",null,null,{"$f":"VLOOKUP(CONCATENATE(J57,\"-\",R63),$C$2:$G$136,3,FALSE)","v":{"$error":"#N/A"}},{"$f":"VLOOKUP(CONCATENATE(J57,\"-\",R63),$C$2:$G$136,4,FALSE)","v":{"$error":"#N/A"}},{"$f":"VLOOKUP(CONCATENATE(J57,\"-\",R63),$C$2:$G$136,5,FALSE)","v":{"$error":"#N/A"}}]
[null,null,null,null,null,null,null,null,"","Despesas Financeiras",null,null,null,null,null,null,null,{"$f":"IF($J57=$A$146,\"\",\"DF\")","v":"DF"},null,"","-",null,null,{"$f":"VLOOKUP(CONCATENATE(J57,\"-\",R64),$C$2:$G$136,3,FALSE)","v":{"$error":"#N/A"}},{"$f":"VLOOKUP(CONCATENATE(J57,\"-\",R64),$C$2:$G$136,4,FALSE)","v":{"$error":"#N/A"}},{"$f":"VLOOKUP(CONCATENATE(J57,\"-\",R64),$C$2:$G$136,5,FALSE)","v":{"$error":"#N/A"}}]
[null,null,null,null,null,null,null,null,"",{"$f":"IF($J$17=$A$146,\"Margem bruta da empresa de consultoria\",\"Lucro\")","v":"Lucro"},null,null,null,null,null,null,null,{"$f":"IF($J57=$A$146,\"K3\",\"L\")","v":"L"},null,"","-",null,null,{"$f":"VLOOKUP(CONCATENATE(J57,\"-\",R65),$C$2:$G$136,3,FALSE)","v":{"$error":"#N/A"}},{"$f":"VLOOKUP(CONCATENATE(J57,\"-\",R65),$C$2:$G$136,4,FALSE)","v":{"$error":"#N/A"}},{"$f":"VLOOKUP(CONCATENATE(J57,\"-\",R65),$C$2:$G$136,5,FALSE)","v":{"$error":"#N/A"}}]
[null,null,null,null,null,null,null,null,"","Tributos (impostos COFINS 3%, e  PIS 0,65%)",null,null,null,null,null,null,null,"CP",null,"","FORA DO INTERVALO",null,null,{"$f":"Y66","v":3.6499999999999998E-2},{"$f":"IF($J57=$A$145,\"-\",3.65%)","v":3.6499999999999998E-2},{"$f":"Y66","v":3.6499999999999998E-2}]
[null,null,null,null,null,null,null,null,"","Tributos (ISS, variável de acordo com o município)",null,null,null,null,null,null,null,"ISS",{"$f":"IF(AND($J57<>$A$145,COUNTA(OFFSET(S60,1,0,6))>0),$R$11*$R$10,0)","v":0},null,"OK",null,null,0,2.5000000000000001E-2,0.05]
[null,null,null,null,null,null,null,null,"","Tributos (Contribuição Previdenciária sobre a Receita Bruta - Lei 12.546 de 14/12/2011 - Desoneração)",null,null,null,null,null,null,null,"CPRB",{"$f":"IF(BDI.Opcao<>\"Desonerado\",0,IF(AND($J57<>$A$145,COUNTA(OFFSET(S60,1,0,6))>0),IF(YEAR(Import.DataBase)<2025,4.5%,IF(YEAR(Import.DataBase)=2025,3.6%,IF(YEAR(Import.DataBase)=2026,2.7%,IF(YEAR(Import.DataBase)=2027,1.8%,0%)))),0%))","v":0},null,"OK",null,null,{"$f":"$S68","v":0},{"$f":"$S68","v":0},{"$f":"$S68","v":0}]
[null,null,null,null,null,null,null,null,"","BDI SEM desoneração (Fórmula Acórdão TCU)",null,null,null,null,null,null,null,"BDI PAD",{"$f":"IF($J57=$A$145,0,ROUND((((1+S61+S62+S63)*(1+S64)*(1+S65)/(1-(S66+S67)))-1),4))","v":0},null,{"$f":"IFERROR(IF(AND(OR(S69>=X69,X69=\"-\"),OR(S69<=Z69,Z69=\"-\")),\"OK\",\"FORA DO INTERVALO\"),IF(S69=0,\"OK\",\"Selecione o Tipo de obra\"))","v":"OK"},null,null,{"$f":"IF($J57=$A$145,0,VLOOKUP(CONCATENATE($J57,\"-\",$R69),$C$2:$G$136,3,FALSE))","v":{"$error":"#N/A"}},{"$f":"IF($J57=$A$145,0,VLOOKUP(CONCATENATE($J57,\"-\",$R69),$C$2:$G$136,4,FALSE))","v":{"$error":"#N/A"}},{"$f":"IF($J57=$A$145,0,VLOOKUP(CONCATENATE($J57,\"-\",$R69),$C$2:$G$136,5,FALSE))","v":{"$error":"#N/A"}}]
[null,null,null,null,null,null,null,null,"","BDI COM desoneração",null,null,null,null,null,null,null,"BDI DES",{"$f":"IF($J57=$A$145,0,ROUND((((1+S61+S62+S63)*(1+S64)*(1+S65)/(1-(S66+S67+S68)))-1),4))","v":0}]
[null,null,null,null,null,null,null,null,""]
[null,null,null,null,null,null,null,null,"",{"$f":"IF(U69<>\"ok\",\"X\",\"\")","v":""},{"$f":"IF(U69<>\"ok\",\"Anexo: Relatório Técnico Circunstanciado justificando a adoção do percentual de cada parcela do BDI.\",\"\")","v":""}]
[null,null,null,null,null,null,null,null,""]
[null,null,null,null,null,null,null,null,"","Os valores de BDI foram calculados com o emprego da fórmula:"]
[null,null,null,null,null,null,null,null,"",null,null,null,"BDI =",{"$f":"IF($J57=$A$146,\"(1+K1+K2)*(1+K3)\",\"(1+AC + S + R + G)*(1 + DF)*(1+L)\")","v":"(1+AC + S + R + G)*(1 + DF)*(1+L)"},null,null," - 1"]
[null,null,null,null,null,null,null,null,"",null,null,null,null,"(1-CP-ISS-CRPB)"]
[null,null,null,null,null,null,null,null,""]
[null,null,null,null,null,null,null,null,"",{"$f":"CONCATENATE(\"Declaro para os devidos fins que, conforme legislação tributária municipal, a base de cálculo deste tipo de obra corresponde à \",$R$10*100,\"%, com a respectiva alíquota de \",$R$11*100,\"%.\")","v":"Declaro para os devidos fins que, conforme legislação tributária municipal, a base de cálculo deste tipo de obra corresponde à 100%, com a respectiva alíquota de 3%."}]
[null,null,null,null,null,null,null,null,""]
[null,null,null,null,null,null,null,null,"",{"$f":"CONCATENATE(\"Declaro para os devidos fins que o regime de Contribuição Previdenciária sobre a Receita Bruta adotado para elaboração do orçamento foi \",IF(DESONERACAO=\"Sim\",\"COM\",\"SEM\"),\" Desoneração, e que esta é a alternativa mais adequada para a Administração Pública.\")","v":"Declaro para os devidos fins que o regime de Contribuição Previdenciária sobre a Receita Bruta adotado para elaboração do orçamento foi SEM Desoneração, e que esta é a alternativa mais adequada para a Administração Pública."}]
[null,null,null,null,null,null,null,null,""]
[null,null,null,null,null,null,null,null,"","Observações:"]
[null,null,null,null,null,null,null,null,""]
[null,null,null,null,null,null,null,null,""]
[null,null,null,null,null,null,null,null,"",{"$f":"Import.Município","v":"SÃO VALENTIM/RS"},null,null,null,null,null,{"$f":"DADOS!$C$25","v":"00:00:00"}]
[null,null,null,null,null,null,null,null,"","Local",null,null,null,null,null,"Data"]
[null,null,null,null,null,null,null,null,""]
[null,null,null,null,null,null,null,null,""]
[null,null,null,null,null,null,null,null,"","Responsável Técnico"]
[null,null,null,null,null,null,null,null,"","Nome:",{"$f":"Import.RespOrçamento","v":0}]
[null,null,null,null,null,null,null,null,"","CREA/CAU:",0]
[null,null,null,null,null,null,null,null,"","ART/RRT:",0]
[null,null,null,null,null,null,null,null,""]
[null,null,null,null,null,null,null,null,{"$f":"IF($S$109=0,\"\",\"F\")","v":""},"BDI 3",null,null,null,null,null,null,null,null,null,null,{"$f":"IF(COUNTIF(ORÇAMENTO!$V$15:$V$27,BDI_3.Título)=0,\"\",IF(OR(Import.BDI.Tipo3=\"(SELECIONAR)\",Import.BDI.Tipo3=\"\",U97<>\"\",AND($J97<>$A$145,OR(S101=\"\",S102=\"\",AND($J97<>$A$146,OR(S103=\"\",S104=\"\")),S105=\"\",S106=\"\"))),\"Falta preencher o BDI 3\",\"\"))","v":""}]
[null,null,null,null,null,null,null,null,{"$f":"IF($S$109=0,\"\",\"F\")","v":""}]
[null,null,null,null,null,null,null,null,"","TIPO DE OBRA"]
[null,null,null,null,null,null,null,null,"","(SELECIONAR)",null,null,null,null,null,null,null,null,null,{"$f":"IF(U97=\"\",\"\",\"◄\")","v":""},{"$f":"IF(AND(OR(S109>0,COUNTIF(ORÇAMENTO!$V$15:$V$27,BDI_3.Título)>0),OR(Import.BDI.Tipo3=\"(SELECIONAR)\",Import.BDI.Tipo3=\"\")),\"Selecione o Tipo de obra\",\"\")","v":""}]
[null,null,null,null,null,null,null,null,""]
[null,null,null,null,null,null,null,null,"","Itens",null,null,null,null,null,null,null,"Siglas","% Adotado",null,"Situação",null,null,"1º Quartil","Médio","3º Quartil"]
[null,null,null,null,null,null,null,null,""]
[null,null,null,null,null,null,null,null,"",{"$f":"IF($J$17=$A$146,\"Encargos Sociais incidentes sobre a mão de obra\",\"Administração Central\")","v":"Administração Central"},null,null,null,null,null,null,null,{"$f":"IF($J97=$A$146,\"K1\",\"AC\")","v":"AC"},null,{"$f":"IF(AND($U$94<>\"\",$U$97=\"\",R101<>\"\",S101=\"\"),\"◄\",\"\")","v":""},{"$f":"IFERROR(IF(T101=\"◄\",\"FALTA PREENCHER\",IF(AND(OR(S101>=X101,X101=\"-\"),OR(S101<=Z101,Z101=\"-\")),\"OK\",\"FORA DO INTERVALO\")),\"-\")","v":"-"},null,null,{"$f":"VLOOKUP(CONCATENATE(J97,\"-\",R101),$C$2:$G$136,3,FALSE)","v":{"$error":"#N/A"}},{"$f":"VLOOKUP(CONCATENATE(J97,\"-\",R101),$C$2:$G$136,4,FALSE)","v":{"$error":"#N/A"}},{"$f":"VLOOKUP(CONCATENATE(J97,\"-\",R101),$C$2:$G$136,5,FALSE)","v":{"$error":"#N/A"}}]
[null,null,null,null,null,null,null,null,"",{"$f":"IF($J$17=$A$146,\"Administração Central da empresa ou consultoria - overhead\",\"Seguro e Garantia\")","v":"Seguro e Garantia"},null,null,null,null,null,null,null,{"$f":"IF($J97=$A$146,\"K2\",\"SG\")","v":"SG"},null,{"$f":"IF(AND($U$94<>\"\",$U$97=\"\",R102<>\"\",S102=\"\"),\"◄\",\"\")","v":""},{"$f":"IFERROR(IF(T102=\"◄\",\"FALTA PREENCHER\",IF(AND(OR(S102>=X102,X102=\"-\"),OR(S102<=Z102,Z102=\"-\")),\"OK\",\"FORA DO INTERVALO\")),\"-\")","v":"-"},null,null,{"$f":"VLOOKUP(CONCATENATE(J97,\"-\",R102),$C$2:$G$136,3,FALSE)","v":{"$error":"#N/A"}},{"$f":"VLOOKUP(CONCATENATE(J97,\"-\",R102),$C$2:$G$136,4,FALSE)","v":{"$error":"#N/A"}},{"$f":"VLOOKUP(CONCATENATE(J97,\"-\",R102),$C$2:$G$136,5,FALSE)","v":{"$error":"#N/A"}}]
[null,null,null,null,null,null,null,null,"","Risco",null,null,null,null,null,null,null,{"$f":"IF($J97=$A$146,\"\",\"R\")","v":"R"},null,"","-",null,null,{"$f":"VLOOKUP(CONCATENATE(J97,\"-\",R103),$C$2:$G$136,3,FALSE)","v":{"$error":"#N/A"}},{"$f":"VLOOKUP(CONCATENATE(J97,\"-\",R103),$C$2:$G$136,4,FALSE)","v":{"$error":"#N/A"}},{"$f":"VLOOKUP(CONCATENATE(J97,\"-\",R103),$C$2:$G$136,5,FALSE)","v":{"$error":"#N/A"}}]
[null,null,null,null,null,null,null,null,"","Despesas Financeiras",null,null,null,null,null,null,null,{"$f":"IF($J97=$A$146,\"\",\"DF\")","v":"DF"},null,"","-",null,null,{"$f":"VLOOKUP(CONCATENATE(J97,\"-\",R104),$C$2:$G$136,3,FALSE)","v":{"$error":"#N/A"}},{"$f":"VLOOKUP(CONCATENATE(J97,\"-\",R104),$C$2:$G$136,4,FALSE)","v":{"$error":"#N/A"}},{"$f":"VLOOKUP(CONCATENATE(J97,\"-\",R104),$C$2:$G$136,5,FALSE)","v":{"$error":"#N/A"}}]
[null,null,null,null,null,null,null,null,"",{"$f":"IF($J$17=$A$146,\"Margem bruta da empresa de consultoria\",\"Lucro\")","v":"Lucro"},null,null,null,null,null,null,null,{"$f":"IF($J97=$A$146,\"K3\",\"L\")","v":"L"},null,"","-",null,null,{"$f":"VLOOKUP(CONCATENATE(J97,\"-\",R105),$C$2:$G$136,3,FALSE)","v":{"$error":"#N/A"}},{"$f":"VLOOKUP(CONCATENATE(J97,\"-\",R105),$C$2:$G$136,4,FALSE)","v":{"$error":"#N/A"}},{"$f":"VLOOKUP(CONCATENATE(J97,\"-\",R105),$C$2:$G$136,5,FALSE)","v":{"$error":"#N/A"}}]
[null,null,null,null,null,null,null,null,"","Tributos (impostos COFINS 3%, e  PIS 0,65%)",null,null,null,null,null,null,null,"CP",null,"","FORA DO INTERVALO",null,null,{"$f":"Y106","v":3.6499999999999998E-2},{"$f":"IF($J97=$A$145,\"-\",3.65%)","v":3.6499999999999998E-2},{"$f":"Y106","v":3.6499999999999998E-2}]
[null,null,null,null,null,null,null,null,"","Tributos (ISS, variável de acordo com o município)",null,null,null,null,null,null,null,"ISS",{"$f":"IF(AND($J97<>$A$145,COUNTA(OFFSET(S100,1,0,6))>0),$R$11*$R$10,0)","v":0},null,"OK",null,null,0,2.5000000000000001E-2,0.05]
[null,null,null,null,null,null,null,null,"","Tributos (Contribuição Previdenciária sobre a Receita Bruta - Lei 12.546 de 14/12/2011 - Desoneração)",null,null,null,null,null,null,null,"CPRB",{"$f":"IF(BDI.Opcao<>\"Desonerado\",0,IF(AND($J97<>$A$145,COUNTA(OFFSET(S100,1,0,6))>0),IF(YEAR(Import.DataBase)<2025,4.5%,IF(YEAR(Import.DataBase)=2025,3.6%,IF(YEAR(Import.DataBase)=2026,2.7%,IF(YEAR(Import.DataBase)=2027,1.8%,0%)))),0%))","v":0},null,"OK",null,null,{"$f":"$S108","v":0},{"$f":"$S108","v":0},{"$f":"$S108","v":0}]
[null,null,null,null,null,null,null,null,"","BDI SEM desoneração (Fórmula Acórdão TCU)",null,null,null,null,null,null,null,"BDI PAD",{"$f":"IF($J97=$A$145,0,ROUND((((1+S101+S102+S103)*(1+S104)*(1+S105)/(1-(S106+S107)))-1),4))","v":0},null,{"$f":"IFERROR(IF(AND(OR(S109>=X109,X109=\"-\"),OR(S109<=Z109,Z109=\"-\")),\"OK\",\"FORA DO INTERVALO\"),IF(S109=0,\"OK\",\"Selecione o Tipo de obra\"))","v":"OK"},null,null,{"$f":"IF($J97=$A$145,0,VLOOKUP(CONCATENATE($J97,\"-\",$R109),$C$2:$G$136,3,FALSE))","v":{"$error":"#N/A"}},{"$f":"IF($J97=$A$145,0,VLOOKUP(CONCATENATE($J97,\"-\",$R109),$C$2:$G$136,4,FALSE))","v":{"$error":"#N/A"}},{"$f":"IF($J97=$A$145,0,VLOOKUP(CONCATENATE($J97,\"-\",$R109),$C$2:$G$136,5,FALSE))","v":{"$error":"#N/A"}}]
[null,null,null,null,null,null,null,null,"","BDI COM desoneração",null,null,null,null,null,null,null,"BDI DES",{"$f":"IF($J97=$A$145,0,ROUND((((1+S101+S102+S103)*(1+S104)*(1+S105)/(1-(S106+S107+S108)))-1),4))","v":0}]
[null,null,null,null,null,null,null,null,""]
[null,null,null,null,null,null,null,null,"",{"$f":"IF(U109<>\"ok\",\"X\",\"\")","v":""},{"$f":"IF(U109<>\"ok\",\"Anexo: Relatório Técnico Circunstanciado justificando a adoção do percentual de cada parcela do BDI.\",\"\")","v":""}]
[null,null,null,null,null,null,null,null,""]
[null,null,null,null,null,null,null,null,"","Os valores de BDI foram calculados com o emprego da fórmula:"]
[null,null,null,null,null,null,null,null,"",null,null,null,"BDI =",{"$f":"IF($J97=$A$146,\"(1+K1+K2)*(1+K3)\",\"(1+AC + S + R + G)*(1 + DF)*(1+L)\")","v":"(1+AC + S + R + G)*(1 + DF)*(1+L)"},null,null," - 1"]
[null,null,null,null,null,null,null,null,"",null,null,null,null,"(1-CP-ISS-CRPB)"]
[null,null,null,null,null,null,null,null,""]
[null,null,null,null,null,null,null,null,"",{"$f":"CONCATENATE(\"Declaro para os devidos fins que, conforme legislação tributária municipal, a base de cálculo deste tipo de obra corresponde à \",$R$10*100,\"%, com a respectiva alíquota de \",$R$11*100,\"%.\")","v":"Declaro para os devidos fins que, conforme legislação tributária municipal, a base de cálculo deste tipo de obra corresponde à 100%, com a respectiva alíquota de 3%."}]
[null,null,null,null,null,null,null,null,""]
[null,null,null,null,null,null,null,null,"",{"$f":"CONCATENATE(\"Declaro para os devidos fins que o regime de Contribuição Previdenciária sobre a Receita Bruta adotado para elaboração do orçamento foi \",IF(DESONERACAO=\"Sim\",\"COM\",\"SEM\"),\" Desoneração, e que esta é a alternativa mais adequada para a Administração Pública.\")","v":"Declaro para os devidos fins que o regime de Contribuição Previdenciária sobre a Receita Bruta adotado para elaboração do orçamento foi SEM Desoneração, e que esta é a alternativa mais adequada para a Administração Pública."}]
[null,null,null,null,null,null,null,null,""]
[null,null,null,null,null,null,null,null,"","Observações:"]
[null,null,null,null,null,null,null,null,""]
[null,null,null,null,null,null,null,null,""]
[null,null,null,null,null,null,null,null,"",{"$f":"Import.Município","v":"SÃO VALENTIM/RS"},null,null,null,null,null,{"$f":"DADOS!$C$25","v":"00:00:00"}]
[null,null,null,null,null,null,null,null,"","Local",null,null,null,null,null,"Data"]
[null,null,null,null,null,null,null,null,""]
[null,null,null,null,null,null,null,null,""]
[null,null,null,null,null,null,null,null,"","Responsável Técnico"]
[null,null,null,null,null,null,null,null,"","Nome:",{"$f":"Import.RespOrçamento","v":0}]
[null,null,null,null,null,null,null,null,"","CREA/CAU:",0]
[null,null,null,null,null,null,null,null,"","ART/RRT:",0]
[]
[]
[]
[]
[]
["(SELECIONAR)"]
["Construção e Reforma de Edifícios"]
["Construção de Praças Urbanas, Rodovias, Ferrovias e recapeamento e pavimentação de vias urbanas"]
["Construção de Redes de Abastecimento de Água, Coleta de Esgoto"]
["Construção e Manutenção de Estações e Redes de Distribuição de Energia Elétrica"]
["Obras Portuárias, Marítimas e Fluviais"]
["Fornecimento de Materiais e Equipamentos (aquisição indireta - em conjunto com licitação de obras)"]
["Fornecimento de Materiais e Equipamentos (aquisição direta)"]
["Estudos e Projetos, Planos e Gerenciamento e outros correlatos"]

{"sheet":"ORÇAMENTO","index":4,"n_rows":44,"n_cols":40,"rows_kept":44,"cut":false,"hidden":false,"merged":[[4,30,4,31],[6,14,6,15],[6,18,6,20],[6,37,10,37],[7,24,11,24],[7,25,11,25],[11,26,11,27],[6,35,10,35],[3,14,3,15],[3,18,3,23],[4,14,4,15],[4,18,4,23],[7,5,7,10],[7,11,11,11],[7,14,7,15],[7,18,7,20],[8,5,8,10],[9,5,9,10],[42,14,42,16],[14,14,14,17],[29,16,29,23],[32,14,34,23],[36,14,36,23],[39,14,39,16],[37,14,37,23]]}
[null,null,null,null,null,null,null,null,null,null,null,null,null,null,null,null,null,"PO - PLANILHA ORÇAMENTÁRIA",null,null,null,null,null,"Grau de Sigilo"]
[null,null,null,"LOTE","Meta","Nível 2","Nível 3","Nível 4","Serviço",null,null,null,null,null,null,null,null,{"$f":"IF(TIPOORCAMENTO=\"licitado\",\"Orçamento Licitado\",\"Orçamento Base para Licitação\")&\" - \"&import.recurso","v":"Orçamento Base para Licitação - OGU"},null,null,null,null,null,"#PUBLICO"]
[null,null,null,null,"SINAPI","SINAPI-I","SICRO","Composição","Cotação"]
["Nmax",null,null,null,null,"BDI 1","BDI 2","BDI 3",0,null,null,null,null,null,"Nº OPERAÇÃO",null,"Nº TransfereGOV","PROPONENTE / TOMADOR","APELIDO DO EMPREENDIMENTO"]
[{"$f":"MAX($C$15:$C$27)","v":2},null,null,null,null,{"$f":"IF(BDI.Opcao=\"DESONERADO\",BDI!$S$30,BDI!$S$29)","v":0.2339},{"$f":"IF(BDI.Opcao=\"DESONERADO\",BDI!$S$70,BDI!$S$69)","v":0},{"$f":"IF(BDI.Opcao=\"DESONERADO\",BDI!$S$110,BDI!$S$109)","v":0},null,null,null,null,null,null,{"$f":"Import.CR","v":0},null,{"$f":"Import.TransfereGOV","v":0},{"$f":"Import.Proponente","v":"MUNICÍPIO DE SÃO VALENTIN"},{"$f":"Import.Apelido","v":"COBERTURA RUA PEDRO DASSOLER"},null,null,null,null,null,null,null,null,null,null,null,"Arredondamento"]
[]
[null,null,null,null,null,"RA","RP","CP","OU",null,null,null,null,null,"LOCALIDADE SINAPI",null,"DATA BASE",{"$f":"IF(TIPOORCAMENTO=\"Licitado\",\"NOME DA EMPRESA\",\"DESCRIÇÃO DO LOTE\")","v":"DESCRIÇÃO DO LOTE"},{"$f":"IF(TIPOORCAMENTO=\"Licitado\",\"REGIME DE EXECUÇÃO\",\"MUNICÍPIO / UF\")","v":"MUNICÍPIO / UF"},null,null,{"$f":"IF(TIPOORCAMENTO=\"Licitado\",\"\",\"BDI 1\")","v":"BDI 1"},{"$f":"IF(TIPOORCAMENTO=\"Licitado\",\"\",\"BDI 2\")","v":"BDI 2"},{"$f":"IF(TIPOORCAMENTO=\"Licitado\",\"Nº CTEF\",\"BDI 3\")","v":"BDI 3"},null,null,null,null,{"$f":"IF(COUNTIFS($L$15:$L$27,\"F\",$AC$15:$AC$27,\"JUSTIFICAR BDI\")>0,\"JUSTIFICAR BDI\",\"\")","v":""},null,"Quantidade",true,null,null,null,"QUANTIDADES: ACOMP. POR BM",null,"PREÇO UNITÁRIO LICITADO"]
[null,null,null,null,"Intervalo de procura:",{"$f":"IF(LEN(INFO(\"release\"))>5,\"'Referência \"&Excel_BuiltIn_Database&\".xlsm'#Banco.$a5:$a$65536\",\"'[Referência \"&Excel_BuiltIn_Database&\".xlsm]Banco'!$a5:$a$65536\")","v":"'[Referência 02-2026.xlsm]Banco'!$a5:$a$65536"},null,null,null,null,null,"FILTRO",null,null,{"$f":"IF(ISERROR(INDIRECT($F$9)),\"(N/D: 'Referência \"&Excel_BuiltIn_Database&\".xlsm)\",INDIRECT($F$9))","v":"(N/D: 'Referência 02-2026.xlsm)"},null,{"$f":"TEXT(Import.DataBase,\"mm-aa\")&IF(DESONERACAO=\"Sim\",\" (DES.)\",\" (N DES.)\")","v":"02-26 (N DES.)"},{"$f":"IF(TIPOORCAMENTO=\"Licitado\",Import.empresa,Import.DescLote)","v":0},{"$f":"IF(TIPOORCAMENTO=\"Licitado\",Import.RegimeExecução,Import.Município)","v":"SÃO VALENTIM/RS"},null,null,{"$f":"IF(TIPOORCAMENTO=\"Licitado\",\"\",TEXT(F5,\"0,00%\"))","v":"23,39%"},{"$f":"IF(TIPOORCAMENTO=\"Licitado\",\"\",TEXT(G5,\"0,00%\"))","v":"0,00%"},{"$f":"IF(TIPOORCAMENTO=\"Licitado\",Import.CTEF,TEXT(H5,\"0,00%\"))","v":"0,00%"},"RECURSO","SGL RECURSO",null,null,null,null,"Custo Unitáro",true]
[null,null,null,null,"Localidade:",{"$f":"IF(LEN(INFO(\"release\"))>5,\"'Referência \"&Excel_BuiltIn_Database&\".xlsm'#Banco.$d$3\",\"'[Referência \"&Excel_BuiltIn_Database&\".xlsm]Banco'!$d$3\")","v":"'[Referência 02-2026.xlsm]Banco'!$d$3"},null,null,null,null,null,null,null,null,null,null,null,null,null,{"$f":"IF(AND(Import.TipoArredondamento=\"TransfereGOV\",$AF$7=FALSE),\"▼\",\"\")","v":""},{"$f":"IF(AND(Import.TipoArredondamento=\"TransfereGOV\",$AF$8=FALSE),\"▼\",\"\")","v":""},{"$f":"IF(AND(Import.TipoArredondamento=\"TransfereGOV\",$AF$9=FALSE),\"▼\",\"\")","v":""},{"$f":"IF(AND(Import.TipoArredondamento=\"TransfereGOV\",$AF$10=FALSE),\"▼\",\"\")","v":""},{"$f":"IF(AND(Import.TipoArredondamento=\"TransfereGOV\",$AF$11=FALSE),\"▼\",\"\")","v":""},null,null,null,null,null,null,"BDI",true]
[null,null,null,null,"Data base:",{"$f":"IF(LEN(INFO(\"release\"))>5,\"'Referência \"&Excel_BuiltIn_Database&\".xlsm'#Banco.$B$3\",\"'[Referência \"&Excel_BuiltIn_Database&\".xlsm]Banco'!$B$3\")","v":"'[Referência 02-2026.xlsm]Banco'!$B$3"},null,null,null,null,null,null,null,null,null,null,null,null,null,null,null,null,null,null,null,null,null,null,"ERRO GERAL",null,"Preço Unitário",true]
[null,null,null,null,null,{"$f":"IFERROR(INDIRECT(F10),\"\")","v":""},{"$f":"IFERROR(TEXT(Import.DataBase,\"mm/aaaa\"),\"\")","v":"02/2026"},null,null,null,null,null,null,null,null,null,null,null,null,null,null,null,null,null,null,null,null,null,{"$f":"IF(COUNTIFS($L$15:$L$27,\"F\",$AC$15:$AC$27,\"<>\"&\" \",$AC$15:$AC$27,\"<>\"&\"JUSTIFICAR BDI\")>0,\"NÃO OK\",\"OK\")","v":"OK"},null,"Preço Total",true]
[null,null,null,null,null,null,null,null,null,null,null,null,null,null,{"$f":"IF(AND(Import.TipoArredondamento=\"TransfereGOV\",COUNTIF($AF$7:$AF$11,TRUE)<>5),\"Para contratos que tramitam no Transferegov todos os valores devem ser arredondados para duas casas decimais\",\n IF(AND($F$11<>\"\",$G$11<>\"\",$F$11<>$G$11),\"O arquivo \"&MID($F$10,2,SEARCH(\"]\",$F$10)-1)&\" está com a data base errada (\"&F11&\"). Corrija a data base antes de continuar.\",\nIF(COUNTIF($AC$15:$AC$27,\"FONTE\")>0,\"Falta preencher a Fonte (coluna P) na Linha \"&(14+MATCH(\"FONTE\",$AC$15:$AC$27,0)),\n IF(COUNTIF($AC$15:$AC$27,\"CÓDIGO\")>0,\"Falta preencher o Código (coluna Q) na Linha \"&(14+MATCH(\"CÓDIGO\",$AC$15:$AC$27,0)),\n IF(COUNTIF($AC$15:$AC$27,\"CÓDIGO N/ID\")>0,\"Código (coluna Q) não identificado na Linha \"&(14+MATCH(\"CÓDIGO N/ID\",$AC$15:$AC$27,0))&\". Verifique se o código está correto ou busque outro código\",\n IF(COUNTIF($AC$15:$AC$27,\"DESCRIÇÃO\")>0,\"Falta preencher a Descrição (coluna R) na Linha \"&(14+MATCH(\"DESCRIÇÃO\",$AC$15:$AC$27,0)),\n IF(COUNTIF($AC$15:$AC$27,\"UNIDADE\")>0,\"Falta preencher a Unidade (coluna S) na Linha \"&(14+MATCH(\"UNIDADE\",$AC$15:$AC$27,0)),\n IF(COUNTIF($AC$15:$AC$27,\"SEM CUSTO\")>0,\"Falta preencher o Custo Unitário (coluna U) na Linha \"&(14+MATCH(\"SEM CUSTO\",$AC$15:$AC$27,0)),\n IF(COUNTIF($AC$15:$AC$27,\"SEM PREÇO\")>0,\"Falta preencher o Preço Unitário licitado (coluna AL) na Linha \"&(14+MATCH(\"SEM CUSTO\",$AC$15:$AC$27,0)),\n IF(COUNTIF($AC$15:$AC$27,\"BDI\")>0,\"Falta definir o BDI (coluna V) na Linha \"&(14+MATCH(\"BDI\",$AC$15:$AC$27,0)),\n IF(COUNTIF($AC$15:$AC$27,\"ACIMA REF.\")>0,\n         IF(TIPOORCAMENTO=\"Proposto\",\"O custo unitário (coluna U) na Linha \"&(14+MATCH(\"ACIMA REF.\",$AC$15:$AC$27,0))&\" está acima do custo referencial (coluna AG)\",\n            \"O preço unitário licitado (coluna AL) na Linha \"&(14+MATCH(\"ACIMA REF.\",$AC$15:$AC$27,0))&\" está acima do preço referencial do edital (coluna AN)\"),\n IF(COUNTIF($AC$15:$AC$27,\"QUANT.\")>0,\"Falta a Quantidade do serviço na Linha \"&(14+MATCH(\"QUANT.\",$AC$15:$AC$27,0))&IF(ACOMPANHAMENTO=\"PLE\",\". Preencher na aba CÁLCULO\",\". Preencher na coluna AJ\"),\n IF(COUNTIF($AC$15:$AC$27,\"Código >13\")>0,\"O tamanho do código do serviço no TransfereGOV é limitado a 13 caracteres. Resuma o código (coluna Q) na Linha \"&(14+MATCH(\"Código >13\",$AC$15:$AC$27,0)),\n IF(COUNTIF($AC$15:$AC$27,\"Descrição >100\")>0,\"O tamanho da descrição de macrosserviço no TransfereGOV é limitado a 100 caracteres. Resuma a descrição (coluna R) na Linha \"&(14+MATCH(\"Descrição >100\",$AC$15:$AC$27,0)),\n IF(COUNTIF($AC$15:$AC$27,\"Descrição >500\")>0,\"O tamanho da descrição de serviço no TransfereGOV é limitado a 500 caracteres. Resuma a descrição (coluna R) na Linha \"&(14+MATCH(\"Descrição >500\",$AC$15:$AC$27,0)),\n IF(COUNTIF($AC$15:$AC$27,\"Unid. Não Disp\")>0,\"Unidade não disponível na lista do TransfereGOV. Reveja a unidade (coluna S) na Linha \"&(14+MATCH(\"Unid. Não Disp\",$AC$15:$AC$27,0)),\n IF(AND(TIPOORCAMENTO=\"Proposto\",LEFT($O$8,5)=\"(N/D:\"),\"Abra o arquivo Referência \"&_xlfn.SINGLE(Excel_BuiltIn_Database)&\".xlsm\",\"\")))))))))))))))))","v":"Abra o arquivo Referência 02-2026.xlsm"},null,null,null,null,null,null,null,null,null,null,null,"Valores não Arredondados",null,null,null,null,null,null,null,null,"↓",null,"↓"]
["Nível E","Save Nivel","Nível C","Altura","n1","n2","n3","n4","n5","Czero","Cnível","↓","Nível","Nível Corrigido","Item","Fonte","Código","Descrição","Unidade","Quantidade",{"$f":"IF(TIPOORCAMENTO=\"Licitado\",\"\",\"Custo Unitário (sem BDI) (R$)\")","v":"Custo Unitário (sem BDI) (R$)"},{"$f":"IF(TIPOORCAMENTO=\"Licitado\",\"\",\"BDI\n(%)\")","v":"BDI\n(%)"},"Preço Unitário (com BDI) (R$)","Preço Total\n(R$)","↓","↓","Contrapartida (R$)","Outros (R$)","Erro de Dados","Lista Crono","Concatenação Fonte-Código","BancoDesloc","Custo Unitário Referência (R$)",{"$f":"IF(TIPOORCAMENTO=\"LICITADO\",\"Valor BDI Edital\",\"Valor BDI\")","v":"Valor BDI"},null,"Quantidade",null,"Preço Unitário (com BDI) (R$)","Preço Total\nLicit. (R$)","Preço Unitário Edital (R$)"]
[{"$f":"CHOOSE(1+LOG(1+2*(ORÇAMENTO.Nivel=\"Meta\")+4*(ORÇAMENTO.Nivel=\"Nível 2\")+8*(ORÇAMENTO.Nivel=\"Nível 3\")+16*(ORÇAMENTO.Nivel=\"Nível 4\")+32*(ORÇAMENTO.Nivel=\"Serviço\"),2),0,1,2,3,4,\"S\")","v":"S"},{"$f":"IF(OR(C14=\"s\",C14=0),OFFSET(B14,-1,0),C14)","v":"Save Nivel"},{"$f":"IF(OFFSET(C14,-1,0)=\"L\",1,IF(OFFSET(C14,-1,0)=1,2,IF(OR(A14=\"s\",A14=0),\"S\",IF(AND(OFFSET(C14,-1,0)=2,A14=4),3,IF(AND(OR(OFFSET(C14,-1,0)=\"s\",OFFSET(C14,-1,0)=0),A14<>\"s\",A14>OFFSET(B14,-1,0)),OFFSET(B14,-1,0),A14)))))","v":"S"},{"$f":"IF(OR(C14=\"S\",C14=0),0,IF(ISERROR(K14),J14,SMALL(J14:K14,1)))","v":0},{"$f":"IF($C14=1,OFFSET(E14,-1,0)+MAX(1,COUNTIF(QCI!$A$13:$A$24,OFFSET(ORÇAMENTO!E14,-1,0))),OFFSET(E14,-1,0))","v":"n1"},{"$f":"IF($C14=1,0,IF($C14=2,OFFSET(F14,-1,0)+1,OFFSET(F14,-1,0)))","v":"n2"},{"$f":"IF(AND($C14<=2,$C14<>0),0,IF($C14=3,OFFSET(G14,-1,0)+1,OFFSET(G14,-1,0)))","v":"n3"},{"$f":"IF(AND($C14<=3,$C14<>0),0,IF($C14=4,OFFSET(H14,-1,0)+1,OFFSET(H14,-1,0)))","v":"n4"},{"$f":"IF(AND($C14<=4,$C14<>0),0,IF(AND($C14=\"S\",$X14>0),OFFSET(I14,-1,0)+1,OFFSET(I14,-1,0)))","v":"n5"},{"$f":"IF(OR($C14=\"S\",$C14=0),0,MATCH(0,OFFSET($D14,1,$C14,ROW($C$27)-ROW($C14)),0))","v":0},{"$f":"IF(OR($C14=\"S\",$C14=0),0,MATCH(OFFSET($D14,0,$C14)+IF($C14<>1,1,COUNTIF(QCI!$A$13:$A$24,ORÇAMENTO!E14)),OFFSET($D14,1,$C14,ROW($C$27)-ROW($C14)),0))","v":0},{"$f":"IF(OR($X14>0,$C14=1,$C14=2,$C14=3,$C14=4),\"F\",\"\")","v":""},"Serviço",{"$f":"CHOOSE(1+LOG(1+2*(C14=1)+4*(C14=2)+8*(C14=3)+16*(C14=4)+32*(C14=\"S\"),2),\"\",\"Meta\",\"Nível 2\",\"Nível 3\",\"Nível 4\",\"Serviço\")","v":"Serviço"},{"$f":"IF(OR($C14=0,$L14=\"\"),\"-\",CONCATENATE(E14&\".\",IF(AND($A$5>=2,$C14>=2),F14&\".\",\"\"),IF(AND($A$5>=3,$C14>=3),G14&\".\",\"\"),IF(AND($A$5>=4,$C14>=4),H14&\".\",\"\"),IF($C14=\"S\",I14&\".\",\"\")))","v":"-"},"SINAPI",null,{"$f":"IF($C14=\"S\",REFERENCIA.Descricao,\"(digite a descrição aqui)\")","v":"(abra o arquivo 'Referência 02-2026.xlsm)"},{"$f":"REFERENCIA.Unidade","v":"-"},{"$f":"OFFSET(CÁLCULO!H$15,ROW($T14)-ROW(T$15),0)","v":0},null,"BDI 1",{"$f":"IF($C14=\"S\",ROUND(IF(TIPOORCAMENTO=\"Proposto\",ORÇAMENTO.CustoUnitario*(1+$AH14),ORÇAMENTO.PrecoUnitarioLicitado),15-13*$AF$10),0)","v":0},{"$f":"IF($C14=\"S\",IF(OR(Import.TipoArredondamento<>\"TransfereGOV\",ACOMPANHAMENTO=\"BM\"),VTOTAL1,SUM(OFFSET(CÁLCULO!$AA$15,ROW($X14)-ROW($X$15),1):OFFSET(CÁLCULO!$AL$15,ROW($X14)-ROW($X$15),-1))),IF($C14=0,0,ROUND(SomaAgrup,15-13*$AF$11)))","v":0},"RA",{"$f":"IF(AND($C14=\"S\",$X14>0),IF(ISBLANK($Y14),\"RA\",LEFT($Y14,2)),\"\")","v":""},{"$f":"IF($C14=\"S\",IF($Z14=\"CP\",$X14,IF($Z14=\"RA\",(($X14)*QCI!$AA$3),0)),SomaAgrup)","v":0},{"$f":"IF($C14=\"S\",IF($Z14=\"OU\",ROUND($X14,2),0),SomaAgrup)","v":0},{"$f":"IF($N14=\"\",\" \",\nIF(AND($C14<>\"S\",OR($R14=\"\",$R14=\"(digite a descrição aqui)\")),\"DESCRIÇÃO\",\nIF(AND($C14=\"S\",OR($Q14<>\"\",$T14>0,$U14>0),$P14=\"\"),\"FONTE\",\nIF(AND($C14=\"S\",$P14<>\"\",OR($T14>0,$U14>0),$Q14=\"\"),\"CÓDIGO\",\nIF(AND($C14=\"S\",$P14<>\"\",$Q14<>\"\",$R14=\"(Código não identificado nas referências)\"),\"CÓDIGO N/ID\",\nIF(AND($C14=\"S\",OR($R14=\"\",$R14=\"(digite a descrição aqui)\"),OR($Q14<>\"\",$T14>0,$U14>0)),\"DESCRIÇÃO\",\nIF(AND($C14=\"S\",$P14<>\"\",$Q14<>\"\",$S14=\"\"),\"UNIDADE\",\nIF(AND($C14=\"S\",$P14<>\"\",$Q14<>\"\",$U14=0),\"SEM CUSTO\",\nIF(AND(_xlfn.SINGLE(TIPOORCAMENTO)=\"Licitado\",$AL14=0,$AN14>0),\"SEM PREÇO\",\nIF(AND($C14=\"S\",$P14<>\"\",$Q14<>\"\",$U14>0,AND($V14<>\"BDI 1\",$V14<>\"BDI 2\",$V14<>\"BDI 3\")),IF(ISNUMBER($V14),\"JUSTIFICAR BDI\",\"BDI\"),\nIF(OR(AND(import.recurso=\"OGU\",TIPOORCAMENTO=\"Proposto\",LEFT($O$8,5)<>\"(N/D:\",$AG14<>\"\",ORÇAMENTO.CustoUnitario>$AG14),AND(TIPOORCAMENTO=\"LICITADO\",ORÇAMENTO.PrecoUnitarioLicitado>$AN14)),\"ACIMA REF.\",\nIF(AND($C14=\"S\",$P14<>\"\",$Q14<>\"\",$T14=0,$U14>0),\"QUANT.\",\nIF(AND(Import.TipoArredondamento=\"TransfereGOV\",$L14=\"F\",$C14=\"S\",LEN($Q14)>13),\"Código >13\",\nIF(AND(Import.TipoArredondamento=\"TransfereGOV\",$L14=\"F\",$C14<>\"S\",LEN($R14)>100),\"Descrição >100\",\nIF(AND(Import.TipoArredondamento=\"TransfereGOV\",$L14=\"F\",$C14=\"S\",LEN($R14)>500),\"Descrição >500\",\nIF(AND(Import.TipoArredondamento=\"TransfereGOV\",$L14=\"F\",$C14=\"S\",LEFT(TRIM(UPPER($P14)),6)<>\"SINAPI\",ISNA(VLOOKUP(TRIM(UPPER($S14)),ListaTgov.Unidades,1,FALSE))),\"Unid. Não Disp\",\n\" \"))))))))))))))))","v":" "},{"$f":"IF(C14<=CRONO.NivelExibicao,MAX($AD$15:OFFSET(AD14,-1,0))+IF($C14<>1,1,MAX(1,COUNTIF(QCI!$A$13:$A$24,OFFSET($E14,-1,0)))),\"\")","v":""},{"$f":"IF(AND($C14=\"S\",ORÇAMENTO.CodBarra<>\"\"),IF(ORÇAMENTO.Fonte=\"\",ORÇAMENTO.CodBarra,CONCATENATE(ORÇAMENTO.Fonte,\" \",ORÇAMENTO.CodBarra)))","v":false},{"$f":"IF(ISERROR(INDIRECT(ORÇAMENTO.BancoRef)),\"(abra o arquivo 'Referência \"&Excel_BuiltIn_Database&\".xlsm)\",IF(OR($C14<>\"S\",ORÇAMENTO.CodBarra=\"\"),\"(Sem Código)\",IF(ISERROR(MATCH($AE14,INDIRECT(ORÇAMENTO.BancoRef),0)),\"(Código não identificado nas referências)\",MATCH($AE14,INDIRECT(ORÇAMENTO.BancoRef),0))))","v":"(abra o arquivo 'Referência 02-2026.xlsm)"},{"$f":"ROUND(IF(DESONERACAO=\"sim\",REFERENCIA.Desonerado,REFERENCIA.NaoDesonerado),2)","v":0},{"$f":"ROUND(IF(ISNUMBER(ORÇAMENTO.OpcaoBDI),ORÇAMENTO.OpcaoBDI,IF(LEFT(ORÇAMENTO.OpcaoBDI,3)=\"BDI\",HLOOKUP(ORÇAMENTO.OpcaoBDI,$F$4:$H$5,2,FALSE),0)),15-11*$AF$9)","v":0.2339},null,null,null,null,{"$f":"$X14","v":0},{"$f":"ROUND(ORÇAMENTO.CustoUnitario*(1+$AH14),2)","v":0}]
[0,null,"L",{"$f":"COUNTA(OFFSET(D15,1,0):D$27)","v":11},0,null,null,null,null,null,null,"F",{"$f":"IF(TIPOORCAMENTO=\"LICITADO\",\"CTEF\",\"LOTE\")","v":"LOTE"},{"$f":"IF(TIPOORCAMENTO=\"LICITADO\",\"CTEF\",\"LOTE\")","v":"LOTE"},{"$f":"Import.DescLote","v":0},null,null,null,null,null,null,null,null,{"$f":"SUMIF(OFFSET($C15,1,0,ROW(X27)-ROW(X15)-1),\"S\",OFFSET(X15,1,0,ROW(X27)-ROW(X15)-1))","v":134660.96},null,{"$f":"IF(AND($C15=\"S\",$X15>0),LEFT($Y15,2),\"\")","v":""},{"$f":"SUMIF(OFFSET($C15,1,0,ROW(AA27)-ROW(AA15)-1),\"S\",OFFSET(AA15,1,0,ROW(AA27)-ROW(AA15)-1))","v":134660.96},{"$f":"SUMIF(OFFSET($C15,1,0,ROW(AB27)-ROW(AB15)-1),\"S\",OFFSET(AB15,1,0,ROW(AB27)-ROW(AB15)-1))","v":0}," ",null,null,null,null,null,null,null,null,null,134660.96]
[{"$f":"CHOOSE(1+LOG(1+2*(ORÇAMENTO.Nivel=\"Meta\")+4*(ORÇAMENTO.Nivel=\"Nível 2\")+8*(ORÇAMENTO.Nivel=\"Nível 3\")+16*(ORÇAMENTO.Nivel=\"Nível 4\")+32*(ORÇAMENTO.Nivel=\"Serviço\"),2),0,1,2,3,4,\"S\")","v":1},{"$f":"IF(OR(C16=\"s\",C16=0),OFFSET(B16,-1,0),C16)","v":1},{"$f":"IF(OFFSET(C16,-1,0)=\"L\",1,IF(OFFSET(C16,-1,0)=1,2,IF(OR(A16=\"s\",A16=0),\"S\",IF(AND(OFFSET(C16,-1,0)=2,A16=4),3,IF(AND(OR(OFFSET(C16,-1,0)=\"s\",OFFSET(C16,-1,0)=0),A16<>\"s\",A16>OFFSET(B16,-1,0)),OFFSET(B16,-1,0),A16)))))","v":1},{"$f":"IF(OR(C16=\"S\",C16=0),0,IF(ISERROR(K16),J16,SMALL(J16:K16,1)))","v":11},{"$f":"IF($C16=1,OFFSET(E16,-1,0)+MAX(1,COUNTIF(QCI!$A$13:$A$24,OFFSET(ORÇAMENTO!E16,-1,0))),OFFSET(E16,-1,0))","v":1},{"$f":"IF($C16=1,0,IF($C16=2,OFFSET(F16,-1,0)+1,OFFSET(F16,-1,0)))","v":0},{"$f":"IF(AND($C16<=2,$C16<>0),0,IF($C16=3,OFFSET(G16,-1,0)+1,OFFSET(G16,-1,0)))","v":0},{"$f":"IF(AND($C16<=3,$C16<>0),0,IF($C16=4,OFFSET(H16,-1,0)+1,OFFSET(H16,-1,0)))","v":0},{"$f":"IF(AND($C16<=4,$C16<>0),0,IF(AND($C16=\"S\",$X16>0),OFFSET(I16,-1,0)+1,OFFSET(I16,-1,0)))","v":0},{"$f":"IF(OR($C16=\"S\",$C16=0),0,MATCH(0,OFFSET($D16,1,$C16,ROW($C$27)-ROW($C16)),0))","v":11},{"$f":"IF(OR($C16=\"S\",$C16=0),0,MATCH(OFFSET($D16,0,$C16)+IF($C16<>1,1,COUNTIF(QCI!$A$13:$A$24,ORÇAMENTO!E16)),OFFSET($D16,1,$C16,ROW($C$27)-ROW($C16)),0))","v":{"$error":"#N/A"}},{"$f":"IF(OR($X16>0,$C16=1,$C16=2,$C16=3,$C16=4),\"F\",\"\")","v":"F"},"Meta",{"$f":"CHOOSE(1+LOG(1+2*(C16=1)+4*(C16=2)+8*(C16=3)+16*(C16=4)+32*(C16=\"S\"),2),\"\",\"Meta\",\"Nível 2\",\"Nível 3\",\"Nível 4\",\"Serviço\")","v":"Meta"},{"$f":"IF(OR($C16=0,$L16=\"\"),\"-\",CONCATENATE(E16&\".\",IF(AND($A$5>=2,$C16>=2),F16&\".\",\"\"),IF(AND($A$5>=3,$C16>=3),G16&\".\",\"\"),IF(AND($A$5>=4,$C16>=4),H16&\".\",\"\"),IF($C16=\"S\",I16&\".\",\"\")))","v":"1."},"SINAPI",null,"COBERTURA RUA PEDRO DASSOLER ",{"$f":"REFERENCIA.Unidade","v":"-"},{"$f":"OFFSET(CÁLCULO!H$15,ROW($T16)-ROW(T$15),0)","v":0},null,"BDI 1",{"$f":"IF($C16=\"S\",ROUND(IF(TIPOORCAMENTO=\"Proposto\",ORÇAMENTO.CustoUnitario*(1+$AH16),ORÇAMENTO.PrecoUnitarioLicitado),15-13*$AF$10),0)","v":0},{"$f":"IF($C16=\"S\",IF(OR(Import.TipoArredondamento<>\"TransfereGOV\",ACOMPANHAMENTO=\"BM\"),VTOTAL1,SUM(OFFSET(CÁLCULO!$AA$15,ROW($X16)-ROW($X$15),1):OFFSET(CÁLCULO!$AL$15,ROW($X16)-ROW($X$15),-1))),IF($C16=0,0,ROUND(SomaAgrup,15-13*$AF$11)))","v":134660.96},"RA",{"$f":"IF(AND($C16=\"S\",$X16>0),IF(ISBLANK($Y16),\"RA\",LEFT($Y16,2)),\"\")","v":""},{"$f":"IF($C16=\"S\",IF($Z16=\"CP\",$X16,IF($Z16=\"RA\",(($X16)*QCI!$AA$3),0)),SomaAgrup)","v":134660.96},{"$f":"IF($C16=\"S\",IF($Z16=\"OU\",ROUND($X16,2),0),SomaAgrup)","v":0},{"$f":"IF($N16=\"\",\" \",\nIF(AND($C16<>\"S\",OR($R16=\"\",$R16=\"(digite a descrição aqui)\")),\"DESCRIÇÃO\",\nIF(AND($C16=\"S\",OR($Q16<>\"\",$T16>0,$U16>0),$P16=\"\"),\"FONTE\",\nIF(AND($C16=\"S\",$P16<>\"\",OR($T16>0,$U16>0),$Q16=\"\"),\"CÓDIGO\",\nIF(AND($C16=\"S\",$P16<>\"\",$Q16<>\"\",$R16=\"(Código não identificado nas referências)\"),\"CÓDIGO N/ID\",\nIF(AND($C16=\"S\",OR($R16=\"\",$R16=\"(digite a descrição aqui)\"),OR($Q16<>\"\",$T16>0,$U16>0)),\"DESCRIÇÃO\",\nIF(AND($C16=\"S\",$P16<>\"\",$Q16<>\"\",$S16=\"\"),\"UNIDADE\",\nIF(AND($C16=\"S\",$P16<>\"\",$Q16<>\"\",$U16=0),\"SEM CUSTO\",\nIF(AND(_xlfn.SINGLE(TIPOORCAMENTO)=\"Licitado\",$AL16=0,$AN16>0),\"SEM PREÇO\",\nIF(AND($C16=\"S\",$P16<>\"\",$Q16<>\"\",$U16>0,AND($V16<>\"BDI 1\",$V16<>\"BDI 2\",$V16<>\"BDI 3\")),IF(ISNUMBER($V16),\"JUSTIFICAR BDI\",\"BDI\"),\nIF(OR(AND(import.recurso=\"OGU\",TIPOORCAMENTO=\"Proposto\",LEFT($O$8,5)<>\"(N/D:\",$AG16<>\"\",ORÇAMENTO.CustoUnitario>$AG16),AND(TIPOORCAMENTO=\"LICITADO\",ORÇAMENTO.PrecoUnitarioLicitado>$AN16)),\"ACIMA REF.\",\nIF(AND($C16=\"S\",$P16<>\"\",$Q16<>\"\",$T16=0,$U16>0),\"QUANT.\",\nIF(AND(Import.TipoArredondamento=\"TransfereGOV\",$L16=\"F\",$C16=\"S\",LEN($Q16)>13),\"Código >13\",\nIF(AND(Import.TipoArredondamento=\"TransfereGOV\",$L16=\"F\",$C16<>\"S\",LEN($R16)>100),\"Descrição >100\",\nIF(AND(Import.TipoArredondamento=\"TransfereGOV\",$L16=\"F\",$C16=\"S\",LEN($R16)>500),\"Descrição >500\",\nIF(AND(Import.TipoArredondamento=\"TransfereGOV\",$L16=\"F\",$C16=\"S\",LEFT(TRIM(UPPER($P16)),6)<>\"SINAPI\",ISNA(VLOOKUP(TRIM(UPPER($S16)),ListaTgov.Unidades,1,FALSE))),\"Unid. Não Disp\",\n\" \"))))))))))))))))","v":" "},{"$f":"IF(C16<=CRONO.NivelExibicao,MAX($AD$15:OFFSET(AD16,-1,0))+IF($C16<>1,1,MAX(1,COUNTIF(QCI!$A$13:$A$24,OFFSET($E16,-1,0)))),\"\")","v":1},{"$f":"IF(AND($C16=\"S\",ORÇAMENTO.CodBarra<>\"\"),IF(ORÇAMENTO.Fonte=\"\",ORÇAMENTO.CodBarra,CONCATENATE(ORÇAMENTO.Fonte,\" \",ORÇAMENTO.CodBarra)))","v":false},{"$f":"IF(ISERROR(INDIRECT(ORÇAMENTO.BancoRef)),\"(abra o arquivo 'Referência \"&Excel_BuiltIn_Database&\".xlsm)\",IF(OR($C16<>\"S\",ORÇAMENTO.CodBarra=\"\"),\"(Sem Código)\",IF(ISERROR(MATCH($AE16,INDIRECT(ORÇAMENTO.BancoRef),0)),\"(Código não identificado nas referências)\",MATCH($AE16,INDIRECT(ORÇAMENTO.BancoRef),0))))","v":"(abra o arquivo 'Referência 02-2026.xlsm)"},{"$f":"ROUND(IF(DESONERACAO=\"sim\",REFERENCIA.Desonerado,REFERENCIA.NaoDesonerado),2)","v":0},{"$f":"ROUND(IF(ISNUMBER(ORÇAMENTO.OpcaoBDI),ORÇAMENTO.OpcaoBDI,IF(LEFT(ORÇAMENTO.OpcaoBDI,3)=\"BDI\",HLOOKUP(ORÇAMENTO.OpcaoBDI,$F$4:$H$5,2,FALSE),0)),15-11*$AF$9)","v":0.2339},null,null,null,null,134660.96,{"$f":"ROUND(ORÇAMENTO.CustoUnitario*(1+$AH16),2)","v":0}]
[2,2,2,2,{"$f":"IF($C17=1,OFFSET(E17,-1,0)+MAX(1,COUNTIF(QCI!$A$13:$A$24,OFFSET(ORÇAMENTO!E17,-1,0))),OFFSET(E17,-1,0))","v":1},1,0,0,0,10,{"$f":"IF(OR($C17=\"S\",$C17=0),0,MATCH(OFFSET($D17,0,$C17)+IF($C17<>1,1,COUNTIF(QCI!$A$13:$A$24,ORÇAMENTO!E17)),OFFSET($D17,1,$C17,ROW($C$27)-ROW($C17)),0))","v":2},"F","Nível 2","Nível 2","1.1.","SINAPI",null,"PILARES PRÉ MOLDADO 20X25 CM",{"$f":"REFERENCIA.Unidade","v":"-"},{"$f":"OFFSET(CÁLCULO!H$15,ROW($T17)-ROW(T$15),0)","v":0},null,"BDI 1",{"$f":"IF($C17=\"S\",ROUND(IF(TIPOORCAMENTO=\"Proposto\",ORÇAMENTO.CustoUnitario*(1+$AH17),ORÇAMENTO.PrecoUnitarioLicitado),15-13*$AF$10),0)","v":0},{"$f":"IF($C17=\"S\",IF(OR(Import.TipoArredondamento<>\"TransfereGOV\",ACOMPANHAMENTO=\"BM\"),VTOTAL1,SUM(OFFSET(CÁLCULO!$AA$15,ROW($X17)-ROW($X$15),1):OFFSET(CÁLCULO!$AL$15,ROW($X17)-ROW($X$15),-1))),IF($C17=0,0,ROUND(SomaAgrup,15-13*$AF$11)))","v":14441.56},"RA","",{"$f":"IF($C17=\"S\",IF($Z17=\"CP\",$X17,IF($Z17=\"RA\",(($X17)*QCI!$AA$3),0)),SomaAgrup)","v":14441.56},0,{"$f":"IF($N17=\"\",\" \",\nIF(AND($C17<>\"S\",OR($R17=\"\",$R17=\"(digite a descrição aqui)\")),\"DESCRIÇÃO\",\nIF(AND($C17=\"S\",OR($Q17<>\"\",$T17>0,$U17>0),$P17=\"\"),\"FONTE\",\nIF(AND($C17=\"S\",$P17<>\"\",OR($T17>0,$U17>0),$Q17=\"\"),\"CÓDIGO\",\nIF(AND($C17=\"S\",$P17<>\"\",$Q17<>\"\",$R17=\"(Código não identificado nas referências)\"),\"CÓDIGO N/ID\",\nIF(AND($C17=\"S\",OR($R17=\"\",$R17=\"(digite a descrição aqui)\"),OR($Q17<>\"\",$T17>0,$U17>0)),\"DESCRIÇÃO\",\nIF(AND($C17=\"S\",$P17<>\"\",$Q17<>\"\",$S17=\"\"),\"UNIDADE\",\nIF(AND($C17=\"S\",$P17<>\"\",$Q17<>\"\",$U17=0),\"SEM CUSTO\",\nIF(AND(_xlfn.SINGLE(TIPOORCAMENTO)=\"Licitado\",$AL17=0,$AN17>0),\"SEM PREÇO\",\nIF(AND($C17=\"S\",$P17<>\"\",$Q17<>\"\",$U17>0,AND($V17<>\"BDI 1\",$V17<>\"BDI 2\",$V17<>\"BDI 3\")),IF(ISNUMBER($V17),\"JUSTIFICAR BDI\",\"BDI\"),\nIF(OR(AND(import.recurso=\"OGU\",TIPOORCAMENTO=\"Proposto\",LEFT($O$8,5)<>\"(N/D:\",$AG17<>\"\",ORÇAMENTO.CustoUnitario>$AG17),AND(TIPOORCAMENTO=\"LICITADO\",ORÇAMENTO.PrecoUnitarioLicitado>$AN17)),\"ACIMA REF.\",\nIF(AND($C17=\"S\",$P17<>\"\",$Q17<>\"\",$T17=0,$U17>0),\"QUANT.\",\nIF(AND(Import.TipoArredondamento=\"TransfereGOV\",$L17=\"F\",$C17=\"S\",LEN($Q17)>13),\"Código >13\",\nIF(AND(Import.TipoArredondamento=\"TransfereGOV\",$L17=\"F\",$C17<>\"S\",LEN($R17)>100),\"Descrição >100\",\nIF(AND(Import.TipoArredondamento=\"TransfereGOV\",$L17=\"F\",$C17=\"S\",LEN($R17)>500),\"Descrição >500\",\nIF(AND(Import.TipoArredondamento=\"TransfereGOV\",$L17=\"F\",$C17=\"S\",LEFT(TRIM(UPPER($P17)),6)<>\"SINAPI\",ISNA(VLOOKUP(TRIM(UPPER($S17)),ListaTgov.Unidades,1,FALSE))),\"Unid. Não Disp\",\n\" \"))))))))))))))))","v":" "},{"$f":"IF(C17<=CRONO.NivelExibicao,MAX($AD$15:OFFSET(AD17,-1,0))+IF($C17<>1,1,MAX(1,COUNTIF(QCI!$A$13:$A$24,OFFSET($E17,-1,0)))),\"\")","v":2},{"$f":"IF(AND($C17=\"S\",ORÇAMENTO.CodBarra<>\"\"),IF(ORÇAMENTO.Fonte=\"\",ORÇAMENTO.CodBarra,CONCATENATE(ORÇAMENTO.Fonte,\" \",ORÇAMENTO.CodBarra)))","v":false},{"$f":"IF(ISERROR(INDIRECT(ORÇAMENTO.BancoRef)),\"(abra o arquivo 'Referência \"&Excel_BuiltIn_Database&\".xlsm)\",IF(OR($C17<>\"S\",ORÇAMENTO.CodBarra=\"\"),\"(Sem Código)\",IF(ISERROR(MATCH($AE17,INDIRECT(ORÇAMENTO.BancoRef),0)),\"(Código não identificado nas referências)\",MATCH($AE17,INDIRECT(ORÇAMENTO.BancoRef),0))))","v":"(abra o arquivo 'Referência 02-2026.xlsm)"},{"$f":"ROUND(IF(DESONERACAO=\"sim\",REFERENCIA.Desonerado,REFERENCIA.NaoDesonerado),2)","v":0},0.2339,null,null,null,null,14441.56,0]
["S",2,"S",0,{"$f":"IF($C18=1,OFFSET(E18,-1,0)+MAX(1,COUNTIF(QCI!$A$13:$A$24,OFFSET(ORÇAMENTO!E18,-1,0))),OFFSET(E18,-1,0))","v":1},1,0,0,1,0,{"$f":"IF(OR($C18=\"S\",$C18=0),0,MATCH(OFFSET($D18,0,$C18)+IF($C18<>1,1,COUNTIF(QCI!$A$13:$A$24,ORÇAMENTO!E18)),OFFSET($D18,1,$C18,ROW($C$27)-ROW($C18)),0))","v":0},"F","Serviço","Serviço","1.1.1.","Cotação","001","PILAR EM CONCRETO PRÉ-MOLDADO 20X25 CM ARMADURA LONGITUDINAL 12,5MM ARMADURA TRANSVERSAL 5,0MM - PÉ DIREITO 4 METROS","UN",{"$f":"OFFSET(CÁLCULO!H$15,ROW($T18)-ROW(T$15),0)","v":14},836,"BDI 1",{"$f":"IF($C18=\"S\",ROUND(IF(TIPOORCAMENTO=\"Proposto\",ORÇAMENTO.CustoUnitario*(1+$AH18),ORÇAMENTO.PrecoUnitarioLicitado),15-13*$AF$10),0)","v":1031.54},{"$f":"IF($C18=\"S\",IF(OR(Import.TipoArredondamento<>\"TransfereGOV\",ACOMPANHAMENTO=\"BM\"),VTOTAL1,SUM(OFFSET(CÁLCULO!$AA$15,ROW($X18)-ROW($X$15),1):OFFSET(CÁLCULO!$AL$15,ROW($X18)-ROW($X$15),-1))),IF($C18=0,0,ROUND(SomaAgrup,15-13*$AF$11)))","v":14441.56},"RA","RA",{"$f":"IF($C18=\"S\",IF($Z18=\"CP\",$X18,IF($Z18=\"RA\",(($X18)*QCI!$AA$3),0)),SomaAgrup)","v":14441.56},0,{"$f":"IF($N18=\"\",\" \",\nIF(AND($C18<>\"S\",OR($R18=\"\",$R18=\"(digite a descrição aqui)\")),\"DESCRIÇÃO\",\nIF(AND($C18=\"S\",OR($Q18<>\"\",$T18>0,$U18>0),$P18=\"\"),\"FONTE\",\nIF(AND($C18=\"S\",$P18<>\"\",OR($T18>0,$U18>0),$Q18=\"\"),\"CÓDIGO\",\nIF(AND($C18=\"S\",$P18<>\"\",$Q18<>\"\",$R18=\"(Código não identificado nas referências)\"),\"CÓDIGO N/ID\",\nIF(AND($C18=\"S\",OR($R18=\"\",$R18=\"(digite a descrição aqui)\"),OR($Q18<>\"\",$T18>0,$U18>0)),\"DESCRIÇÃO\",\nIF(AND($C18=\"S\",$P18<>\"\",$Q18<>\"\",$S18=\"\"),\"UNIDADE\",\nIF(AND($C18=\"S\",$P18<>\"\",$Q18<>\"\",$U18=0),\"SEM CUSTO\",\nIF(AND(_xlfn.SINGLE(TIPOORCAMENTO)=\"Licitado\",$AL18=0,$AN18>0),\"SEM PREÇO\",\nIF(AND($C18=\"S\",$P18<>\"\",$Q18<>\"\",$U18>0,AND($V18<>\"BDI 1\",$V18<>\"BDI 2\",$V18<>\"BDI 3\")),IF(ISNUMBER($V18),\"JUSTIFICAR BDI\",\"BDI\"),\nIF(OR(AND(import.recurso=\"OGU\",TIPOORCAMENTO=\"Proposto\",LEFT($O$8,5)<>\"(N/D:\",$AG18<>\"\",ORÇAMENTO.CustoUnitario>$AG18),AND(TIPOORCAMENTO=\"LICITADO\",ORÇAMENTO.PrecoUnitarioLicitado>$AN18)),\"ACIMA REF.\",\nIF(AND($C18=\"S\",$P18<>\"\",$Q18<>\"\",$T18=0,$U18>0),\"QUANT.\",\nIF(AND(Import.TipoArredondamento=\"TransfereGOV\",$L18=\"F\",$C18=\"S\",LEN($Q18)>13),\"Código >13\",\nIF(AND(Import.TipoArredondamento=\"TransfereGOV\",$L18=\"F\",$C18<>\"S\",LEN($R18)>100),\"Descrição >100\",\nIF(AND(Import.TipoArredondamento=\"TransfereGOV\",$L18=\"F\",$C18=\"S\",LEN($R18)>500),\"Descrição >500\",\nIF(AND(Import.TipoArredondamento=\"TransfereGOV\",$L18=\"F\",$C18=\"S\",LEFT(TRIM(UPPER($P18)),6)<>\"SINAPI\",ISNA(VLOOKUP(TRIM(UPPER($S18)),ListaTgov.Unidades,1,FALSE))),\"Unid. Não Disp\",\n\" \"))))))))))))))))","v":" "},{"$f":"IF(C18<=CRONO.NivelExibicao,MAX($AD$15:OFFSET(AD18,-1,0))+IF($C18<>1,1,MAX(1,COUNTIF(QCI!$A$13:$A$24,OFFSET($E18,-1,0)))),\"\")","v":""},{"$f":"IF(AND($C18=\"S\",ORÇAMENTO.CodBarra<>\"\"),IF(ORÇAMENTO.Fonte=\"\",ORÇAMENTO.CodBarra,CONCATENATE(ORÇAMENTO.Fonte,\" \",ORÇAMENTO.CodBarra)))","v":"Cotação 001"},{"$f":"IF(ISERROR(INDIRECT(ORÇAMENTO.BancoRef)),\"(abra o arquivo 'Referência \"&Excel_BuiltIn_Database&\".xlsm)\",IF(OR($C18<>\"S\",ORÇAMENTO.CodBarra=\"\"),\"(Sem Código)\",IF(ISERROR(MATCH($AE18,INDIRECT(ORÇAMENTO.BancoRef),0)),\"(Código não identificado nas referências)\",MATCH($AE18,INDIRECT(ORÇAMENTO.BancoRef),0))))","v":"(abra o arquivo 'Referência 02-2026.xlsm)"},{"$f":"ROUND(IF(DESONERACAO=\"sim\",REFERENCIA.Desonerado,REFERENCIA.NaoDesonerado),2)","v":0},0.2339,null,null,null,null,14441.56,1031.54]
[2,2,2,8,{"$f":"IF($C19=1,OFFSET(E19,-1,0)+MAX(1,COUNTIF(QCI!$A$13:$A$24,OFFSET(ORÇAMENTO!E19,-1,0))),OFFSET(E19,-1,0))","v":1},2,0,0,0,8,{"$f":"IF(OR($C19=\"S\",$C19=0),0,MATCH(OFFSET($D19,0,$C19)+IF($C19<>1,1,COUNTIF(QCI!$A$13:$A$24,ORÇAMENTO!E19)),OFFSET($D19,1,$C19,ROW($C$27)-ROW($C19)),0))","v":{"$error":"#N/A"}},"F","Nível 2","Nível 2","1.2.","SINAPI",null,"ESTRUTURA E COBERTURA ",{"$f":"REFERENCIA.Unidade","v":"-"},{"$f":"OFFSET(CÁLCULO!H$15,ROW($T19)-ROW(T$15),0)","v":0},null,"BDI 1",{"$f":"IF($C19=\"S\",ROUND(IF(TIPOORCAMENTO=\"Proposto\",ORÇAMENTO.CustoUnitario*(1+$AH19),ORÇAMENTO.PrecoUnitarioLicitado),15-13*$AF$10),0)","v":0},{"$f":"IF($C19=\"S\",IF(OR(Import.TipoArredondamento<>\"TransfereGOV\",ACOMPANHAMENTO=\"BM\"),VTOTAL1,SUM(OFFSET(CÁLCULO!$AA$15,ROW($X19)-ROW($X$15),1):OFFSET(CÁLCULO!$AL$15,ROW($X19)-ROW($X$15),-1))),IF($C19=0,0,ROUND(SomaAgrup,15-13*$AF$11)))","v":120219.4},"RA","",{"$f":"IF($C19=\"S\",IF($Z19=\"CP\",$X19,IF($Z19=\"RA\",(($X19)*QCI!$AA$3),0)),SomaAgrup)","v":120219.4},0,{"$f":"IF($N19=\"\",\" \",\nIF(AND($C19<>\"S\",OR($R19=\"\",$R19=\"(digite a descrição aqui)\")),\"DESCRIÇÃO\",\nIF(AND($C19=\"S\",OR($Q19<>\"\",$T19>0,$U19>0),$P19=\"\"),\"FONTE\",\nIF(AND($C19=\"S\",$P19<>\"\",OR($T19>0,$U19>0),$Q19=\"\"),\"CÓDIGO\",\nIF(AND($C19=\"S\",$P19<>\"\",$Q19<>\"\",$R19=\"(Código não identificado nas referências)\"),\"CÓDIGO N/ID\",\nIF(AND($C19=\"S\",OR($R19=\"\",$R19=\"(digite a descrição aqui)\"),OR($Q19<>\"\",$T19>0,$U19>0)),\"DESCRIÇÃO\",\nIF(AND($C19=\"S\",$P19<>\"\",$Q19<>\"\",$S19=\"\"),\"UNIDADE\",\nIF(AND($C19=\"S\",$P19<>\"\",$Q19<>\"\",$U19=0),\"SEM CUSTO\",\nIF(AND(_xlfn.SINGLE(TIPOORCAMENTO)=\"Licitado\",$AL19=0,$AN19>0),\"SEM PREÇO\",\nIF(AND($C19=\"S\",$P19<>\"\",$Q19<>\"\",$U19>0,AND($V19<>\"BDI 1\",$V19<>\"BDI 2\",$V19<>\"BDI 3\")),IF(ISNUMBER($V19),\"JUSTIFICAR BDI\",\"BDI\"),\nIF(OR(AND(import.recurso=\"OGU\",TIPOORCAMENTO=\"Proposto\",LEFT($O$8,5)<>\"(N/D:\",$AG19<>\"\",ORÇAMENTO.CustoUnitario>$AG19),AND(TIPOORCAMENTO=\"LICITADO\",ORÇAMENTO.PrecoUnitarioLicitado>$AN19)),\"ACIMA REF.\",\nIF(AND($C19=\"S\",$P19<>\"\",$Q19<>\"\",$T19=0,$U19>0),\"QUANT.\",\nIF(AND(Import.TipoArredondamento=\"TransfereGOV\",$L19=\"F\",$C19=\"S\",LEN($Q19)>13),\"Código >13\",\nIF(AND(Import.TipoArredondamento=\"TransfereGOV\",$L19=\"F\",$C19<>\"S\",LEN($R19)>100),\"Descrição >100\",\nIF(AND(Import.TipoArredondamento=\"TransfereGOV\",$L19=\"F\",$C19=\"S\",LEN($R19)>500),\"Descrição >500\",\nIF(AND(Import.TipoArredondamento=\"TransfereGOV\",$L19=\"F\",$C19=\"S\",LEFT(TRIM(UPPER($P19)),6)<>\"SINAPI\",ISNA(VLOOKUP(TRIM(UPPER($S19)),ListaTgov.Unidades,1,FALSE))),\"Unid. Não Disp\",\n\" \"))))))))))))))))","v":" "},{"$f":"IF(C19<=CRONO.NivelExibicao,MAX($AD$15:OFFSET(AD19,-1,0))+IF($C19<>1,1,MAX(1,COUNTIF(QCI!$A$13:$A$24,OFFSET($E19,-1,0)))),\"\")","v":3},{"$f":"IF(AND($C19=\"S\",ORÇAMENTO.CodBarra<>\"\"),IF(ORÇAMENTO.Fonte=\"\",ORÇAMENTO.CodBarra,CONCATENATE(ORÇAMENTO.Fonte,\" \",ORÇAMENTO.CodBarra)))","v":false},{"$f":"IF(ISERROR(INDIRECT(ORÇAMENTO.BancoRef)),\"(abra o arquivo 'Referência \"&Excel_BuiltIn_Database&\".xlsm)\",IF(OR($C19<>\"S\",ORÇAMENTO.CodBarra=\"\"),\"(Sem Código)\",IF(ISERROR(MATCH($AE19,INDIRECT(ORÇAMENTO.BancoRef),0)),\"(Código não identificado nas referências)\",MATCH($AE19,INDIRECT(ORÇAMENTO.BancoRef),0))))","v":"(abra o arquivo 'Referência 02-2026.xlsm)"},{"$f":"ROUND(IF(DESONERACAO=\"sim\",REFERENCIA.Desonerado,REFERENCIA.NaoDesonerado),2)","v":0},0.2339,null,null,null,null,120219.4,0]
["S",2,"S",0,{"$f":"IF($C20=1,OFFSET(E20,-1,0)+MAX(1,COUNTIF(QCI!$A$13:$A$24,OFFSET(ORÇAMENTO!E20,-1,0))),OFFSET(E20,-1,0))","v":1},2,0,0,1,0,{"$f":"IF(OR($C20=\"S\",$C20=0),0,MATCH(OFFSET($D20,0,$C20)+IF($C20<>1,1,COUNTIF(QCI!$A$13:$A$24,ORÇAMENTO!E20)),OFFSET($D20,1,$C20,ROW($C$27)-ROW($C20)),0))","v":0},"F","Serviço","Serviço","1.2.1.","Cotação","002",{"$f":"IF($C20=\"S\",REFERENCIA.Descricao,\"(digite a descrição aqui)\")","v":"(abra o arquivo 'Referência 02-2026.xlsm)"},"M",{"$f":"OFFSET(CÁLCULO!H$15,ROW($T20)-ROW(T$15),0)","v":68},125,"BDI 1",{"$f":"IF($C20=\"S\",ROUND(IF(TIPOORCAMENTO=\"Proposto\",ORÇAMENTO.CustoUnitario*(1+$AH20),ORÇAMENTO.PrecoUnitarioLicitado),15-13*$AF$10),0)","v":154.24},{"$f":"IF($C20=\"S\",IF(OR(Import.TipoArredondamento<>\"TransfereGOV\",ACOMPANHAMENTO=\"BM\"),VTOTAL1,SUM(OFFSET(CÁLCULO!$AA$15,ROW($X20)-ROW($X$15),1):OFFSET(CÁLCULO!$AL$15,ROW($X20)-ROW($X$15),-1))),IF($C20=0,0,ROUND(SomaAgrup,15-13*$AF$11)))","v":10488.32},"RA","RA",{"$f":"IF($C20=\"S\",IF($Z20=\"CP\",$X20,IF($Z20=\"RA\",(($X20)*QCI!$AA$3),0)),SomaAgrup)","v":10488.32},0,{"$f":"IF($N20=\"\",\" \",\nIF(AND($C20<>\"S\",OR($R20=\"\",$R20=\"(digite a descrição aqui)\")),\"DESCRIÇÃO\",\nIF(AND($C20=\"S\",OR($Q20<>\"\",$T20>0,$U20>0),$P20=\"\"),\"FONTE\",\nIF(AND($C20=\"S\",$P20<>\"\",OR($T20>0,$U20>0),$Q20=\"\"),\"CÓDIGO\",\nIF(AND($C20=\"S\",$P20<>\"\",$Q20<>\"\",$R20=\"(Código não identificado nas referências)\"),\"CÓDIGO N/ID\",\nIF(AND($C20=\"S\",OR($R20=\"\",$R20=\"(digite a descrição aqui)\"),OR($Q20<>\"\",$T20>0,$U20>0)),\"DESCRIÇÃO\",\nIF(AND($C20=\"S\",$P20<>\"\",$Q20<>\"\",$S20=\"\"),\"UNIDADE\",\nIF(AND($C20=\"S\",$P20<>\"\",$Q20<>\"\",$U20=0),\"SEM CUSTO\",\nIF(AND(_xlfn.SINGLE(TIPOORCAMENTO)=\"Licitado\",$AL20=0,$AN20>0),\"SEM PREÇO\",\nIF(AND($C20=\"S\",$P20<>\"\",$Q20<>\"\",$U20>0,AND($V20<>\"BDI 1\",$V20<>\"BDI 2\",$V20<>\"BDI 3\")),IF(ISNUMBER($V20),\"JUSTIFICAR BDI\",\"BDI\"),\nIF(OR(AND(import.recurso=\"OGU\",TIPOORCAMENTO=\"Proposto\",LEFT($O$8,5)<>\"(N/D:\",$AG20<>\"\",ORÇAMENTO.CustoUnitario>$AG20),AND(TIPOORCAMENTO=\"LICITADO\",ORÇAMENTO.PrecoUnitarioLicitado>$AN20)),\"ACIMA REF.\",\nIF(AND($C20=\"S\",$P20<>\"\",$Q20<>\"\",$T20=0,$U20>0),\"QUANT.\",\nIF(AND(Import.TipoArredondamento=\"TransfereGOV\",$L20=\"F\",$C20=\"S\",LEN($Q20)>13),\"Código >13\",\nIF(AND(Import.TipoArredondamento=\"TransfereGOV\",$L20=\"F\",$C20<>\"S\",LEN($R20)>100),\"Descrição >100\",\nIF(AND(Import.TipoArredondamento=\"TransfereGOV\",$L20=\"F\",$C20=\"S\",LEN($R20)>500),\"Descrição >500\",\nIF(AND(Import.TipoArredondamento=\"TransfereGOV\",$L20=\"F\",$C20=\"S\",LEFT(TRIM(UPPER($P20)),6)<>\"SINAPI\",ISNA(VLOOKUP(TRIM(UPPER($S20)),ListaTgov.Unidades,1,FALSE))),\"Unid. Não Disp\",\n\" \"))))))))))))))))","v":" "},{"$f":"IF(C20<=CRONO.NivelExibicao,MAX($AD$15:OFFSET(AD20,-1,0))+IF($C20<>1,1,MAX(1,COUNTIF(QCI!$A$13:$A$24,OFFSET($E20,-1,0)))),\"\")","v":""},{"$f":"IF(AND($C20=\"S\",ORÇAMENTO.CodBarra<>\"\"),IF(ORÇAMENTO.Fonte=\"\",ORÇAMENTO.CodBarra,CONCATENATE(ORÇAMENTO.Fonte,\" \",ORÇAMENTO.CodBarra)))","v":"Cotação 002"},{"$f":"IF(ISERROR(INDIRECT(ORÇAMENTO.BancoRef)),\"(abra o arquivo 'Referência \"&Excel_BuiltIn_Database&\".xlsm)\",IF(OR($C20<>\"S\",ORÇAMENTO.CodBarra=\"\"),\"(Sem Código)\",IF(ISERROR(MATCH($AE20,INDIRECT(ORÇAMENTO.BancoRef),0)),\"(Código não identificado nas referências)\",MATCH($AE20,INDIRECT(ORÇAMENTO.BancoRef),0))))","v":"(abra o arquivo 'Referência 02-2026.xlsm)"},{"$f":"ROUND(IF(DESONERACAO=\"sim\",REFERENCIA.Desonerado,REFERENCIA.NaoDesonerado),2)","v":0},0.2339,null,null,null,null,{"$f":"$X20","v":10488.32},154.24]
["S",2,"S",0,{"$f":"IF($C21=1,OFFSET(E21,-1,0)+MAX(1,COUNTIF(QCI!$A$13:$A$24,OFFSET(ORÇAMENTO!E21,-1,0))),OFFSET(E21,-1,0))","v":1},2,0,0,2,0,{"$f":"IF(OR($C21=\"S\",$C21=0),0,MATCH(OFFSET($D21,0,$C21)+IF($C21<>1,1,COUNTIF(QCI!$A$13:$A$24,ORÇAMENTO!E21)),OFFSET($D21,1,$C21,ROW($C$27)-ROW($C21)),0))","v":0},"F","Serviço","Serviço","1.2.2.","Cotação","003",{"$f":"IF($C21=\"S\",REFERENCIA.Descricao,\"(digite a descrição aqui)\")","v":"(abra o arquivo 'Referência 02-2026.xlsm)"},"UN",{"$f":"OFFSET(CÁLCULO!H$15,ROW($T21)-ROW(T$15),0)","v":8},1850,"BDI 1",{"$f":"IF($C21=\"S\",ROUND(IF(TIPOORCAMENTO=\"Proposto\",ORÇAMENTO.CustoUnitario*(1+$AH21),ORÇAMENTO.PrecoUnitarioLicitado),15-13*$AF$10),0)","v":2282.7199999999998},{"$f":"IF($C21=\"S\",IF(OR(Import.TipoArredondamento<>\"TransfereGOV\",ACOMPANHAMENTO=\"BM\"),VTOTAL1,SUM(OFFSET(CÁLCULO!$AA$15,ROW($X21)-ROW($X$15),1):OFFSET(CÁLCULO!$AL$15,ROW($X21)-ROW($X$15),-1))),IF($C21=0,0,ROUND(SomaAgrup,15-13*$AF$11)))","v":18261.759999999998},"RA","RA",{"$f":"IF($C21=\"S\",IF($Z21=\"CP\",$X21,IF($Z21=\"RA\",(($X21)*QCI!$AA$3),0)),SomaAgrup)","v":18261.759999999998},0,{"$f":"IF($N21=\"\",\" \",\nIF(AND($C21<>\"S\",OR($R21=\"\",$R21=\"(digite a descrição aqui)\")),\"DESCRIÇÃO\",\nIF(AND($C21=\"S\",OR($Q21<>\"\",$T21>0,$U21>0),$P21=\"\"),\"FONTE\",\nIF(AND($C21=\"S\",$P21<>\"\",OR($T21>0,$U21>0),$Q21=\"\"),\"CÓDIGO\",\nIF(AND($C21=\"S\",$P21<>\"\",$Q21<>\"\",$R21=\"(Código não identificado nas referências)\"),\"CÓDIGO N/ID\",\nIF(AND($C21=\"S\",OR($R21=\"\",$R21=\"(digite a descrição aqui)\"),OR($Q21<>\"\",$T21>0,$U21>0)),\"DESCRIÇÃO\",\nIF(AND($C21=\"S\",$P21<>\"\",$Q21<>\"\",$S21=\"\"),\"UNIDADE\",\nIF(AND($C21=\"S\",$P21<>\"\",$Q21<>\"\",$U21=0),\"SEM CUSTO\",\nIF(AND(_xlfn.SINGLE(TIPOORCAMENTO)=\"Licitado\",$AL21=0,$AN21>0),\"SEM PREÇO\",\nIF(AND($C21=\"S\",$P21<>\"\",$Q21<>\"\",$U21>0,AND($V21<>\"BDI 1\",$V21<>\"BDI 2\",$V21<>\"BDI 3\")),IF(ISNUMBER($V21),\"JUSTIFICAR BDI\",\"BDI\"),\nIF(OR(AND(import.recurso=\"OGU\",TIPOORCAMENTO=\"Proposto\",LEFT($O$8,5)<>\"(N/D:\",$AG21<>\"\",ORÇAMENTO.CustoUnitario>$AG21),AND(TIPOORCAMENTO=\"LICITADO\",ORÇAMENTO.PrecoUnitarioLicitado>$AN21)),\"ACIMA REF.\",\nIF(AND($C21=\"S\",$P21<>\"\",$Q21<>\"\",$T21=0,$U21>0),\"QUANT.\",\nIF(AND(Import.TipoArredondamento=\"TransfereGOV\",$L21=\"F\",$C21=\"S\",LEN($Q21)>13),\"Código >13\",\nIF(AND(Import.TipoArredondamento=\"TransfereGOV\",$L21=\"F\",$C21<>\"S\",LEN($R21)>100),\"Descrição >100\",\nIF(AND(Import.TipoArredondamento=\"TransfereGOV\",$L21=\"F\",$C21=\"S\",LEN($R21)>500),\"Descrição >500\",\nIF(AND(Import.TipoArredondamento=\"TransfereGOV\",$L21=\"F\",$C21=\"S\",LEFT(TRIM(UPPER($P21)),6)<>\"SINAPI\",ISNA(VLOOKUP(TRIM(UPPER($S21)),ListaTgov.Unidades,1,FALSE))),\"Unid. Não Disp\",\n\" \"))))))))))))))))","v":" "},{"$f":"IF(C21<=CRONO.NivelExibicao,MAX($AD$15:OFFSET(AD21,-1,0))+IF($C21<>1,1,MAX(1,COUNTIF(QCI!$A$13:$A$24,OFFSET($E21,-1,0)))),\"\")","v":""},{"$f":"IF(AND($C21=\"S\",ORÇAMENTO.CodBarra<>\"\"),IF(ORÇAMENTO.Fonte=\"\",ORÇAMENTO.CodBarra,CONCATENATE(ORÇAMENTO.Fonte,\" \",ORÇAMENTO.CodBarra)))","v":"Cotação 003"},{"$f":"IF(ISERROR(INDIRECT(ORÇAMENTO.BancoRef)),\"(abra o arquivo 'Referência \"&Excel_BuiltIn_Database&\".xlsm)\",IF(OR($C21<>\"S\",ORÇAMENTO.CodBarra=\"\"),\"(Sem Código)\",IF(ISERROR(MATCH($AE21,INDIRECT(ORÇAMENTO.BancoRef),0)),\"(Código não identificado nas referências)\",MATCH($AE21,INDIRECT(ORÇAMENTO.BancoRef),0))))","v":"(abra o arquivo 'Referência 02-2026.xlsm)"},{"$f":"ROUND(IF(DESONERACAO=\"sim\",REFERENCIA.Desonerado,REFERENCIA.NaoDesonerado),2)","v":0},0.2339,null,null,null,null,18261.759999999998,2282.7199999999998]
["S",2,"S",0,{"$f":"IF($C22=1,OFFSET(E22,-1,0)+MAX(1,COUNTIF(QCI!$A$13:$A$24,OFFSET(ORÇAMENTO!E22,-1,0))),OFFSET(E22,-1,0))","v":1},2,0,0,3,0,{"$f":"IF(OR($C22=\"S\",$C22=0),0,MATCH(OFFSET($D22,0,$C22)+IF($C22<>1,1,COUNTIF(QCI!$A$13:$A$24,ORÇAMENTO!E22)),OFFSET($D22,1,$C22,ROW($C$27)-ROW($C22)),0))","v":0},"F","Serviço","Serviço","1.2.3.","Cotação","004",{"$f":"IF($C22=\"S\",REFERENCIA.Descricao,\"(digite a descrição aqui)\")","v":"(abra o arquivo 'Referência 02-2026.xlsm)"},"M",{"$f":"OFFSET(CÁLCULO!H$15,ROW($T22)-ROW(T$15),0)","v":578},23,"BDI 1",{"$f":"IF($C22=\"S\",ROUND(IF(TIPOORCAMENTO=\"Proposto\",ORÇAMENTO.CustoUnitario*(1+$AH22),ORÇAMENTO.PrecoUnitarioLicitado),15-13*$AF$10),0)","v":28.38},{"$f":"IF($C22=\"S\",IF(OR(Import.TipoArredondamento<>\"TransfereGOV\",ACOMPANHAMENTO=\"BM\"),VTOTAL1,SUM(OFFSET(CÁLCULO!$AA$15,ROW($X22)-ROW($X$15),1):OFFSET(CÁLCULO!$AL$15,ROW($X22)-ROW($X$15),-1))),IF($C22=0,0,ROUND(SomaAgrup,15-13*$AF$11)))","v":16403.64},"RA","RA",{"$f":"IF($C22=\"S\",IF($Z22=\"CP\",$X22,IF($Z22=\"RA\",(($X22)*QCI!$AA$3),0)),SomaAgrup)","v":16403.64},0,{"$f":"IF($N22=\"\",\" \",\nIF(AND($C22<>\"S\",OR($R22=\"\",$R22=\"(digite a descrição aqui)\")),\"DESCRIÇÃO\",\nIF(AND($C22=\"S\",OR($Q22<>\"\",$T22>0,$U22>0),$P22=\"\"),\"FONTE\",\nIF(AND($C22=\"S\",$P22<>\"\",OR($T22>0,$U22>0),$Q22=\"\"),\"CÓDIGO\",\nIF(AND($C22=\"S\",$P22<>\"\",$Q22<>\"\",$R22=\"(Código não identificado nas referências)\"),\"CÓDIGO N/ID\",\nIF(AND($C22=\"S\",OR($R22=\"\",$R22=\"(digite a descrição aqui)\"),OR($Q22<>\"\",$T22>0,$U22>0)),\"DESCRIÇÃO\",\nIF(AND($C22=\"S\",$P22<>\"\",$Q22<>\"\",$S22=\"\"),\"UNIDADE\",\nIF(AND($C22=\"S\",$P22<>\"\",$Q22<>\"\",$U22=0),\"SEM CUSTO\",\nIF(AND(_xlfn.SINGLE(TIPOORCAMENTO)=\"Licitado\",$AL22=0,$AN22>0),\"SEM PREÇO\",\nIF(AND($C22=\"S\",$P22<>\"\",$Q22<>\"\",$U22>0,AND($V22<>\"BDI 1\",$V22<>\"BDI 2\",$V22<>\"BDI 3\")),IF(ISNUMBER($V22),\"JUSTIFICAR BDI\",\"BDI\"),\nIF(OR(AND(import.recurso=\"OGU\",TIPOORCAMENTO=\"Proposto\",LEFT($O$8,5)<>\"(N/D:\",$AG22<>\"\",ORÇAMENTO.CustoUnitario>$AG22),AND(TIPOORCAMENTO=\"LICITADO\",ORÇAMENTO.PrecoUnitarioLicitado>$AN22)),\"ACIMA REF.\",\nIF(AND($C22=\"S\",$P22<>\"\",$Q22<>\"\",$T22=0,$U22>0),\"QUANT.\",\nIF(AND(Import.TipoArredondamento=\"TransfereGOV\",$L22=\"F\",$C22=\"S\",LEN($Q22)>13),\"Código >13\",\nIF(AND(Import.TipoArredondamento=\"TransfereGOV\",$L22=\"F\",$C22<>\"S\",LEN($R22)>100),\"Descrição >100\",\nIF(AND(Import.TipoArredondamento=\"TransfereGOV\",$L22=\"F\",$C22=\"S\",LEN($R22)>500),\"Descrição >500\",\nIF(AND(Import.TipoArredondamento=\"TransfereGOV\",$L22=\"F\",$C22=\"S\",LEFT(TRIM(UPPER($P22)),6)<>\"SINAPI\",ISNA(VLOOKUP(TRIM(UPPER($S22)),ListaTgov.Unidades,1,FALSE))),\"Unid. Não Disp\",\n\" \"))))))))))))))))","v":" "},{"$f":"IF(C22<=CRONO.NivelExibicao,MAX($AD$15:OFFSET(AD22,-1,0))+IF($C22<>1,1,MAX(1,COUNTIF(QCI!$A$13:$A$24,OFFSET($E22,-1,0)))),\"\")","v":""},{"$f":"IF(AND($C22=\"S\",ORÇAMENTO.CodBarra<>\"\"),IF(ORÇAMENTO.Fonte=\"\",ORÇAMENTO.CodBarra,CONCATENATE(ORÇAMENTO.Fonte,\" \",ORÇAMENTO.CodBarra)))","v":"Cotação 004"},{"$f":"IF(ISERROR(INDIRECT(ORÇAMENTO.BancoRef)),\"(abra o arquivo 'Referência \"&Excel_BuiltIn_Database&\".xlsm)\",IF(OR($C22<>\"S\",ORÇAMENTO.CodBarra=\"\"),\"(Sem Código)\",IF(ISERROR(MATCH($AE22,INDIRECT(ORÇAMENTO.BancoRef),0)),\"(Código não identificado nas referências)\",MATCH($AE22,INDIRECT(ORÇAMENTO.BancoRef),0))))","v":"(abra o arquivo 'Referência 02-2026.xlsm)"},{"$f":"ROUND(IF(DESONERACAO=\"sim\",REFERENCIA.Desonerado,REFERENCIA.NaoDesonerado),2)","v":0},0.2339,null,null,null,null,16403.64,28.38]
["S",2,"S",0,{"$f":"IF($C23=1,OFFSET(E23,-1,0)+MAX(1,COUNTIF(QCI!$A$13:$A$24,OFFSET(ORÇAMENTO!E23,-1,0))),OFFSET(E23,-1,0))","v":1},2,0,0,4,0,{"$f":"IF(OR($C23=\"S\",$C23=0),0,MATCH(OFFSET($D23,0,$C23)+IF($C23<>1,1,COUNTIF(QCI!$A$13:$A$24,ORÇAMENTO!E23)),OFFSET($D23,1,$C23,ROW($C$27)-ROW($C23)),0))","v":0},"F","Serviço","Serviço","1.2.4.","SINAPI","94213",{"$f":"IF($C23=\"S\",REFERENCIA.Descricao,\"(digite a descrição aqui)\")","v":"(abra o arquivo 'Referência 02-2026.xlsm)"},"M2",{"$f":"OFFSET(CÁLCULO!H$15,ROW($T23)-ROW(T$15),0)","v":656},58.99,"BDI 1",{"$f":"IF($C23=\"S\",ROUND(IF(TIPOORCAMENTO=\"Proposto\",ORÇAMENTO.CustoUnitario*(1+$AH23),ORÇAMENTO.PrecoUnitarioLicitado),15-13*$AF$10),0)","v":72.790000000000006},{"$f":"IF($C23=\"S\",IF(OR(Import.TipoArredondamento<>\"TransfereGOV\",ACOMPANHAMENTO=\"BM\"),VTOTAL1,SUM(OFFSET(CÁLCULO!$AA$15,ROW($X23)-ROW($X$15),1):OFFSET(CÁLCULO!$AL$15,ROW($X23)-ROW($X$15),-1))),IF($C23=0,0,ROUND(SomaAgrup,15-13*$AF$11)))","v":47750.239999999998},"RA","RA",{"$f":"IF($C23=\"S\",IF($Z23=\"CP\",$X23,IF($Z23=\"RA\",(($X23)*QCI!$AA$3),0)),SomaAgrup)","v":47750.239999999998},0,{"$f":"IF($N23=\"\",\" \",\nIF(AND($C23<>\"S\",OR($R23=\"\",$R23=\"(digite a descrição aqui)\")),\"DESCRIÇÃO\",\nIF(AND($C23=\"S\",OR($Q23<>\"\",$T23>0,$U23>0),$P23=\"\"),\"FONTE\",\nIF(AND($C23=\"S\",$P23<>\"\",OR($T23>0,$U23>0),$Q23=\"\"),\"CÓDIGO\",\nIF(AND($C23=\"S\",$P23<>\"\",$Q23<>\"\",$R23=\"(Código não identificado nas referências)\"),\"CÓDIGO N/ID\",\nIF(AND($C23=\"S\",OR($R23=\"\",$R23=\"(digite a descrição aqui)\"),OR($Q23<>\"\",$T23>0,$U23>0)),\"DESCRIÇÃO\",\nIF(AND($C23=\"S\",$P23<>\"\",$Q23<>\"\",$S23=\"\"),\"UNIDADE\",\nIF(AND($C23=\"S\",$P23<>\"\",$Q23<>\"\",$U23=0),\"SEM CUSTO\",\nIF(AND(_xlfn.SINGLE(TIPOORCAMENTO)=\"Licitado\",$AL23=0,$AN23>0),\"SEM PREÇO\",\nIF(AND($C23=\"S\",$P23<>\"\",$Q23<>\"\",$U23>0,AND($V23<>\"BDI 1\",$V23<>\"BDI 2\",$V23<>\"BDI 3\")),IF(ISNUMBER($V23),\"JUSTIFICAR BDI\",\"BDI\"),\nIF(OR(AND(import.recurso=\"OGU\",TIPOORCAMENTO=\"Proposto\",LEFT($O$8,5)<>\"(N/D:\",$AG23<>\"\",ORÇAMENTO.CustoUnitario>$AG23),AND(TIPOORCAMENTO=\"LICITADO\",ORÇAMENTO.PrecoUnitarioLicitado>$AN23)),\"ACIMA REF.\",\nIF(AND($C23=\"S\",$P23<>\"\",$Q23<>\"\",$T23=0,$U23>0),\"QUANT.\",\nIF(AND(Import.TipoArredondamento=\"TransfereGOV\",$L23=\"F\",$C23=\"S\",LEN($Q23)>13),\"Código >13\",\nIF(AND(Import.TipoArredondamento=\"TransfereGOV\",$L23=\"F\",$C23<>\"S\",LEN($R23)>100),\"Descrição >100\",\nIF(AND(Import.TipoArredondamento=\"TransfereGOV\",$L23=\"F\",$C23=\"S\",LEN($R23)>500),\"Descrição >500\",\nIF(AND(Import.TipoArredondamento=\"TransfereGOV\",$L23=\"F\",$C23=\"S\",LEFT(TRIM(UPPER($P23)),6)<>\"SINAPI\",ISNA(VLOOKUP(TRIM(UPPER($S23)),ListaTgov.Unidades,1,FALSE))),\"Unid. Não Disp\",\n\" \"))))))))))))))))","v":" "},{"$f":"IF(C23<=CRONO.NivelExibicao,MAX($AD$15:OFFSET(AD23,-1,0))+IF($C23<>1,1,MAX(1,COUNTIF(QCI!$A$13:$A$24,OFFSET($E23,-1,0)))),\"\")","v":""},{"$f":"IF(AND($C23=\"S\",ORÇAMENTO.CodBarra<>\"\"),IF(ORÇAMENTO.Fonte=\"\",ORÇAMENTO.CodBarra,CONCATENATE(ORÇAMENTO.Fonte,\" \",ORÇAMENTO.CodBarra)))","v":"SINAPI 94213"},{"$f":"IF(ISERROR(INDIRECT(ORÇAMENTO.BancoRef)),\"(abra o arquivo 'Referência \"&Excel_BuiltIn_Database&\".xlsm)\",IF(OR($C23<>\"S\",ORÇAMENTO.CodBarra=\"\"),\"(Sem Código)\",IF(ISERROR(MATCH($AE23,INDIRECT(ORÇAMENTO.BancoRef),0)),\"(Código não identificado nas referências)\",MATCH($AE23,INDIRECT(ORÇAMENTO.BancoRef),0))))","v":"(abra o arquivo 'Referência 02-2026.xlsm)"},{"$f":"ROUND(IF(DESONERACAO=\"sim\",REFERENCIA.Desonerado,REFERENCIA.NaoDesonerado),2)","v":0},0.2339,null,null,null,null,47750.239999999998,72.790000000000006]
[{"$f":"CHOOSE(1+LOG(1+2*(ORÇAMENTO.Nivel=\"Meta\")+4*(ORÇAMENTO.Nivel=\"Nível 2\")+8*(ORÇAMENTO.Nivel=\"Nível 3\")+16*(ORÇAMENTO.Nivel=\"Nível 4\")+32*(ORÇAMENTO.Nivel=\"Serviço\"),2),0,1,2,3,4,\"S\")","v":"S"},{"$f":"IF(OR(C24=\"s\",C24=0),OFFSET(B24,-1,0),C24)","v":2},{"$f":"IF(OFFSET(C24,-1,0)=\"L\",1,IF(OFFSET(C24,-1,0)=1,2,IF(OR(A24=\"s\",A24=0),\"S\",IF(AND(OFFSET(C24,-1,0)=2,A24=4),3,IF(AND(OR(OFFSET(C24,-1,0)=\"s\",OFFSET(C24,-1,0)=0),A24<>\"s\",A24>OFFSET(B24,-1,0)),OFFSET(B24,-1,0),A24)))))","v":"S"},{"$f":"IF(OR(C24=\"S\",C24=0),0,IF(ISERROR(K24),J24,SMALL(J24:K24,1)))","v":0},{"$f":"IF($C24=1,OFFSET(E24,-1,0)+MAX(1,COUNTIF(QCI!$A$13:$A$24,OFFSET(ORÇAMENTO!E24,-1,0))),OFFSET(E24,-1,0))","v":1},{"$f":"IF($C24=1,0,IF($C24=2,OFFSET(F24,-1,0)+1,OFFSET(F24,-1,0)))","v":2},{"$f":"IF(AND($C24<=2,$C24<>0),0,IF($C24=3,OFFSET(G24,-1,0)+1,OFFSET(G24,-1,0)))","v":0},{"$f":"IF(AND($C24<=3,$C24<>0),0,IF($C24=4,OFFSET(H24,-1,0)+1,OFFSET(H24,-1,0)))","v":0},{"$f":"IF(AND($C24<=4,$C24<>0),0,IF(AND($C24=\"S\",$X24>0),OFFSET(I24,-1,0)+1,OFFSET(I24,-1,0)))","v":5},0,{"$f":"IF(OR($C24=\"S\",$C24=0),0,MATCH(OFFSET($D24,0,$C24)+IF($C24<>1,1,COUNTIF(QCI!$A$13:$A$24,ORÇAMENTO!E24)),OFFSET($D24,1,$C24,ROW($C$27)-ROW($C24)),0))","v":0},{"$f":"IF(OR($X24>0,$C24=1,$C24=2,$C24=3,$C24=4),\"F\",\"\")","v":"F"},"Serviço",{"$f":"CHOOSE(1+LOG(1+2*(C24=1)+4*(C24=2)+8*(C24=3)+16*(C24=4)+32*(C24=\"S\"),2),\"\",\"Meta\",\"Nível 2\",\"Nível 3\",\"Nível 4\",\"Serviço\")","v":"Serviço"},{"$f":"IF(OR($C24=0,$L24=\"\"),\"-\",CONCATENATE(E24&\".\",IF(AND($A$5>=2,$C24>=2),F24&\".\",\"\"),IF(AND($A$5>=3,$C24>=3),G24&\".\",\"\"),IF(AND($A$5>=4,$C24>=4),H24&\".\",\"\"),IF($C24=\"S\",I24&\".\",\"\")))","v":"1.2.5."},"SINAPI","94227",{"$f":"IF($C24=\"S\",REFERENCIA.Descricao,\"(digite a descrição aqui)\")","v":"(abra o arquivo 'Referência 02-2026.xlsm)"},{"$f":"REFERENCIA.Unidade","v":"-"},{"$f":"OFFSET(CÁLCULO!H$15,ROW($T24)-ROW(T$15),0)","v":70},75.19,"BDI 1",{"$f":"IF($C24=\"S\",ROUND(IF(TIPOORCAMENTO=\"Proposto\",ORÇAMENTO.CustoUnitario*(1+$AH24),ORÇAMENTO.PrecoUnitarioLicitado),15-13*$AF$10),0)","v":92.78},{"$f":"IF($C24=\"S\",IF(OR(Import.TipoArredondamento<>\"TransfereGOV\",ACOMPANHAMENTO=\"BM\"),VTOTAL1,SUM(OFFSET(CÁLCULO!$AA$15,ROW($X24)-ROW($X$15),1):OFFSET(CÁLCULO!$AL$15,ROW($X24)-ROW($X$15),-1))),IF($C24=0,0,ROUND(SomaAgrup,15-13*$AF$11)))","v":6494.6},"RA",{"$f":"IF(AND($C24=\"S\",$X24>0),IF(ISBLANK($Y24),\"RA\",LEFT($Y24,2)),\"\")","v":"RA"},{"$f":"IF($C24=\"S\",IF($Z24=\"CP\",$X24,IF($Z24=\"RA\",(($X24)*QCI!$AA$3),0)),SomaAgrup)","v":6494.6},{"$f":"IF($C24=\"S\",IF($Z24=\"OU\",ROUND($X24,2),0),SomaAgrup)","v":0},{"$f":"IF($N24=\"\",\" \",\nIF(AND($C24<>\"S\",OR($R24=\"\",$R24=\"(digite a descrição aqui)\")),\"DESCRIÇÃO\",\nIF(AND($C24=\"S\",OR($Q24<>\"\",$T24>0,$U24>0),$P24=\"\"),\"FONTE\",\nIF(AND($C24=\"S\",$P24<>\"\",OR($T24>0,$U24>0),$Q24=\"\"),\"CÓDIGO\",\nIF(AND($C24=\"S\",$P24<>\"\",$Q24<>\"\",$R24=\"(Código não identificado nas referências)\"),\"CÓDIGO N/ID\",\nIF(AND($C24=\"S\",OR($R24=\"\",$R24=\"(digite a descrição aqui)\"),OR($Q24<>\"\",$T24>0,$U24>0)),\"DESCRIÇÃO\",\nIF(AND($C24=\"S\",$P24<>\"\",$Q24<>\"\",$S24=\"\"),\"UNIDADE\",\nIF(AND($C24=\"S\",$P24<>\"\",$Q24<>\"\",$U24=0),\"SEM CUSTO\",\nIF(AND(_xlfn.SINGLE(TIPOORCAMENTO)=\"Licitado\",$AL24=0,$AN24>0),\"SEM PREÇO\",\nIF(AND($C24=\"S\",$P24<>\"\",$Q24<>\"\",$U24>0,AND($V24<>\"BDI 1\",$V24<>\"BDI 2\",$V24<>\"BDI 3\")),IF(ISNUMBER($V24),\"JUSTIFICAR BDI\",\"BDI\"),\nIF(OR(AND(import.recurso=\"OGU\",TIPOORCAMENTO=\"Proposto\",LEFT($O$8,5)<>\"(N/D:\",$AG24<>\"\",ORÇAMENTO.CustoUnitario>$AG24),AND(TIPOORCAMENTO=\"LICITADO\",ORÇAMENTO.PrecoUnitarioLicitado>$AN24)),\"ACIMA REF.\",\nIF(AND($C24=\"S\",$P24<>\"\",$Q24<>\"\",$T24=0,$U24>0),\"QUANT.\",\nIF(AND(Import.TipoArredondamento=\"TransfereGOV\",$L24=\"F\",$C24=\"S\",LEN($Q24)>13),\"Código >13\",\nIF(AND(Import.TipoArredondamento=\"TransfereGOV\",$L24=\"F\",$C24<>\"S\",LEN($R24)>100),\"Descrição >100\",\nIF(AND(Import.TipoArredondamento=\"TransfereGOV\",$L24=\"F\",$C24=\"S\",LEN($R24)>500),\"Descrição >500\",\nIF(AND(Import.TipoArredondamento=\"TransfereGOV\",$L24=\"F\",$C24=\"S\",LEFT(TRIM(UPPER($P24)),6)<>\"SINAPI\",ISNA(VLOOKUP(TRIM(UPPER($S24)),ListaTgov.Unidades,1,FALSE))),\"Unid. Não Disp\",\n\" \"))))))))))))))))","v":" "},{"$f":"IF(C24<=CRONO.NivelExibicao,MAX($AD$15:OFFSET(AD24,-1,0))+IF($C24<>1,1,MAX(1,COUNTIF(QCI!$A$13:$A$24,OFFSET($E24,-1,0)))),\"\")","v":""},{"$f":"IF(AND($C24=\"S\",ORÇAMENTO.CodBarra<>\"\"),IF(ORÇAMENTO.Fonte=\"\",ORÇAMENTO.CodBarra,CONCATENATE(ORÇAMENTO.Fonte,\" \",ORÇAMENTO.CodBarra)))","v":"SINAPI 94227"},{"$f":"IF(ISERROR(INDIRECT(ORÇAMENTO.BancoRef)),\"(abra o arquivo 'Referência \"&Excel_BuiltIn_Database&\".xlsm)\",IF(OR($C24<>\"S\",ORÇAMENTO.CodBarra=\"\"),\"(Sem Código)\",IF(ISERROR(MATCH($AE24,INDIRECT(ORÇAMENTO.BancoRef),0)),\"(Código não identificado nas referências)\",MATCH($AE24,INDIRECT(ORÇAMENTO.BancoRef),0))))","v":"(abra o arquivo 'Referência 02-2026.xlsm)"},{"$f":"ROUND(IF(DESONERACAO=\"sim\",REFERENCIA.Desonerado,REFERENCIA.NaoDesonerado),2)","v":0},{"$f":"ROUND(IF(ISNUMBER(ORÇAMENTO.OpcaoBDI),ORÇAMENTO.OpcaoBDI,IF(LEFT(ORÇAMENTO.OpcaoBDI,3)=\"BDI\",HLOOKUP(ORÇAMENTO.OpcaoBDI,$F$4:$H$5,2,FALSE),0)),15-11*$AF$9)","v":0.2339},null,null,null,null,6494.6,{"$f":"ROUND(ORÇAMENTO.CustoUnitario*(1+$AH24),2)","v":92.78}]
[{"$f":"CHOOSE(1+LOG(1+2*(ORÇAMENTO.Nivel=\"Meta\")+4*(ORÇAMENTO.Nivel=\"Nível 2\")+8*(ORÇAMENTO.Nivel=\"Nível 3\")+16*(ORÇAMENTO.Nivel=\"Nível 4\")+32*(ORÇAMENTO.Nivel=\"Serviço\"),2),0,1,2,3,4,\"S\")","v":"S"},{"$f":"IF(OR(C25=\"s\",C25=0),OFFSET(B25,-1,0),C25)","v":2},{"$f":"IF(OFFSET(C25,-1,0)=\"L\",1,IF(OFFSET(C25,-1,0)=1,2,IF(OR(A25=\"s\",A25=0),\"S\",IF(AND(OFFSET(C25,-1,0)=2,A25=4),3,IF(AND(OR(OFFSET(C25,-1,0)=\"s\",OFFSET(C25,-1,0)=0),A25<>\"s\",A25>OFFSET(B25,-1,0)),OFFSET(B25,-1,0),A25)))))","v":"S"},{"$f":"IF(OR(C25=\"S\",C25=0),0,IF(ISERROR(K25),J25,SMALL(J25:K25,1)))","v":0},{"$f":"IF($C25=1,OFFSET(E25,-1,0)+MAX(1,COUNTIF(QCI!$A$13:$A$24,OFFSET(ORÇAMENTO!E25,-1,0))),OFFSET(E25,-1,0))","v":1},{"$f":"IF($C25=1,0,IF($C25=2,OFFSET(F25,-1,0)+1,OFFSET(F25,-1,0)))","v":2},{"$f":"IF(AND($C25<=2,$C25<>0),0,IF($C25=3,OFFSET(G25,-1,0)+1,OFFSET(G25,-1,0)))","v":0},{"$f":"IF(AND($C25<=3,$C25<>0),0,IF($C25=4,OFFSET(H25,-1,0)+1,OFFSET(H25,-1,0)))","v":0},{"$f":"IF(AND($C25<=4,$C25<>0),0,IF(AND($C25=\"S\",$X25>0),OFFSET(I25,-1,0)+1,OFFSET(I25,-1,0)))","v":6},{"$f":"IF(OR($C25=\"S\",$C25=0),0,MATCH(0,OFFSET($D25,1,$C25,ROW($C$27)-ROW($C25)),0))","v":0},{"$f":"IF(OR($C25=\"S\",$C25=0),0,MATCH(OFFSET($D25,0,$C25)+IF($C25<>1,1,COUNTIF(QCI!$A$13:$A$24,ORÇAMENTO!E25)),OFFSET($D25,1,$C25,ROW($C$27)-ROW($C25)),0))","v":0},{"$f":"IF(OR($X25>0,$C25=1,$C25=2,$C25=3,$C25=4),\"F\",\"\")","v":"F"},"Serviço",{"$f":"CHOOSE(1+LOG(1+2*(C25=1)+4*(C25=2)+8*(C25=3)+16*(C25=4)+32*(C25=\"S\"),2),\"\",\"Meta\",\"Nível 2\",\"Nível 3\",\"Nível 4\",\"Serviço\")","v":"Serviço"},{"$f":"IF(OR($C25=0,$L25=\"\"),\"-\",CONCATENATE(E25&\".\",IF(AND($A$5>=2,$C25>=2),F25&\".\",\"\"),IF(AND($A$5>=3,$C25>=3),G25&\".\",\"\"),IF(AND($A$5>=4,$C25>=4),H25&\".\",\"\"),IF($C25=\"S\",I25&\".\",\"\")))","v":"1.2.6."},"SINAPI","89800",{"$f":"IF($C25=\"S\",REFERENCIA.Descricao,\"(digite a descrição aqui)\")","v":"(abra o arquivo 'Referência 02-2026.xlsm)"},{"$f":"REFERENCIA.Unidade","v":"-"},{"$f":"OFFSET(CÁLCULO!H$15,ROW($T25)-ROW(T$15),0)","v":48},32.770000000000003,"BDI 1",{"$f":"IF($C25=\"S\",ROUND(IF(TIPOORCAMENTO=\"Proposto\",ORÇAMENTO.CustoUnitario*(1+$AH25),ORÇAMENTO.PrecoUnitarioLicitado),15-13*$AF$10),0)","v":40.43},{"$f":"IF($C25=\"S\",IF(OR(Import.TipoArredondamento<>\"TransfereGOV\",ACOMPANHAMENTO=\"BM\"),VTOTAL1,SUM(OFFSET(CÁLCULO!$AA$15,ROW($X25)-ROW($X$15),1):OFFSET(CÁLCULO!$AL$15,ROW($X25)-ROW($X$15),-1))),IF($C25=0,0,ROUND(SomaAgrup,15-13*$AF$11)))","v":1940.64},"RA",{"$f":"IF(AND($C25=\"S\",$X25>0),IF(ISBLANK($Y25),\"RA\",LEFT($Y25,2)),\"\")","v":"RA"},{"$f":"IF($C25=\"S\",IF($Z25=\"CP\",$X25,IF($Z25=\"RA\",(($X25)*QCI!$AA$3),0)),SomaAgrup)","v":1940.64},{"$f":"IF($C25=\"S\",IF($Z25=\"OU\",ROUND($X25,2),0),SomaAgrup)","v":0},{"$f":"IF($N25=\"\",\" \",\nIF(AND($C25<>\"S\",OR($R25=\"\",$R25=\"(digite a descrição aqui)\")),\"DESCRIÇÃO\",\nIF(AND($C25=\"S\",OR($Q25<>\"\",$T25>0,$U25>0),$P25=\"\"),\"FONTE\",\nIF(AND($C25=\"S\",$P25<>\"\",OR($T25>0,$U25>0),$Q25=\"\"),\"CÓDIGO\",\nIF(AND($C25=\"S\",$P25<>\"\",$Q25<>\"\",$R25=\"(Código não identificado nas referências)\"),\"CÓDIGO N/ID\",\nIF(AND($C25=\"S\",OR($R25=\"\",$R25=\"(digite a descrição aqui)\"),OR($Q25<>\"\",$T25>0,$U25>0)),\"DESCRIÇÃO\",\nIF(AND($C25=\"S\",$P25<>\"\",$Q25<>\"\",$S25=\"\"),\"UNIDADE\",\nIF(AND($C25=\"S\",$P25<>\"\",$Q25<>\"\",$U25=0),\"SEM CUSTO\",\nIF(AND(_xlfn.SINGLE(TIPOORCAMENTO)=\"Licitado\",$AL25=0,$AN25>0),\"SEM PREÇO\",\nIF(AND($C25=\"S\",$P25<>\"\",$Q25<>\"\",$U25>0,AND($V25<>\"BDI 1\",$V25<>\"BDI 2\",$V25<>\"BDI 3\")),IF(ISNUMBER($V25),\"JUSTIFICAR BDI\",\"BDI\"),\nIF(OR(AND(import.recurso=\"OGU\",TIPOORCAMENTO=\"Proposto\",LEFT($O$8,5)<>\"(N/D:\",$AG25<>\"\",ORÇAMENTO.CustoUnitario>$AG25),AND(TIPOORCAMENTO=\"LICITADO\",ORÇAMENTO.PrecoUnitarioLicitado>$AN25)),\"ACIMA REF.\",\nIF(AND($C25=\"S\",$P25<>\"\",$Q25<>\"\",$T25=0,$U25>0),\"QUANT.\",\nIF(AND(Import.TipoArredondamento=\"TransfereGOV\",$L25=\"F\",$C25=\"S\",LEN($Q25)>13),\"Código >13\",\nIF(AND(Import.TipoArredondamento=\"TransfereGOV\",$L25=\"F\",$C25<>\"S\",LEN($R25)>100),\"Descrição >100\",\nIF(AND(Import.TipoArredondamento=\"TransfereGOV\",$L25=\"F\",$C25=\"S\",LEN($R25)>500),\"Descrição >500\",\nIF(AND(Import.TipoArredondamento=\"TransfereGOV\",$L25=\"F\",$C25=\"S\",LEFT(TRIM(UPPER($P25)),6)<>\"SINAPI\",ISNA(VLOOKUP(TRIM(UPPER($S25)),ListaTgov.Unidades,1,FALSE))),\"Unid. Não Disp\",\n\" \"))))))))))))))))","v":" "},{"$f":"IF(C25<=CRONO.NivelExibicao,MAX($AD$15:OFFSET(AD25,-1,0))+IF($C25<>1,1,MAX(1,COUNTIF(QCI!$A$13:$A$24,OFFSET($E25,-1,0)))),\"\")","v":""},{"$f":"IF(AND($C25=\"S\",ORÇAMENTO.CodBarra<>\"\"),IF(ORÇAMENTO.Fonte=\"\",ORÇAMENTO.CodBarra,CONCATENATE(ORÇAMENTO.Fonte,\" \",ORÇAMENTO.CodBarra)))","v":"SINAPI 89800"},{"$f":"IF(ISERROR(INDIRECT(ORÇAMENTO.BancoRef)),\"(abra o arquivo 'Referência \"&Excel_BuiltIn_Database&\".xlsm)\",IF(OR($C25<>\"S\",ORÇAMENTO.CodBarra=\"\"),\"(Sem Código)\",IF(ISERROR(MATCH($AE25,INDIRECT(ORÇAMENTO.BancoRef),0)),\"(Código não identificado nas referências)\",MATCH($AE25,INDIRECT(ORÇAMENTO.BancoRef),0))))","v":"(abra o arquivo 'Referência 02-2026.xlsm)"},{"$f":"ROUND(IF(DESONERACAO=\"sim\",REFERENCIA.Desonerado,REFERENCIA.NaoDesonerado),2)","v":0},{"$f":"ROUND(IF(ISNUMBER(ORÇAMENTO.OpcaoBDI),ORÇAMENTO.OpcaoBDI,IF(LEFT(ORÇAMENTO.OpcaoBDI,3)=\"BDI\",HLOOKUP(ORÇAMENTO.OpcaoBDI,$F$4:$H$5,2,FALSE),0)),15-11*$AF$9)","v":0.2339},null,null,null,null,1940.64,{"$f":"ROUND(ORÇAMENTO.CustoUnitario*(1+$AH25),2)","v":40.43}]
[{"$f":"CHOOSE(1+LOG(1+2*(ORÇAMENTO.Nivel=\"Meta\")+4*(ORÇAMENTO.Nivel=\"Nível 2\")+8*(ORÇAMENTO.Nivel=\"Nível 3\")+16*(ORÇAMENTO.Nivel=\"Nível 4\")+32*(ORÇAMENTO.Nivel=\"Serviço\"),2),0,1,2,3,4,\"S\")","v":"S"},{"$f":"IF(OR(C26=\"s\",C26=0),OFFSET(B26,-1,0),C26)","v":2},{"$f":"IF(OFFSET(C26,-1,0)=\"L\",1,IF(OFFSET(C26,-1,0)=1,2,IF(OR(A26=\"s\",A26=0),\"S\",IF(AND(OFFSET(C26,-1,0)=2,A26=4),3,IF(AND(OR(OFFSET(C26,-1,0)=\"s\",OFFSET(C26,-1,0)=0),A26<>\"s\",A26>OFFSET(B26,-1,0)),OFFSET(B26,-1,0),A26)))))","v":"S"},{"$f":"IF(OR(C26=\"S\",C26=0),0,IF(ISERROR(K26),J26,SMALL(J26:K26,1)))","v":0},{"$f":"IF($C26=1,OFFSET(E26,-1,0)+MAX(1,COUNTIF(QCI!$A$13:$A$24,OFFSET(ORÇAMENTO!E26,-1,0))),OFFSET(E26,-1,0))","v":1},{"$f":"IF($C26=1,0,IF($C26=2,OFFSET(F26,-1,0)+1,OFFSET(F26,-1,0)))","v":2},{"$f":"IF(AND($C26<=2,$C26<>0),0,IF($C26=3,OFFSET(G26,-1,0)+1,OFFSET(G26,-1,0)))","v":0},{"$f":"IF(AND($C26<=3,$C26<>0),0,IF($C26=4,OFFSET(H26,-1,0)+1,OFFSET(H26,-1,0)))","v":0},{"$f":"IF(AND($C26<=4,$C26<>0),0,IF(AND($C26=\"S\",$X26>0),OFFSET(I26,-1,0)+1,OFFSET(I26,-1,0)))","v":7},0,{"$f":"IF(OR($C26=\"S\",$C26=0),0,MATCH(OFFSET($D26,0,$C26)+IF($C26<>1,1,COUNTIF(QCI!$A$13:$A$24,ORÇAMENTO!E26)),OFFSET($D26,1,$C26,ROW($C$27)-ROW($C26)),0))","v":0},{"$f":"IF(OR($X26>0,$C26=1,$C26=2,$C26=3,$C26=4),\"F\",\"\")","v":"F"},"Serviço",{"$f":"CHOOSE(1+LOG(1+2*(C26=1)+4*(C26=2)+8*(C26=3)+16*(C26=4)+32*(C26=\"S\"),2),\"\",\"Meta\",\"Nível 2\",\"Nível 3\",\"Nível 4\",\"Serviço\")","v":"Serviço"},{"$f":"IF(OR($C26=0,$L26=\"\"),\"-\",CONCATENATE(E26&\".\",IF(AND($A$5>=2,$C26>=2),F26&\".\",\"\"),IF(AND($A$5>=3,$C26>=3),G26&\".\",\"\"),IF(AND($A$5>=4,$C26>=4),H26&\".\",\"\"),IF($C26=\"S\",I26&\".\",\"\")))","v":"1.2.7."},"Cotação","006","MÃO DE OBRA P/ MONTAGEM DA ESTRUTURA","M2",{"$f":"OFFSET(CÁLCULO!H$15,ROW($T26)-ROW(T$15),0)","v":612},25,"BDI 1",{"$f":"IF($C26=\"S\",ROUND(IF(TIPOORCAMENTO=\"Proposto\",ORÇAMENTO.CustoUnitario*(1+$AH26),ORÇAMENTO.PrecoUnitarioLicitado),15-13*$AF$10),0)","v":30.85},{"$f":"IF($C26=\"S\",IF(OR(Import.TipoArredondamento<>\"TransfereGOV\",ACOMPANHAMENTO=\"BM\"),VTOTAL1,SUM(OFFSET(CÁLCULO!$AA$15,ROW($X26)-ROW($X$15),1):OFFSET(CÁLCULO!$AL$15,ROW($X26)-ROW($X$15),-1))),IF($C26=0,0,ROUND(SomaAgrup,15-13*$AF$11)))","v":18880.2},"RA",{"$f":"IF(AND($C26=\"S\",$X26>0),IF(ISBLANK($Y26),\"RA\",LEFT($Y26,2)),\"\")","v":"RA"},{"$f":"IF($C26=\"S\",IF($Z26=\"CP\",$X26,IF($Z26=\"RA\",(($X26)*QCI!$AA$3),0)),SomaAgrup)","v":18880.2},{"$f":"IF($C26=\"S\",IF($Z26=\"OU\",ROUND($X26,2),0),SomaAgrup)","v":0},{"$f":"IF($N26=\"\",\" \",\nIF(AND($C26<>\"S\",OR($R26=\"\",$R26=\"(digite a descrição aqui)\")),\"DESCRIÇÃO\",\nIF(AND($C26=\"S\",OR($Q26<>\"\",$T26>0,$U26>0),$P26=\"\"),\"FONTE\",\nIF(AND($C26=\"S\",$P26<>\"\",OR($T26>0,$U26>0),$Q26=\"\"),\"CÓDIGO\",\nIF(AND($C26=\"S\",$P26<>\"\",$Q26<>\"\",$R26=\"(Código não identificado nas referências)\"),\"CÓDIGO N/ID\",\nIF(AND($C26=\"S\",OR($R26=\"\",$R26=\"(digite a descrição aqui)\"),OR($Q26<>\"\",$T26>0,$U26>0)),\"DESCRIÇÃO\",\nIF(AND($C26=\"S\",$P26<>\"\",$Q26<>\"\",$S26=\"\"),\"UNIDADE\",\nIF(AND($C26=\"S\",$P26<>\"\",$Q26<>\"\",$U26=0),\"SEM CUSTO\",\nIF(AND(_xlfn.SINGLE(TIPOORCAMENTO)=\"Licitado\",$AL26=0,$AN26>0),\"SEM PREÇO\",\nIF(AND($C26=\"S\",$P26<>\"\",$Q26<>\"\",$U26>0,AND($V26<>\"BDI 1\",$V26<>\"BDI 2\",$V26<>\"BDI 3\")),IF(ISNUMBER($V26),\"JUSTIFICAR BDI\",\"BDI\"),\nIF(OR(AND(import.recurso=\"OGU\",TIPOORCAMENTO=\"Proposto\",LEFT($O$8,5)<>\"(N/D:\",$AG26<>\"\",ORÇAMENTO.CustoUnitario>$AG26),AND(TIPOORCAMENTO=\"LICITADO\",ORÇAMENTO.PrecoUnitarioLicitado>$AN26)),\"ACIMA REF.\",\nIF(AND($C26=\"S\",$P26<>\"\",$Q26<>\"\",$T26=0,$U26>0),\"QUANT.\",\nIF(AND(Import.TipoArredondamento=\"TransfereGOV\",$L26=\"F\",$C26=\"S\",LEN($Q26)>13),\"Código >13\",\nIF(AND(Import.TipoArredondamento=\"TransfereGOV\",$L26=\"F\",$C26<>\"S\",LEN($R26)>100),\"Descrição >100\",\nIF(AND(Import.TipoArredondamento=\"TransfereGOV\",$L26=\"F\",$C26=\"S\",LEN($R26)>500),\"Descrição >500\",\nIF(AND(Import.TipoArredondamento=\"TransfereGOV\",$L26=\"F\",$C26=\"S\",LEFT(TRIM(UPPER($P26)),6)<>\"SINAPI\",ISNA(VLOOKUP(TRIM(UPPER($S26)),ListaTgov.Unidades,1,FALSE))),\"Unid. Não Disp\",\n\" \"))))))))))))))))","v":" "},{"$f":"IF(C26<=CRONO.NivelExibicao,MAX($AD$15:OFFSET(AD26,-1,0))+IF($C26<>1,1,MAX(1,COUNTIF(QCI!$A$13:$A$24,OFFSET($E26,-1,0)))),\"\")","v":""},{"$f":"IF(AND($C26=\"S\",ORÇAMENTO.CodBarra<>\"\"),IF(ORÇAMENTO.Fonte=\"\",ORÇAMENTO.CodBarra,CONCATENATE(ORÇAMENTO.Fonte,\" \",ORÇAMENTO.CodBarra)))","v":"Cotação 006"},{"$f":"IF(ISERROR(INDIRECT(ORÇAMENTO.BancoRef)),\"(abra o arquivo 'Referência \"&Excel_BuiltIn_Database&\".xlsm)\",IF(OR($C26<>\"S\",ORÇAMENTO.CodBarra=\"\"),\"(Sem Código)\",IF(ISERROR(MATCH($AE26,INDIRECT(ORÇAMENTO.BancoRef),0)),\"(Código não identificado nas referências)\",MATCH($AE26,INDIRECT(ORÇAMENTO.BancoRef),0))))","v":"(abra o arquivo 'Referência 02-2026.xlsm)"},{"$f":"ROUND(IF(DESONERACAO=\"sim\",REFERENCIA.Desonerado,REFERENCIA.NaoDesonerado),2)","v":0},{"$f":"ROUND(IF(ISNUMBER(ORÇAMENTO.OpcaoBDI),ORÇAMENTO.OpcaoBDI,IF(LEFT(ORÇAMENTO.OpcaoBDI,3)=\"BDI\",HLOOKUP(ORÇAMENTO.OpcaoBDI,$F$4:$H$5,2,FALSE),0)),15-11*$AF$9)","v":0.2339},null,null,null,null,18880.2,{"$f":"ROUND(ORÇAMENTO.CustoUnitario*(1+$AH26),2)","v":30.85}]
[-1,null,-1,null,0,0,0,0,0,null,null,"F",null,null,null,null,null,null,null,null,null,null,null,null,null,null,null,null," "]
[]
[]
[null,null,null,null,null,null,null,null,null,null,null,null,null,null,"Encargos sociais:",null,"Para elaboração deste orçamento, foram utilizados os encargos sociais do SINAPI para a Unidade da Federação indicada."]
[]
[null,null,null,null,null,null,null,null,null,null,null,null,null,null,"Observações:"]
[]
[]
[]
[]
[null,null,null,null,null,null,null,null,null,null,null,null,null,null,{"$f":"IF(AND($AF$7=FALSE,$AF$8=FALSE,$AF$9=FALSE,$AF$10=FALSE,$AF$11=FALSE),\"Não foi considerado arredondamento nos valores da planilha.\",CONCATENATE(\"Foi considerado arredondamento de duas casas decimais para \",IF($AF$7=TRUE,\"Quantidade; \",\"\"),IF($AF$8=TRUE,\"Custo Unitário; \",\"\"),IF($AF$9=TRUE,\"BDI; \",\"\"),IF($AF$10=TRUE,\"Preço Unitário; \",\"\"),IF($AF$11=TRUE,\"Preço Total.\",\"\")))","v":"Foi considerado arredondamento de duas casas decimais para Quantidade; Custo Unitário; BDI; Preço Unitário; Preço Total."}]
[null,null,null,null,null,null,null,null,null,null,null,null,null,null,"Siglas da Composição do Investimento: RA - Rateio proporcional entre Repasse e Contrapartida; RP - 100% Repasse; CP - 100% Contrapartida; OU - 100% Outros."]
[]
[null,null,null,null,null,null,null,null,null,null,null,null,null,null,{"$f":"Import.Município","v":"SÃO VALENTIM/RS"}]
[null,null,null,null,null,null,null,null,null,null,null,null,null,null,"Local",null,null,null,"Responsável Técnico"]
[null,null,null,null,null,null,null,null,null,null,null,null,null,null,null,null,null,null,"Nome:",{"$f":"Import.RespOrçamento","v":0}]
[null,null,null,null,null,null,null,null,null,null,null,null,null,null,{"$f":"DADOS!$C$25","v":"00:00:00"},null,null,null,"CREA/CAU:",0]
[null,null,null,null,null,null,null,null,null,null,null,null,null,null,"Data",null,null,null,"ART/RRT:",0]

{"sheet":"EVENTOS","index":5,"n_rows":25,"n_cols":26,"rows_kept":25,"cut":false,"hidden":false,"merged":[[4,5,4,12],[4,15,4,22],[9,4,11,4],[9,9,11,9],[9,10,11,10],[9,11,11,11],[9,17,11,17],[9,6,11,6],[9,23,11,23],[9,24,11,24],[7,2,7,3],[9,15,11,15],[9,16,11,16],[9,7,11,7],[9,8,11,8],[9,12,11,12],[9,13,11,13],[9,14,11,14],[9,18,11,18],[9,19,11,19],[9,20,11,20],[9,21,11,21],[9,22,11,22],[10,2,10,3]]}
[{"$f":"IF(D1=\"\",\"\",\"F\")","v":""},{"$f":"IF(OR(C1=\" \",D1=\"\"),\"\",CONCATENATE(C1,\". \",D1))","v":{"$error":"#REF!"}},{"$f":"IF(OR(ROW(C1)=ROW(EVENTOS.firstrow)+1,AND(OFFSET(C1,-1,0)<>\" \",OFFSET(C1,-1,1)<>\"\")),OFFSET(C1,-1,0)+1,\" \")","v":{"$error":"#REF!"}},null,{"$f":"IF(AUTOEVENTO=\"Manual\",ROUND(SUMPRODUCT((CÁLCULO!$M$15:$M$27=EVENTOS!$C1)*(OFFSET(CÁLCULO!$AA$15:$AA$27,0,E$13))),2),0)","v":0},{"$f":"IF(AUTOEVENTO=\"Manual\",ROUND(SUMPRODUCT((CÁLCULO!$M$15:$M$27=EVENTOS!$C1)*(OFFSET(CÁLCULO!$AA$15,0,1):OFFSET(CÁLCULO!$AL$27,0,-1))),2),0)","v":0},{"$f":"IF(AND(D1=0,F1>0),\"NOME\",\n IF(AND(D1<>0,$F$14>0,F1=0),\"VALOR\",\n IF(AND(Import.TipoArredondamento=\"TransfereGOV\",$A1=\"F\",LEN(D1)>100),\"Nome >100\",\"\")))","v":""},{"$f":"IF(AUTOEVENTO=\"Manual\",ROUND(SUMPRODUCT((CÁLCULO!$M$15:$M$27=EVENTOS!$C1)*(OFFSET(CÁLCULO!$AA$15:$AA$27,0,H$13))),2),0)","v":0},{"$f":"IF(AUTOEVENTO=\"Manual\",ROUND(SUMPRODUCT((CÁLCULO!$M$15:$M$27=EVENTOS!$C1)*(OFFSET(CÁLCULO!$AA$15:$AA$27,0,I$13))),2),0)","v":0},{"$f":"IF(AUTOEVENTO=\"Manual\",ROUND(SUMPRODUCT((CÁLCULO!$M$15:$M$27=EVENTOS!$C1)*(OFFSET(CÁLCULO!$AA$15:$AA$27,0,J$13))),2),0)","v":0},{"$f":"IF(AUTOEVENTO=\"Manual\",ROUND(SUMPRODUCT((CÁLCULO!$M$15:$M$27=EVENTOS!$C1)*(OFFSET(CÁLCULO!$AA$15:$AA$27,0,K$13))),2),0)","v":0},{"$f":"IF(AUTOEVENTO=\"Manual\",ROUND(SUMPRODUCT((CÁLCULO!$M$15:$M$27=EVENTOS!$C1)*(OFFSET(CÁLCULO!$AA$15:$AA$27,0,L$13))),2),0)","v":0},{"$f":"IF(AUTOEVENTO=\"Manual\",ROUND(SUMPRODUCT((CÁLCULO!$M$15:$M$27=EVENTOS!$C1)*(OFFSET(CÁLCULO!$AA$15:$AA$27,0,M$13))),2),0)","v":0},{"$f":"IF(AUTOEVENTO=\"Manual\",ROUND(SUMPRODUCT((CÁLCULO!$M$15:$M$27=EVENTOS!$C1)*(OFFSET(CÁLCULO!$AA$15:$AA$27,0,N$13))),2),0)","v":0},{"$f":"IF(AUTOEVENTO=\"Manual\",ROUND(SUMPRODUCT((CÁLCULO!$M$15:$M$27=EVENTOS!$C1)*(OFFSET(CÁLCULO!$AA$15:$AA$27,0,O$13))),2),0)","v":0},{"$f":"IF(AUTOEVENTO=\"Manual\",ROUND(SUMPRODUCT((CÁLCULO!$M$15:$M$27=EVENTOS!$C1)*(OFFSET(CÁLCULO!$AA$15:$AA$27,0,P$13))),2),0)","v":0},{"$f":"IF(AUTOEVENTO=\"Manual\",ROUND(SUMPRODUCT((CÁLCULO!$M$15:$M$27=EVENTOS!$C1)*(OFFSET(CÁLCULO!$AA$15:$AA$27,0,Q$13))),2),0)","v":0},{"$f":"IF(AUTOEVENTO=\"Manual\",ROUND(SUMPRODUCT((CÁLCULO!$M$15:$M$27=EVENTOS!$C1)*(OFFSET(CÁLCULO!$AA$15:$AA$27,0,R$13))),2),0)","v":0},{"$f":"IF(AUTOEVENTO=\"Manual\",ROUND(SUMPRODUCT((CÁLCULO!$M$15:$M$27=EVENTOS!$C1)*(OFFSET(CÁLCULO!$AA$15:$AA$27,0,S$13))),2),0)","v":0},{"$f":"IF(AUTOEVENTO=\"Manual\",ROUND(SUMPRODUCT((CÁLCULO!$M$15:$M$27=EVENTOS!$C1)*(OFFSET(CÁLCULO!$AA$15:$AA$27,0,T$13))),2),0)","v":0},{"$f":"IF(AUTOEVENTO=\"Manual\",ROUND(SUMPRODUCT((CÁLCULO!$M$15:$M$27=EVENTOS!$C1)*(OFFSET(CÁLCULO!$AA$15:$AA$27,0,U$13))),2),0)","v":0},{"$f":"IF(AUTOEVENTO=\"Manual\",ROUND(SUMPRODUCT((CÁLCULO!$M$15:$M$27=EVENTOS!$C1)*(OFFSET(CÁLCULO!$AA$15:$AA$27,0,V$13))),2),0)","v":0},{"$f":"IF(AUTOEVENTO=\"Manual\",ROUND(SUMPRODUCT((CÁLCULO!$M$15:$M$27=EVENTOS!$C1)*(OFFSET(CÁLCULO!$AA$15:$AA$27,0,W$13))),2),0)","v":0},{"$f":"IF(AUTOEVENTO=\"Manual\",ROUND(SUMPRODUCT((CÁLCULO!$M$15:$M$27=EVENTOS!$C1)*(OFFSET(CÁLCULO!$AA$15:$AA$27,0,X$13))),2),0)","v":0},{"$f":"IF(AUTOEVENTO=\"Manual\",ROUND(SUMPRODUCT((CÁLCULO!$M$15:$M$27=EVENTOS!$C1)*(OFFSET(CÁLCULO!$AA$15:$AA$27,0,Y$13))),2),0)","v":0}]
[null,null,null,null,null,"AGRUPADORES DE EVENTOS",null,null,null,null,null,null,null,null,"Grau de Sigilo\n#PUBLICO",null,null,null,null,null,null,null,null,null,"Grau de Sigilo\n#PUBLICO"]
[]
[null,null,"PROPONENTE / TOMADOR",null,null,"APELIDO EMPREENDIMENTO",null,null,null,null,null,null,null,"Nº OPERAÇÃO","Nº TransfereGOV","APELIDO EMPREENDIMENTO",null,null,null,null,null,null,null,"Nº OPERAÇÃO","Nº TransfereGOV"]
[null,null,{"$f":"Import.Proponente","v":"MUNICÍPIO DE SÃO VALENTIN"},null,null,{"$f":"Import.Apelido","v":"COBERTURA RUA PEDRO DASSOLER"},null,null,null,null,null,null,null,{"$f":"Import.CR","v":0},{"$f":"Import.SICONV","v":0},{"$f":"Import.Apelido","v":"COBERTURA RUA PEDRO DASSOLER"},null,null,null,null,null,null,null,{"$f":"Import.CR","v":0},{"$f":"Import.SICONV","v":0}," "]
[null,"Automática, conforme os agrupadores Nível 2 do Orçamento","1. Selecione abaixo a forma de definição dos agrupadores de eventos:",null,null,{"$f":"IF(AUTOEVENTO=\"MANUAL\",\n  IF(COUNTIF($G$15:$G$18,\"NOME\")>0,\"Falta preencher o nome do Título do Evento nº \"&INDEX($C$15:$C$18,MATCH(\"NOME\",$G$15:$G$18,0)),\n  IF(COUNTIF($G$15:$G$18,\"VALOR\")>0,\"Falta atribuir serviços ao Evento nº \"&INDEX($C$15:$C$18,MATCH(\"VALOR\",$G$15:$G$18,0))&\". Corrigir a atribuição dos eventos na aba CÁLCULO. Ou excluir linhas dos eventos não utilizados.\",\n  IF(ROUND($F$14,2)<>ROUND(ORÇAMENTO!$X$15,2),\"O valor total dos Eventos é diferente do valor total do Orçamento. Corrigir a atribuição dos eventos na aba CÁLCULO\",\n  IF(COUNTIF($G$15:$G$18,\"Nome >100\")>0,\"O tamanho do Título do Evento no TransfereGOV é limitado a 100 caracteres. Resuma o nome do Título do Evento nº \"&INDEX($C$15:$C$18,MATCH(\"Nome >100\",$G$15:$G$18,0)),\"\")))),\"\")","v":""}]
[null,"Automática, conforme os agrupadores Nível 3 do Orçamento"]
[null,"Automática, conforme os agrupadores Nível 4 do Orçamento","Automática, conforme os agrupadores Nível 2 do Orçamento",null,null,{"$f":"IF(ACOMPANHAMENTO=\"BM\",\"\",\n IF(Import.Eventos.Nível=\"\",\"◄ Selecione a forma de definição dos agrupadores de eventos\",\n IF(Import.Eventos.Nível=\"\",\"◄ Selecione a forma de definição dos agrupadores de eventos\",\"\")))","v":""}]
[null,"Definir Manualmente"]
[null,null,{"$f":"COUNTIF($C$15:$C$18,\">0\")-1","v":0}," ",{"$f":"OFFSET(CÁLCULO!$P$12,0,EVENTOS!E$13)","v":"PILARES PRÉ MOLDADO 20X25 CM"}," ",null,{"$f":"OFFSET(CÁLCULO!$P$12,0,EVENTOS!H$13)","v":"PILARES PRÉ MOLDADO 20X25 CM"},{"$f":"OFFSET(CÁLCULO!$P$12,0,EVENTOS!I$13)","v":"ESTRUTURA E COBERTURA"},{"$f":"OFFSET(CÁLCULO!$P$12,0,EVENTOS!J$13)","v":"ESTRUTURA E COBERTURA"},{"$f":"OFFSET(CÁLCULO!$P$12,0,EVENTOS!K$13)","v":"."},{"$f":"OFFSET(CÁLCULO!$P$12,0,EVENTOS!L$13)","v":"."},{"$f":"OFFSET(CÁLCULO!$P$12,0,EVENTOS!M$13)","v":"."},{"$f":"OFFSET(CÁLCULO!$P$12,0,EVENTOS!N$13)","v":"."},{"$f":"OFFSET(CÁLCULO!$P$12,0,EVENTOS!O$13)","v":"."},{"$f":"OFFSET(CÁLCULO!$P$12,0,EVENTOS!P$13)","v":"."},{"$f":"OFFSET(CÁLCULO!$P$12,0,EVENTOS!Q$13)","v":"."},{"$f":"OFFSET(CÁLCULO!$P$12,0,EVENTOS!R$13)","v":"."},{"$f":"OFFSET(CÁLCULO!$P$12,0,EVENTOS!S$13)","v":"."},{"$f":"OFFSET(CÁLCULO!$P$12,0,EVENTOS!T$13)","v":"."},{"$f":"OFFSET(CÁLCULO!$P$12,0,EVENTOS!U$13)","v":"."},{"$f":"OFFSET(CÁLCULO!$P$12,0,EVENTOS!V$13)","v":"."},{"$f":"OFFSET(CÁLCULO!$P$12,0,EVENTOS!W$13)","v":"."},{"$f":"OFFSET(CÁLCULO!$P$12,0,EVENTOS!X$13)","v":"."},{"$f":"OFFSET(CÁLCULO!$P$12,0,EVENTOS!Y$13)","v":"."}]
["FILTRO",null,{"$f":"IF(ACOMPANHAMENTO=\"BM\",\"Foi selecionado na aba 'MENU' o acompanhamento por BM. Não há necessidade de definição de Eventos.\",IF(AND(Import.Eventos.Nível<>\"Definir Manualmente\",Import.Eventos.Nível<>\"\"),\"Foi selecionada a forma automática de definição dos agrupadores de eventos.\",\"\"))","v":"Foi selecionada a forma automática de definição dos agrupadores de eventos."}]
["↓"]
[null,null,"Nº do Evento","Título do Evento",{"$f":"IF(NOT(ISNUMBER(OFFSET(E13,0,-1))),1,IF(OR(OFFSET(E13,0,-1)=0,OFFSET(E13,0,-1)+1>CÁLCULO.FrentesPreenchidas),0,OFFSET(E13,0,-1)+1))","v":1},"Valor Total dos Eventos (R$)",null,{"$f":"IF(NOT(ISNUMBER(OFFSET(H13,0,-1))),1,IF(OR(OFFSET(H13,0,-1)=0,OFFSET(H13,0,-1)+1>CÁLCULO.FrentesPreenchidas),0,OFFSET(H13,0,-1)+1))","v":1},2,3,0,0,0,0,0,0,0,0,0,0,0,0,0,0,0]
["F",null,null,"Total:",{"$f":"SUM(E$15:E$18)","v":0},{"$f":"SUM(F$15:F$18)","v":0},null,{"$f":"SUM(H$15:H$18)","v":0},0,0,0,0,0,0,0,0,0,0,0,0,0,0,0,0,0]
[{"$f":"IF(D15=\"\",\"\",\"F\")","v":""},{"$f":"IF(OR(C15=\" \",D15=\"\"),\"\",CONCATENATE(C15,\". \",D15))","v":""},{"$f":"IF(AdmLocal=\"Automática\",1,0)","v":0},{"$f":"IF(C15=1,\"Administração Local\",\"\")","v":""},{"$f":"IF($F$15=0,0,IF(E13=1,$F$15-SUM($I$15:$Z$15),ROUND(SUM(OFFSET(E15,1,0):OFFSET(E$18,-1,0))/SUM(OFFSET($F15,1,0):OFFSET($F$18,-1,0))*$F$15,2)))","v":0},{"$f":"IF($C$15=0,0,ROUND(SUMPRODUCT((CÁLCULO!$M$15:$M$27=EVENTOS!$C15)*(ORÇAMENTO!$X$15:'ORÇAMENTO'!$X$27)),2))","v":0},null,{"$f":"IF($F$15=0,0,IF(H13=1,$F$15-SUM($I$15:$Z$15),ROUND(SUM(OFFSET(H15,1,0):OFFSET(H$18,-1,0))/SUM(OFFSET($F15,1,0):OFFSET($F$18,-1,0))*$F$15,2)))","v":0},{"$f":"IF($F$15=0,0,IF(I13=1,$F$15-SUM($I$15:$Z$15),ROUND(SUM(OFFSET(I15,1,0):OFFSET(I$18,-1,0))/SUM(OFFSET($F15,1,0):OFFSET($F$18,-1,0))*$F$15,2)))","v":0},{"$f":"IF($F$15=0,0,IF(J13=1,$F$15-SUM($I$15:$Z$15),ROUND(SUM(OFFSET(J15,1,0):OFFSET(J$18,-1,0))/SUM(OFFSET($F15,1,0):OFFSET($F$18,-1,0))*$F$15,2)))","v":0},{"$f":"IF($F$15=0,0,IF(K13=1,$F$15-SUM($I$15:$Z$15),ROUND(SUM(OFFSET(K15,1,0):OFFSET(K$18,-1,0))/SUM(OFFSET($F15,1,0):OFFSET($F$18,-1,0))*$F$15,2)))","v":0},{"$f":"IF($F$15=0,0,IF(L13=1,$F$15-SUM($I$15:$Z$15),ROUND(SUM(OFFSET(L15,1,0):OFFSET(L$18,-1,0))/SUM(OFFSET($F15,1,0):OFFSET($F$18,-1,0))*$F$15,2)))","v":0},{"$f":"IF($F$15=0,0,IF(M13=1,$F$15-SUM($I$15:$Z$15),ROUND(SUM(OFFSET(M15,1,0):OFFSET(M$18,-1,0))/SUM(OFFSET($F15,1,0):OFFSET($F$18,-1,0))*$F$15,2)))","v":0},{"$f":"IF($F$15=0,0,IF(N13=1,$F$15-SUM($I$15:$Z$15),ROUND(SUM(OFFSET(N15,1,0):OFFSET(N$18,-1,0))/SUM(OFFSET($F15,1,0):OFFSET($F$18,-1,0))*$F$15,2)))","v":0},{"$f":"IF($F$15=0,0,IF(O13=1,$F$15-SUM($I$15:$Z$15),ROUND(SUM(OFFSET(O15,1,0):OFFSET(O$18,-1,0))/SUM(OFFSET($F15,1,0):OFFSET($F$18,-1,0))*$F$15,2)))","v":0},{"$f":"IF($F$15=0,0,IF(P13=1,$F$15-SUM($I$15:$Z$15),ROUND(SUM(OFFSET(P15,1,0):OFFSET(P$18,-1,0))/SUM(OFFSET($F15,1,0):OFFSET($F$18,-1,0))*$F$15,2)))","v":0},{"$f":"IF($F$15=0,0,IF(Q13=1,$F$15-SUM($I$15:$Z$15),ROUND(SUM(OFFSET(Q15,1,0):OFFSET(Q$18,-1,0))/SUM(OFFSET($F15,1,0):OFFSET($F$18,-1,0))*$F$15,2)))","v":0},{"$f":"IF($F$15=0,0,IF(R13=1,$F$15-SUM($I$15:$Z$15),ROUND(SUM(OFFSET(R15,1,0):OFFSET(R$18,-1,0))/SUM(OFFSET($F15,1,0):OFFSET($F$18,-1,0))*$F$15,2)))","v":0},{"$f":"IF($F$15=0,0,IF(S13=1,$F$15-SUM($I$15:$Z$15),ROUND(SUM(OFFSET(S15,1,0):OFFSET(S$18,-1,0))/SUM(OFFSET($F15,1,0):OFFSET($F$18,-1,0))*$F$15,2)))","v":0},{"$f":"IF($F$15=0,0,IF(T13=1,$F$15-SUM($I$15:$Z$15),ROUND(SUM(OFFSET(T15,1,0):OFFSET(T$18,-1,0))/SUM(OFFSET($F15,1,0):OFFSET($F$18,-1,0))*$F$15,2)))","v":0},{"$f":"IF($F$15=0,0,IF(U13=1,$F$15-SUM($I$15:$Z$15),ROUND(SUM(OFFSET(U15,1,0):OFFSET(U$18,-1,0))/SUM(OFFSET($F15,1,0):OFFSET($F$18,-1,0))*$F$15,2)))","v":0},{"$f":"IF($F$15=0,0,IF(V13=1,$F$15-SUM($I$15:$Z$15),ROUND(SUM(OFFSET(V15,1,0):OFFSET(V$18,-1,0))/SUM(OFFSET($F15,1,0):OFFSET($F$18,-1,0))*$F$15,2)))","v":0},{"$f":"IF($F$15=0,0,IF(W13=1,$F$15-SUM($I$15:$Z$15),ROUND(SUM(OFFSET(W15,1,0):OFFSET(W$18,-1,0))/SUM(OFFSET($F15,1,0):OFFSET($F$18,-1,0))*$F$15,2)))","v":0},{"$f":"IF($F$15=0,0,IF(X13=1,$F$15-SUM($I$15:$Z$15),ROUND(SUM(OFFSET(X15,1,0):OFFSET(X$18,-1,0))/SUM(OFFSET($F15,1,0):OFFSET($F$18,-1,0))*$F$15,2)))","v":0},{"$f":"IF($F$15=0,0,IF(Y13=1,$F$15-SUM($I$15:$Z$15),ROUND(SUM(OFFSET(Y15,1,0):OFFSET(Y$18,-1,0))/SUM(OFFSET($F15,1,0):OFFSET($F$18,-1,0))*$F$15,2)))","v":0}]
["",{"$f":"IF(OR(C16=\" \",D16=\"\"),\"\",CONCATENATE(C16,\". \",D16))","v":""},{"$f":"IF(OR(ROW(C16)=ROW(EVENTOS.firstrow)+1,AND(OFFSET(C16,-1,0)<>\" \",OFFSET(C16,-1,1)<>\"\")),OFFSET(C16,-1,0)+1,\" \")","v":1},null,{"$f":"IF(AUTOEVENTO=\"Manual\",ROUND(SUMPRODUCT((CÁLCULO!$M$15:$M$27=EVENTOS!$C16)*(OFFSET(CÁLCULO!$AA$15:$AA$27,0,E$13))),2),0)","v":0},{"$f":"IF(AUTOEVENTO=\"Manual\",ROUND(SUMPRODUCT((CÁLCULO!$M$15:$M$27=EVENTOS!$C16)*(OFFSET(CÁLCULO!$AA$15,0,1):OFFSET(CÁLCULO!$AL$27,0,-1))),2),0)","v":0},{"$f":"IF(AND(D16=0,F16>0),\"NOME\",\n IF(AND(D16<>0,$F$14>0,F16=0),\"VALOR\",\n IF(AND(Import.TipoArredondamento=\"TransfereGOV\",$A16=\"F\",LEN(D16)>100),\"Nome >100\",\"\")))","v":""},{"$f":"IF(AUTOEVENTO=\"Manual\",ROUND(SUMPRODUCT((CÁLCULO!$M$15:$M$27=EVENTOS!$C16)*(OFFSET(CÁLCULO!$AA$15:$AA$27,0,H$13))),2),0)","v":0},{"$f":"IF(AUTOEVENTO=\"Manual\",ROUND(SUMPRODUCT((CÁLCULO!$M$15:$M$27=EVENTOS!$C16)*(OFFSET(CÁLCULO!$AA$15:$AA$27,0,I$13))),2),0)","v":0},{"$f":"IF(AUTOEVENTO=\"Manual\",ROUND(SUMPRODUCT((CÁLCULO!$M$15:$M$27=EVENTOS!$C16)*(OFFSET(CÁLCULO!$AA$15:$AA$27,0,J$13))),2),0)","v":0},{"$f":"IF(AUTOEVENTO=\"Manual\",ROUND(SUMPRODUCT((CÁLCULO!$M$15:$M$27=EVENTOS!$C16)*(OFFSET(CÁLCULO!$AA$15:$AA$27,0,K$13))),2),0)","v":0},{"$f":"IF(AUTOEVENTO=\"Manual\",ROUND(SUMPRODUCT((CÁLCULO!$M$15:$M$27=EVENTOS!$C16)*(OFFSET(CÁLCULO!$AA$15:$AA$27,0,L$13))),2),0)","v":0},{"$f":"IF(AUTOEVENTO=\"Manual\",ROUND(SUMPRODUCT((CÁLCULO!$M$15:$M$27=EVENTOS!$C16)*(OFFSET(CÁLCULO!$AA$15:$AA$27,0,M$13))),2),0)","v":0},{"$f":"IF(AUTOEVENTO=\"Manual\",ROUND(SUMPRODUCT((CÁLCULO!$M$15:$M$27=EVENTOS!$C16)*(OFFSET(CÁLCULO!$AA$15:$AA$27,0,N$13))),2),0)","v":0},{"$f":"IF(AUTOEVENTO=\"Manual\",ROUND(SUMPRODUCT((CÁLCULO!$M$15:$M$27=EVENTOS!$C16)*(OFFSET(CÁLCULO!$AA$15:$AA$27,0,O$13))),2),0)","v":0},{"$f":"IF(AUTOEVENTO=\"Manual\",ROUND(SUMPRODUCT((CÁLCULO!$M$15:$M$27=EVENTOS!$C16)*(OFFSET(CÁLCULO!$AA$15:$AA$27,0,P$13))),2),0)","v":0},{"$f":"IF(AUTOEVENTO=\"Manual\",ROUND(SUMPRODUCT((CÁLCULO!$M$15:$M$27=EVENTOS!$C16)*(OFFSET(CÁLCULO!$AA$15:$AA$27,0,Q$13))),2),0)","v":0},{"$f":"IF(AUTOEVENTO=\"Manual\",ROUND(SUMPRODUCT((CÁLCULO!$M$15:$M$27=EVENTOS!$C16)*(OFFSET(CÁLCULO!$AA$15:$AA$27,0,R$13))),2),0)","v":0},{"$f":"IF(AUTOEVENTO=\"Manual\",ROUND(SUMPRODUCT((CÁLCULO!$M$15:$M$27=EVENTOS!$C16)*(OFFSET(CÁLCULO!$AA$15:$AA$27,0,S$13))),2),0)","v":0},{"$f":"IF(AUTOEVENTO=\"Manual\",ROUND(SUMPRODUCT((CÁLCULO!$M$15:$M$27=EVENTOS!$C16)*(OFFSET(CÁLCULO!$AA$15:$AA$27,0,T$13))),2),0)","v":0},{"$f":"IF(AUTOEVENTO=\"Manual\",ROUND(SUMPRODUCT((CÁLCULO!$M$15:$M$27=EVENTOS!$C16)*(OFFSET(CÁLCULO!$AA$15:$AA$27,0,U$13))),2),0)","v":0},{"$f":"IF(AUTOEVENTO=\"Manual\",ROUND(SUMPRODUCT((CÁLCULO!$M$15:$M$27=EVENTOS!$C16)*(OFFSET(CÁLCULO!$AA$15:$AA$27,0,V$13))),2),0)","v":0},{"$f":"IF(AUTOEVENTO=\"Manual\",ROUND(SUMPRODUCT((CÁLCULO!$M$15:$M$27=EVENTOS!$C16)*(OFFSET(CÁLCULO!$AA$15:$AA$27,0,W$13))),2),0)","v":0},{"$f":"IF(AUTOEVENTO=\"Manual\",ROUND(SUMPRODUCT((CÁLCULO!$M$15:$M$27=EVENTOS!$C16)*(OFFSET(CÁLCULO!$AA$15:$AA$27,0,X$13))),2),0)","v":0},{"$f":"IF(AUTOEVENTO=\"Manual\",ROUND(SUMPRODUCT((CÁLCULO!$M$15:$M$27=EVENTOS!$C16)*(OFFSET(CÁLCULO!$AA$15:$AA$27,0,Y$13))),2),0)","v":0}]
["","",{"$f":"IF(OR(ROW(C17)=ROW(EVENTOS.firstrow)+1,AND(OFFSET(C17,-1,0)<>\" \",OFFSET(C17,-1,1)<>\"\")),OFFSET(C17,-1,0)+1,\" \")","v":" "},null,{"$f":"IF(AUTOEVENTO=\"Manual\",ROUND(SUMPRODUCT((CÁLCULO!$M$15:$M$27=EVENTOS!$C17)*(OFFSET(CÁLCULO!$AA$15:$AA$27,0,E$13))),2),0)","v":0},{"$f":"IF(AUTOEVENTO=\"Manual\",ROUND(SUMPRODUCT((CÁLCULO!$M$15:$M$27=EVENTOS!$C17)*(OFFSET(CÁLCULO!$AA$15,0,1):OFFSET(CÁLCULO!$AL$27,0,-1))),2),0)","v":0},"",{"$f":"IF(AUTOEVENTO=\"Manual\",ROUND(SUMPRODUCT((CÁLCULO!$M$15:$M$27=EVENTOS!$C17)*(OFFSET(CÁLCULO!$AA$15:$AA$27,0,H$13))),2),0)","v":0},{"$f":"IF(AUTOEVENTO=\"Manual\",ROUND(SUMPRODUCT((CÁLCULO!$M$15:$M$27=EVENTOS!$C17)*(OFFSET(CÁLCULO!$AA$15:$AA$27,0,I$13))),2),0)","v":0},{"$f":"IF(AUTOEVENTO=\"Manual\",ROUND(SUMPRODUCT((CÁLCULO!$M$15:$M$27=EVENTOS!$C17)*(OFFSET(CÁLCULO!$AA$15:$AA$27,0,J$13))),2),0)","v":0},{"$f":"IF(AUTOEVENTO=\"Manual\",ROUND(SUMPRODUCT((CÁLCULO!$M$15:$M$27=EVENTOS!$C17)*(OFFSET(CÁLCULO!$AA$15:$AA$27,0,K$13))),2),0)","v":0},{"$f":"IF(AUTOEVENTO=\"Manual\",ROUND(SUMPRODUCT((CÁLCULO!$M$15:$M$27=EVENTOS!$C17)*(OFFSET(CÁLCULO!$AA$15:$AA$27,0,L$13))),2),0)","v":0},{"$f":"IF(AUTOEVENTO=\"Manual\",ROUND(SUMPRODUCT((CÁLCULO!$M$15:$M$27=EVENTOS!$C17)*(OFFSET(CÁLCULO!$AA$15:$AA$27,0,M$13))),2),0)","v":0},{"$f":"IF(AUTOEVENTO=\"Manual\",ROUND(SUMPRODUCT((CÁLCULO!$M$15:$M$27=EVENTOS!$C17)*(OFFSET(CÁLCULO!$AA$15:$AA$27,0,N$13))),2),0)","v":0},{"$f":"IF(AUTOEVENTO=\"Manual\",ROUND(SUMPRODUCT((CÁLCULO!$M$15:$M$27=EVENTOS!$C17)*(OFFSET(CÁLCULO!$AA$15:$AA$27,0,O$13))),2),0)","v":0},{"$f":"IF(AUTOEVENTO=\"Manual\",ROUND(SUMPRODUCT((CÁLCULO!$M$15:$M$27=EVENTOS!$C17)*(OFFSET(CÁLCULO!$AA$15:$AA$27,0,P$13))),2),0)","v":0},{"$f":"IF(AUTOEVENTO=\"Manual\",ROUND(SUMPRODUCT((CÁLCULO!$M$15:$M$27=EVENTOS!$C17)*(OFFSET(CÁLCULO!$AA$15:$AA$27,0,Q$13))),2),0)","v":0},{"$f":"IF(AUTOEVENTO=\"Manual\",ROUND(SUMPRODUCT((CÁLCULO!$M$15:$M$27=EVENTOS!$C17)*(OFFSET(CÁLCULO!$AA$15:$AA$27,0,R$13))),2),0)","v":0},{"$f":"IF(AUTOEVENTO=\"Manual\",ROUND(SUMPRODUCT((CÁLCULO!$M$15:$M$27=EVENTOS!$C17)*(OFFSET(CÁLCULO!$AA$15:$AA$27,0,S$13))),2),0)","v":0},{"$f":"IF(AUTOEVENTO=\"Manual\",ROUND(SUMPRODUCT((CÁLCULO!$M$15:$M$27=EVENTOS!$C17)*(OFFSET(CÁLCULO!$AA$15:$AA$27,0,T$13))),2),0)","v":0},{"$f":"IF(AUTOEVENTO=\"Manual\",ROUND(SUMPRODUCT((CÁLCULO!$M$15:$M$27=EVENTOS!$C17)*(OFFSET(CÁLCULO!$AA$15:$AA$27,0,U$13))),2),0)","v":0},{"$f":"IF(AUTOEVENTO=\"Manual\",ROUND(SUMPRODUCT((CÁLCULO!$M$15:$M$27=EVENTOS!$C17)*(OFFSET(CÁLCULO!$AA$15:$AA$27,0,V$13))),2),0)","v":0},{"$f":"IF(AUTOEVENTO=\"Manual\",ROUND(SUMPRODUCT((CÁLCULO!$M$15:$M$27=EVENTOS!$C17)*(OFFSET(CÁLCULO!$AA$15:$AA$27,0,W$13))),2),0)","v":0},{"$f":"IF(AUTOEVENTO=\"Manual\",ROUND(SUMPRODUCT((CÁLCULO!$M$15:$M$27=EVENTOS!$C17)*(OFFSET(CÁLCULO!$AA$15:$AA$27,0,X$13))),2),0)","v":0},{"$f":"IF(AUTOEVENTO=\"Manual\",ROUND(SUMPRODUCT((CÁLCULO!$M$15:$M$27=EVENTOS!$C17)*(OFFSET(CÁLCULO!$AA$15:$AA$27,0,Y$13))),2),0)","v":0}]
["F"]
["F"]
["F"]
["F",null,null,{"$f":"Import.Município","v":"SÃO VALENTIM/RS"}]
["F",null,null,"Local",null,null,null,null,null,null,null,"Responsável Técnico",null,null,null,null,null,null,null,null,null,"Responsável Técnico"]
["F",null,null,null,null,null,null,null,null,null,null,{"$f":"OFFSET(Import.RespOrçamento,0,-1) & \" \" & Import.RespOrçamento","v":"Nome: "},null,null,null,null,null,null,null,null,null,{"$f":"OFFSET(Import.RespOrçamento,0,-1) & \" \" & Import.RespOrçamento","v":"Nome: "}]
["F",null,null,{"$f":"DADOS!$C$25","v":"00:00:00"},null,null,null,null,null,null,null,"CREA/CAU: ",null,null,null,null,null,null,null,null,null,"CREA/CAU: "]
["F",null,null,"Data",null,null,null,null,null,null,null,"ART/RRT: ",null,null,null,null,null,null,null,null,null,"ART/RRT: "]

{"sheet":"CÁLCULO","index":6,"n_rows":35,"n_cols":59,"rows_kept":35,"cut":false,"hidden":false,"merged":[[14,4,14,7],[8,4,8,5],[8,6,8,7],[8,18,8,19],[8,20,8,25],[9,4,9,5],[9,6,9,7],[9,18,9,19],[9,20,9,25],[5,5,5,7],[5,16,5,17],[5,24,5,25],[6,5,6,7],[6,16,6,17],[6,24,6,25]]}
[null,null,null,null,null,null,null,null,null,null,null,null,{"$f":"SUM(OFFSET(CÁLCULO!$P$1,0,1):OFFSET(CÁLCULO!$AA$1,0,-1))","v":3},null,{"$f":"IF(OR(ACOMPANHAMENTO=\"BM\",N1=0,O12=\"\"),0,1)","v":0},".",{"$f":"IF(OR(ACOMPANHAMENTO=\"BM\",P1=0,Q12=\"\"),0,1)","v":1},{"$f":"IF(OR(ACOMPANHAMENTO=\"BM\",Q1=0,R12=\"\"),0,1)","v":1},{"$f":"IF(OR(ACOMPANHAMENTO=\"BM\",R1=0,S12=\"\"),0,1)","v":1},{"$f":"IF(OR(ACOMPANHAMENTO=\"BM\",S1=0,T12=\"\"),0,1)","v":0},{"$f":"IF(OR(ACOMPANHAMENTO=\"BM\",T1=0,U12=\"\"),0,1)","v":0},{"$f":"IF(OR(ACOMPANHAMENTO=\"BM\",U1=0,V12=\"\"),0,1)","v":0},{"$f":"IF(OR(ACOMPANHAMENTO=\"BM\",V1=0,W12=\"\"),0,1)","v":0},{"$f":"IF(OR(ACOMPANHAMENTO=\"BM\",W1=0,X12=\"\"),0,1)","v":0},{"$f":"IF(OR(ACOMPANHAMENTO=\"BM\",X1=0,Y12=\"\"),0,1)","v":0},{"$f":"IF(OR(ACOMPANHAMENTO=\"BM\",Y1=0,Z12=\"\"),0,1)","v":0},null,"Preços dos serviços por frente",null,null,null,null,null,null,null,null,null,null,"Mês do cronograma",null,null,null,null,null,null,null,null,null,null,"Número da Medição"]
[]
[]
[]
[]
[null,null,null,null,null,{"$f":"IF(ACOMPANHAMENTO=\"BM\",\"MEMÓRIA DE CÁLCULO\",\"PLQ - PLANILHA DE LEVANTAMENTO DE QUANTIDADES\")","v":"PLQ - PLANILHA DE LEVANTAMENTO DE QUANTIDADES"},null,null,null,null,null,null,null,null,null,null,"Grau de Sigilo",null,null,null,null,null,null,null,"Grau de Sigilo"]
[null,null,null,null,null,{"$f":"IF(ACOMPANHAMENTO=\"BM\",\"\",\"Memória de Cálculo\")&\" - \"&import.recurso","v":"Memória de Cálculo - OGU"},null,null,null,null,null,null,null,null,null,null,"#PUBLICO",null,null,null,null,null,null,null,"#PUBLICO"]
[]
[null,null,null,null,"APELIDO DO EMPREENDIMENTO",null,"Nº TransfereGOV",null,"Nº OPERAÇÃO",null,"PROPONENTE / TOMADOR",null,null,null,null,null,null,null,"Nº OPERAÇÃO",null,"PROPONENTE / TOMADOR"]
["AdmLocal",null,null,null,{"$f":"Import.Apelido","v":"COBERTURA RUA PEDRO DASSOLER"},null,{"$f":"Import.TransfereGOV","v":0},null,{"$f":"Import.CR","v":0},null,{"$f":"Import.Proponente","v":"MUNICÍPIO DE SÃO VALENTIN"},null,null,null,null,null,null,null,{"$f":"Import.CR","v":0},null,{"$f":"Import.Proponente","v":"MUNICÍPIO DE SÃO VALENTIN"}]
[{"$f":"IF(AND(Import.TipoArredondamento=\"Tradicional\",AUTOEVENTO=\"Manual\"),\"Automática\",IF(CRONOPLE!$B$8=\"\",\"Sem Adm\",\"Manual\"))","v":"Manual"},null,null,null,null,{"$f":"IF(AND(ACOMPANHAMENTO=\"PLE\",ISERROR(AUTOEVENTO)),\"Selecione a forma de definição dos agrupadores de eventos na aba EVENTOS\",\n  IF(AND(ACOMPANHAMENTO=\"PLE\",CÁLCULO.FrentesPreenchidas=0),\"Preencher os nomes das Frentes de Obra\",\n  IF(COUNTIF($J$15:$J$27,\"►E\")>0,\"Não pode haver serviços sem agrupador de eventos\",\n  IF(COUNTIF($P$11:$AA$11,\"▼\")>0,\"Não pode haver frentes de obra sem quantidades\",\n  IF(COUNTIF($P$11:$AA$11,\"Nome >100\")>0,\"Nome da frente de obra com mais de 100 caracteres\",\"\")))))","v":""},null,null,null,null,null,null,null,{"$f":"IF(OR(COUNTIF($J$15:$J$27,\"►E\")>0,COUNTIF($J$15:$J$27,\"►Q\")>0),\"\",\nIF(COUNTIF($J$15:$J$27,\"►S\")>0,\"Preencha as quantidades com no máximo duas casas decimais\",\nIF(COUNTIF($P$11:$AA$11,\"▼\")>0,\"Falta preencher a frente de obra nº \" & HLOOKUP(\"▼\",$P$11:$AA$13,3,FALSE),\nIF(COUNTIF($P$11:$AA$11,\"Nome >100\")>0,\"Resuma o nome da frente de obra nº \" & HLOOKUP(\"Nome >100\",$P$11:$AA$13,3,FALSE),\"\"))))","v":""},{"$f":"IF(AND(O1=1,O15=0),\"▼\",IF(AND(O1=1,LEN(O12)>100),\"Nome >100\",\"\"))","v":{"$error":"#VALUE!"}},null,{"$f":"IF(AND(Q1=1,Q15=0),\"▼\",IF(AND(Q1=1,LEN(Q12)>100),\"Nome >100\",\"\"))","v":""},"","","","","","","","",""]
[{"$f":"IF(Import.Eventos.Nível=\"Definir Manualmente\",\"Manual\",MATCH(Import.Eventos.Nível,EVENTOS!$B$6:$B$9,0)+1)","v":2},"Empty","FILTRO",null,null,null,null,null,{"$f":"IF(AND(ACOMPANHAMENTO=\"PLE\",CÁLCULO.FrentesPreenchidas=0),\"\",\n  IF(COUNTIF($J$15:$J$27,\"►E\")>0,\"Falta Definir o Agrupador de Evento na linha \"&MATCH(\"►E\",$J$15:$J$27,0)+ROW($J$14),\n  IF(COUNTIF($J$15:$J$27,\"►Q\")>0,\"Falta preencher a quantidade do serviço na linha \"&MATCH(\"►Q\",$J$15:$J$27,0)+ROW($J$14),\n  IF(COUNTIF($J$15:$J$27,\"►S\")>0,\"Verifique as quantidades preenchidas na linha \"&MATCH(\"►S\",$J$15:$J$27,0)+ROW($J$14),\n  IF(AND(COUNTIF($P$11:$AA$11,\"▼\")=0,COUNTIF($J$15:$J$27,\"◄\")>0),\"Falta Preencher o Memorial de Cálculo na linha \"&MATCH(\"◄\",$J$15:$J$27,0)+ROW($J$14),\"\")))))","v":""},".","Nº AGRUPADOR DE EVENTOS",".",{"$f":"IF(ACOMPANHAMENTO=\"BM\",0,MAX($M$15:$M$27))","v":2},{"$f":"IF(AND(ACOMPANHAMENTO=\"PLE\",CÁLCULO.FrentesPreenchidas=0),\"Preencher os nomes das Frentes de Obra ►\",\"FRENTES DE OBRA:\")","v":"FRENTES DE OBRA:"},null,".","PILARES PRÉ MOLDADO 20X25 CM","ESTRUTURA E COBERTURA","ESTRUTURA E COBERTURA",null,null,null,null,null,null,null,".",{"$f":"IF(OFFSET($P$1,0,AB$13)=0,0,OFFSET($P$12,0,AB$13))","v":"PILARES PRÉ MOLDADO 20X25 CM"},{"$f":"IF(OFFSET($P$1,0,AC$13)=0,0,OFFSET($P$12,0,AC$13))","v":"ESTRUTURA E COBERTURA"},"ESTRUTURA E COBERTURA",0,0,0,0,0,0,0,null,{"$f":"IF(OFFSET($P$1,0,AM$13)=0,0,OFFSET($P$12,0,AM$13))","v":"PILARES PRÉ MOLDADO 20X25 CM"},"ESTRUTURA E COBERTURA","ESTRUTURA E COBERTURA",0,0,0,0,0,0,0,null,"PILARES PRÉ MOLDADO 20X25 CM","ESTRUTURA E COBERTURA","ESTRUTURA E COBERTURA",0,0,0,0,0,0,0]
["AUTOEVENTO","Empty","↓","Nível","Item","Descrição","Unidade","Quantidade","Memória de Cálculo",null,"Nº",null,"# Evento","Agrupador de Eventos",{"$f":"OFFSET(O13,0,-1)+1","v":{"$error":"#VALUE!"}},null,{"$f":"OFFSET(Q13,0,-1)+1","v":1},2,3,4,5,6,7,8,9,10,null,{"$f":"OFFSET(AB13,0,-1)+1","v":1},2,3,4,5,6,7,8,9,10,null,1,2,3,4,5,6,7,8,9,10,null,1,2,3,4,5,6,7,8,9,10]
[{"$f":"IFERROR(IF(AUTOEVENTO=\"Manual\",IF(K14<>\"\",MIN(VALUE(LEFT(K14,FIND(\".\",K14)-1)),COUNTA(EVENTOS.Lista)),0),IF(OR($B14>AUTOEVENTO,$B14=\"S\",$B14=0),SUBSTITUTE(OFFSET($A14,-1,0),IF($D14=\"Serviço\",\".\",\"\"),\"\"),ROW(A14)-ROW($A$15)&\".\")),0)","v":"AUTOEVENTO"},{"$f":"OFFSET(ORÇAMENTO!C$15,ROW(B14)-ROW(B$15),0)","v":"S"},{"$f":"OFFSET(ORÇAMENTO!L$15,ROW(C14)-ROW(C$15),0)","v":""},{"$f":"OFFSET(ORÇAMENTO!N$15,ROW(D14)-ROW(D$15),0)","v":"Serviço"},{"$f":"OFFSET(ORÇAMENTO!O$15,ROW(E14)-ROW(E$15),0)","v":"-"},{"$f":"OFFSET(ORÇAMENTO!R$15,ROW(F14)-ROW(F$15),0)","v":"(abra o arquivo 'Referência 02-2026.xlsm)"},{"$f":"IF($D14<>\"Serviço\",\"\",OFFSET(ORÇAMENTO!S$15,ROW(G14)-ROW(G$15),0))","v":"-"},{"$f":"IF($D14<>\"Serviço\",0,IF(ACOMPANHAMENTO=\"BM\",ROUND(OFFSET(ORÇAMENTO!AJ$15,ROW(H14)-ROW(H$15),0),15-13*ORÇAMENTO!$AF$7),SUMPRODUCT(($Q$1:$AA$1=1)*ROUND($Q14:$AA14,15-13*ORÇAMENTO!$AF$7))))","v":0},null,{"$f":"IF(OR(B14<>\"S\",CÁLCULO.FrentesPreenchidas=0),\"\",IF(AND(ACOMPANHAMENTO=\"PLE\",AUTOEVENTO=\"Manual\",OR(H14>0,ORÇAMENTO!AC14=\"QUANT.\"),OR(K14=\"\",M14=0,N14=\"\")),\"►E\",IF(AND(ACOMPANHAMENTO=\"PLE\",ORÇAMENTO!AC14=\"QUANT.\"),\"►Q\",IF(AND(ACOMPANHAMENTO=\"PLE\",H14<>SUMPRODUCT(($Q$1:$AA$1=1)*ROUND(Q14:AA14,15))),\"►S\",IF(AND(COUNTIF($P$11:$AA$11,\"▼\")=0,H14>0,I14=\"\"),\"◄M\",\"\")))))","v":{"$error":"#VALUE!"}},null,".",{"$f":"IF($D14<>\"Serviço\",\"\",\n          IF(AUTOEVENTO=\"manual\",$A14,\n                IF(ISERROR(MATCH($A14,$A$15:OFFSET($A14,-1,0),0)),MAX($M$15:OFFSET(M14,-1,0))+1,\n                      INDEX($M$15:OFFSET(M14,-1,0),MATCH($A14,$A$15:OFFSET($A14,-1,0),0)))))","v":"# Evento"},{"$f":"IF($D14<>\"Serviço\",\"\",\n         IF(AUTOEVENTO=\"Manual\",\n                IF($A14=0,\"<-- defina o número do agrupador\",\n                       OFFSET(EVENTOS!$D$15,$A14-$A$15,0)),\n                OFFSET($F$15,$A14,0)))","v":{"$error":"#VALUE!"}},null,null,null,null,null,null,null,null,null,null,null,null,null,{"$f":"IF(AND($D14=\"Serviço\",AB$12<>0,$H14>0,OR(AUTOEVENTO<>\"manual\",$M14<>$A$15)),\n        IF(Import.TipoArredondamento<>\"TransfereGOV\",\n              ROUND(OFFSET($P14,0,AB$13),15-13*ORÇAMENTO!$AF$7)/$H14*OFFSET(ORÇAMENTO!$X$15,ROW(AB14)-ROW(AB$15),0),\n              ROUND(ROUND(OFFSET($P14,0,AB$13),15-13*ORÇAMENTO!$AF$7)*OFFSET(ORÇAMENTO!$W$15,ROW(AB14)-ROW(AB$15),0),15-13*ORÇAMENTO!$AF$11)),\n         0)","v":0},{"$f":"IF(AND($D14=\"Serviço\",AC$12<>0,$H14>0,OR(AUTOEVENTO<>\"manual\",$M14<>$A$15)),\n        IF(Import.TipoArredondamento<>\"TransfereGOV\",\n              ROUND(OFFSET($P14,0,AC$13),15-13*ORÇAMENTO!$AF$7)/$H14*OFFSET(ORÇAMENTO!$X$15,ROW(AC14)-ROW(AC$15),0),\n              ROUND(ROUND(OFFSET($P14,0,AC$13),15-13*ORÇAMENTO!$AF$7)*OFFSET(ORÇAMENTO!$W$15,ROW(AC14)-ROW(AC$15),0),15-13*ORÇAMENTO!$AF$11)),\n         0)","v":0},{"$f":"IF(AND($D14=\"Serviço\",AD$12<>0,$H14>0,OR(AUTOEVENTO<>\"manual\",$M14<>$A$15)),\n        IF(Import.TipoArredondamento<>\"TransfereGOV\",\n              ROUND(OFFSET($P14,0,AD$13),15-13*ORÇAMENTO!$AF$7)/$H14*OFFSET(ORÇAMENTO!$X$15,ROW(AD14)-ROW(AD$15),0),\n              ROUND(ROUND(OFFSET($P14,0,AD$13),15-13*ORÇAMENTO!$AF$7)*OFFSET(ORÇAMENTO!$W$15,ROW(AD14)-ROW(AD$15),0),15-13*ORÇAMENTO!$AF$11)),\n         0)","v":0},{"$f":"IF(AND($D14=\"Serviço\",AE$12<>0,$H14>0,OR(AUTOEVENTO<>\"manual\",$M14<>$A$15)),\n        IF(Import.TipoArredondamento<>\"TransfereGOV\",\n              ROUND(OFFSET($P14,0,AE$13),15-13*ORÇAMENTO!$AF$7)/$H14*OFFSET(ORÇAMENTO!$X$15,ROW(AE14)-ROW(AE$15),0),\n              ROUND(ROUND(OFFSET($P14,0,AE$13),15-13*ORÇAMENTO!$AF$7)*OFFSET(ORÇAMENTO!$W$15,ROW(AE14)-ROW(AE$15),0),15-13*ORÇAMENTO!$AF$11)),\n         0)","v":0},{"$f":"IF(AND($D14=\"Serviço\",AF$12<>0,$H14>0,OR(AUTOEVENTO<>\"manual\",$M14<>$A$15)),\n        IF(Import.TipoArredondamento<>\"TransfereGOV\",\n              ROUND(OFFSET($P14,0,AF$13),15-13*ORÇAMENTO!$AF$7)/$H14*OFFSET(ORÇAMENTO!$X$15,ROW(AF14)-ROW(AF$15),0),\n              ROUND(ROUND(OFFSET($P14,0,AF$13),15-13*ORÇAMENTO!$AF$7)*OFFSET(ORÇAMENTO!$W$15,ROW(AF14)-ROW(AF$15),0),15-13*ORÇAMENTO!$AF$11)),\n         0)","v":0},{"$f":"IF(AND($D14=\"Serviço\",AG$12<>0,$H14>0,OR(AUTOEVENTO<>\"manual\",$M14<>$A$15)),\n        IF(Import.TipoArredondamento<>\"TransfereGOV\",\n              ROUND(OFFSET($P14,0,AG$13),15-13*ORÇAMENTO!$AF$7)/$H14*OFFSET(ORÇAMENTO!$X$15,ROW(AG14)-ROW(AG$15),0),\n              ROUND(ROUND(OFFSET($P14,0,AG$13),15-13*ORÇAMENTO!$AF$7)*OFFSET(ORÇAMENTO!$W$15,ROW(AG14)-ROW(AG$15),0),15-13*ORÇAMENTO!$AF$11)),\n         0)","v":0},{"$f":"IF(AND($D14=\"Serviço\",AH$12<>0,$H14>0,OR(AUTOEVENTO<>\"manual\",$M14<>$A$15)),\n        IF(Import.TipoArredondamento<>\"TransfereGOV\",\n              ROUND(OFFSET($P14,0,AH$13),15-13*ORÇAMENTO!$AF$7)/$H14*OFFSET(ORÇAMENTO!$X$15,ROW(AH14)-ROW(AH$15),0),\n              ROUND(ROUND(OFFSET($P14,0,AH$13),15-13*ORÇAMENTO!$AF$7)*OFFSET(ORÇAMENTO!$W$15,ROW(AH14)-ROW(AH$15),0),15-13*ORÇAMENTO!$AF$11)),\n         0)","v":0},{"$f":"IF(AND($D14=\"Serviço\",AI$12<>0,$H14>0,OR(AUTOEVENTO<>\"manual\",$M14<>$A$15)),\n        IF(Import.TipoArredondamento<>\"TransfereGOV\",\n              ROUND(OFFSET($P14,0,AI$13),15-13*ORÇAMENTO!$AF$7)/$H14*OFFSET(ORÇAMENTO!$X$15,ROW(AI14)-ROW(AI$15),0),\n              ROUND(ROUND(OFFSET($P14,0,AI$13),15-13*ORÇAMENTO!$AF$7)*OFFSET(ORÇAMENTO!$W$15,ROW(AI14)-ROW(AI$15),0),15-13*ORÇAMENTO!$AF$11)),\n         0)","v":0},{"$f":"IF(AND($D14=\"Serviço\",AJ$12<>0,$H14>0,OR(AUTOEVENTO<>\"manual\",$M14<>$A$15)),\n        IF(Import.TipoArredondamento<>\"TransfereGOV\",\n              ROUND(OFFSET($P14,0,AJ$13),15-13*ORÇAMENTO!$AF$7)/$H14*OFFSET(ORÇAMENTO!$X$15,ROW(AJ14)-ROW(AJ$15),0),\n              ROUND(ROUND(OFFSET($P14,0,AJ$13),15-13*ORÇAMENTO!$AF$7)*OFFSET(ORÇAMENTO!$W$15,ROW(AJ14)-ROW(AJ$15),0),15-13*ORÇAMENTO!$AF$11)),\n         0)","v":0},{"$f":"IF(AND($D14=\"Serviço\",AK$12<>0,$H14>0,OR(AUTOEVENTO<>\"manual\",$M14<>$A$15)),\n        IF(Import.TipoArredondamento<>\"TransfereGOV\",\n              ROUND(OFFSET($P14,0,AK$13),15-13*ORÇAMENTO!$AF$7)/$H14*OFFSET(ORÇAMENTO!$X$15,ROW(AK14)-ROW(AK$15),0),\n              ROUND(ROUND(OFFSET($P14,0,AK$13),15-13*ORÇAMENTO!$AF$7)*OFFSET(ORÇAMENTO!$W$15,ROW(AK14)-ROW(AK$15),0),15-13*ORÇAMENTO!$AF$11)),\n         0)","v":0},null,{"$f":"IF(OR($D14<>\"Serviço\",AND(AUTOEVENTO=\"Manual\",$M14=$A$15)),0,\n         IF(OFFSET(CRONOPLE!$F$15,$M14-$A$15,AM$13)=0,10^12,OFFSET(CRONOPLE!$F$15,$M14-$A$15,AM$13)))","v":{"$error":"#VALUE!"}},{"$f":"IF(OR($D14<>\"Serviço\",AND(AUTOEVENTO=\"Manual\",$M14=$A$15)),0,\n         IF(OFFSET(CRONOPLE!$F$15,$M14-$A$15,AN$13)=0,10^12,OFFSET(CRONOPLE!$F$15,$M14-$A$15,AN$13)))","v":{"$error":"#VALUE!"}},{"$f":"IF(OR($D14<>\"Serviço\",AND(AUTOEVENTO=\"Manual\",$M14=$A$15)),0,\n         IF(OFFSET(CRONOPLE!$F$15,$M14-$A$15,AO$13)=0,10^12,OFFSET(CRONOPLE!$F$15,$M14-$A$15,AO$13)))","v":{"$error":"#VALUE!"}},{"$f":"IF(OR($D14<>\"Serviço\",AND(AUTOEVENTO=\"Manual\",$M14=$A$15)),0,\n         IF(OFFSET(CRONOPLE!$F$15,$M14-$A$15,AP$13)=0,10^12,OFFSET(CRONOPLE!$F$15,$M14-$A$15,AP$13)))","v":{"$error":"#VALUE!"}},{"$f":"IF(OR($D14<>\"Serviço\",AND(AUTOEVENTO=\"Manual\",$M14=$A$15)),0,\n         IF(OFFSET(CRONOPLE!$F$15,$M14-$A$15,AQ$13)=0,10^12,OFFSET(CRONOPLE!$F$15,$M14-$A$15,AQ$13)))","v":{"$error":"#VALUE!"}},{"$f":"IF(OR($D14<>\"Serviço\",AND(AUTOEVENTO=\"Manual\",$M14=$A$15)),0,\n         IF(OFFSET(CRONOPLE!$F$15,$M14-$A$15,AR$13)=0,10^12,OFFSET(CRONOPLE!$F$15,$M14-$A$15,AR$13)))","v":{"$error":"#VALUE!"}},{"$f":"IF(OR($D14<>\"Serviço\",AND(AUTOEVENTO=\"Manual\",$M14=$A$15)),0,\n         IF(OFFSET(CRONOPLE!$F$15,$M14-$A$15,AS$13)=0,10^12,OFFSET(CRONOPLE!$F$15,$M14-$A$15,AS$13)))","v":{"$error":"#VALUE!"}},{"$f":"IF(OR($D14<>\"Serviço\",AND(AUTOEVENTO=\"Manual\",$M14=$A$15)),0,\n         IF(OFFSET(CRONOPLE!$F$15,$M14-$A$15,AT$13)=0,10^12,OFFSET(CRONOPLE!$F$15,$M14-$A$15,AT$13)))","v":{"$error":"#VALUE!"}},{"$f":"IF(OR($D14<>\"Serviço\",AND(AUTOEVENTO=\"Manual\",$M14=$A$15)),0,\n         IF(OFFSET(CRONOPLE!$F$15,$M14-$A$15,AU$13)=0,10^12,OFFSET(CRONOPLE!$F$15,$M14-$A$15,AU$13)))","v":{"$error":"#VALUE!"}},{"$f":"IF(OR($D14<>\"Serviço\",AND(AUTOEVENTO=\"Manual\",$M14=$A$15)),0,\n         IF(OFFSET(CRONOPLE!$F$15,$M14-$A$15,AV$13)=0,10^12,OFFSET(CRONOPLE!$F$15,$M14-$A$15,AV$13)))","v":{"$error":"#VALUE!"}},null,{"$f":"IF(OR($D14<>\"Serviço\",AND(AUTOEVENTO=\"Manual\",$M14=$A$15),$M14>(ROW(PLE.lastrow)-ROW(PLE.firstrow))),0,\n           IF(OFFSET(PLE!$G$15,$M14-$A$15,AX$13)=\"\",10^12,OFFSET(PLE!$G$15,$M14-$A$15,AX$13)))","v":0},{"$f":"IF(OR($D14<>\"Serviço\",AND(AUTOEVENTO=\"Manual\",$M14=$A$15),$M14>(ROW(PLE.lastrow)-ROW(PLE.firstrow))),0,\n           IF(OFFSET(PLE!$G$15,$M14-$A$15,AY$13)=\"\",10^12,OFFSET(PLE!$G$15,$M14-$A$15,AY$13)))","v":0},{"$f":"IF(OR($D14<>\"Serviço\",AND(AUTOEVENTO=\"Manual\",$M14=$A$15),$M14>(ROW(PLE.lastrow)-ROW(PLE.firstrow))),0,\n           IF(OFFSET(PLE!$G$15,$M14-$A$15,AZ$13)=\"\",10^12,OFFSET(PLE!$G$15,$M14-$A$15,AZ$13)))","v":0},{"$f":"IF(OR($D14<>\"Serviço\",AND(AUTOEVENTO=\"Manual\",$M14=$A$15),$M14>(ROW(PLE.lastrow)-ROW(PLE.firstrow))),0,\n           IF(OFFSET(PLE!$G$15,$M14-$A$15,BA$13)=\"\",10^12,OFFSET(PLE!$G$15,$M14-$A$15,BA$13)))","v":0},{"$f":"IF(OR($D14<>\"Serviço\",AND(AUTOEVENTO=\"Manual\",$M14=$A$15),$M14>(ROW(PLE.lastrow)-ROW(PLE.firstrow))),0,\n           IF(OFFSET(PLE!$G$15,$M14-$A$15,BB$13)=\"\",10^12,OFFSET(PLE!$G$15,$M14-$A$15,BB$13)))","v":0},{"$f":"IF(OR($D14<>\"Serviço\",AND(AUTOEVENTO=\"Manual\",$M14=$A$15),$M14>(ROW(PLE.lastrow)-ROW(PLE.firstrow))),0,\n           IF(OFFSET(PLE!$G$15,$M14-$A$15,BC$13)=\"\",10^12,OFFSET(PLE!$G$15,$M14-$A$15,BC$13)))","v":0},{"$f":"IF(OR($D14<>\"Serviço\",AND(AUTOEVENTO=\"Manual\",$M14=$A$15),$M14>(ROW(PLE.lastrow)-ROW(PLE.firstrow))),0,\n           IF(OFFSET(PLE!$G$15,$M14-$A$15,BD$13)=\"\",10^12,OFFSET(PLE!$G$15,$M14-$A$15,BD$13)))","v":0},{"$f":"IF(OR($D14<>\"Serviço\",AND(AUTOEVENTO=\"Manual\",$M14=$A$15),$M14>(ROW(PLE.lastrow)-ROW(PLE.firstrow))),0,\n           IF(OFFSET(PLE!$G$15,$M14-$A$15,BE$13)=\"\",10^12,OFFSET(PLE!$G$15,$M14-$A$15,BE$13)))","v":0},{"$f":"IF(OR($D14<>\"Serviço\",AND(AUTOEVENTO=\"Manual\",$M14=$A$15),$M14>(ROW(PLE.lastrow)-ROW(PLE.firstrow))),0,\n           IF(OFFSET(PLE!$G$15,$M14-$A$15,BF$13)=\"\",10^12,OFFSET(PLE!$G$15,$M14-$A$15,BF$13)))","v":0},{"$f":"IF(OR($D14<>\"Serviço\",AND(AUTOEVENTO=\"Manual\",$M14=$A$15),$M14>(ROW(PLE.lastrow)-ROW(PLE.firstrow))),0,\n           IF(OFFSET(PLE!$G$15,$M14-$A$15,BG$13)=\"\",10^12,OFFSET(PLE!$G$15,$M14-$A$15,BG$13)))","v":0}]
[{"$f":"IF(AdmLocal=\"Automática\",1,0)","v":0},{"$f":"OFFSET(ORÇAMENTO!C$15,ROW(B15)-ROW(B$15),0)","v":"L"},{"$f":"OFFSET(ORÇAMENTO!L$15,ROW(C15)-ROW(C$15),0)","v":"F"},{"$f":"IF(TIPOORCAMENTO=\"LICITADO\",\"CTEF\",\"LOTE\")","v":"LOTE"},{"$f":"Import.DescLote","v":0},null,null,null,null,null,null,".",0,"TOTAL FINANC. POR FRENTE (R$):",{"$f":"OFFSET($AA$15,0,O$13)","v":{"$error":"#VALUE!"}},null,{"$f":"OFFSET($AA$15,0,Q$13)","v":14441.56},45153.72,75065.679999999993,0,0,0,0,0,0,0,null,{"$f":"ROUND(SUM(OFFSET(AB$15,1,0):AB$27),2)","v":14441.56},{"$f":"SUM(OFFSET(AC$15,1,0):AC$27)","v":45153.72},{"$f":"SUM(OFFSET(AD$15,1,0):AD$27)","v":75065.679999999993},{"$f":"SUM(OFFSET(AE$15,1,0):AE$27)","v":0},{"$f":"SUM(OFFSET(AF$15,1,0):AF$27)","v":0},{"$f":"SUM(OFFSET(AG$15,1,0):AG$27)","v":0},{"$f":"SUM(OFFSET(AH$15,1,0):AH$27)","v":0},{"$f":"SUM(OFFSET(AI$15,1,0):AI$27)","v":0},{"$f":"SUM(OFFSET(AJ$15,1,0):AJ$27)","v":0},{"$f":"SUM(OFFSET(AK$15,1,0):AK$27)","v":0},null,{"$f":"10^12","v":1000000000000},{"$f":"10^12","v":1000000000000},1000000000000,1000000000000,1000000000000,1000000000000,1000000000000,1000000000000,1000000000000,1000000000000,null,{"$f":"10^12","v":1000000000000},1000000000000,1000000000000,1000000000000,1000000000000,1000000000000,1000000000000,1000000000000,1000000000000,1000000000000]
[{"$f":"IFERROR(IF(AUTOEVENTO=\"Manual\",IF(K16<>\"\",MIN(VALUE(LEFT(K16,FIND(\".\",K16)-1)),COUNTA(EVENTOS.Lista)),0),IF(OR($B16>AUTOEVENTO,$B16=\"S\",$B16=0),SUBSTITUTE(OFFSET($A16,-1,0),IF($D16=\"Serviço\",\".\",\"\"),\"\"),ROW(A16)-ROW($A$15)&\".\")),0)","v":"1."},{"$f":"OFFSET(ORÇAMENTO!C$15,ROW(B16)-ROW(B$15),0)","v":1},{"$f":"OFFSET(ORÇAMENTO!L$15,ROW(C16)-ROW(C$15),0)","v":"F"},{"$f":"OFFSET(ORÇAMENTO!N$15,ROW(D16)-ROW(D$15),0)","v":"Meta"},{"$f":"OFFSET(ORÇAMENTO!O$15,ROW(E16)-ROW(E$15),0)","v":"1."},{"$f":"OFFSET(ORÇAMENTO!R$15,ROW(F16)-ROW(F$15),0)","v":"COBERTURA RUA PEDRO DASSOLER "},{"$f":"IF($D16<>\"Serviço\",\"\",OFFSET(ORÇAMENTO!S$15,ROW(G16)-ROW(G$15),0))","v":""},{"$f":"IF($D16<>\"Serviço\",0,IF(ACOMPANHAMENTO=\"BM\",ROUND(OFFSET(ORÇAMENTO!AJ$15,ROW(H16)-ROW(H$15),0),15-13*ORÇAMENTO!$AF$7),SUMPRODUCT(($Q$1:$AA$1=1)*ROUND($Q16:$AA16,15-13*ORÇAMENTO!$AF$7))))","v":0},null,{"$f":"IF(OR(B16<>\"S\",CÁLCULO.FrentesPreenchidas=0),\"\",IF(AND(ACOMPANHAMENTO=\"PLE\",AUTOEVENTO=\"Manual\",OR(H16>0,ORÇAMENTO!AC16=\"QUANT.\"),OR(K16=\"\",M16=0,N16=\"\")),\"►E\",IF(AND(ACOMPANHAMENTO=\"PLE\",ORÇAMENTO!AC16=\"QUANT.\"),\"►Q\",IF(AND(ACOMPANHAMENTO=\"PLE\",H16<>SUMPRODUCT(($Q$1:$AA$1=1)*ROUND(Q16:AA16,15))),\"►S\",IF(AND(COUNTIF($P$11:$AA$11,\"▼\")=0,H16>0,I16=\"\"),\"◄M\",\"\")))))","v":""},null,".",{"$f":"IF($D16<>\"Serviço\",\"\",\n          IF(AUTOEVENTO=\"manual\",$A16,\n                IF(ISERROR(MATCH($A16,$A$15:OFFSET($A16,-1,0),0)),MAX($M$15:OFFSET(M16,-1,0))+1,\n                      INDEX($M$15:OFFSET(M16,-1,0),MATCH($A16,$A$15:OFFSET($A16,-1,0),0)))))","v":""},{"$f":"IF($D16<>\"Serviço\",\"\",\n         IF(AUTOEVENTO=\"Manual\",\n                IF($A16=0,\"<-- defina o número do agrupador\",\n                       OFFSET(EVENTOS!$D$15,$A16-$A$15,0)),\n                OFFSET($F$15,$A16,0)))","v":""},null,null,null,null,null,null,null,null,null,null,null,null,null,{"$f":"IF(AND($D16=\"Serviço\",AB$12<>0,$H16>0,OR(AUTOEVENTO<>\"manual\",$M16<>$A$15)),\n        IF(Import.TipoArredondamento<>\"TransfereGOV\",\n              ROUND(OFFSET($P16,0,AB$13),15-13*ORÇAMENTO!$AF$7)/$H16*OFFSET(ORÇAMENTO!$X$15,ROW(AB16)-ROW(AB$15),0),\n              ROUND(ROUND(OFFSET($P16,0,AB$13),15-13*ORÇAMENTO!$AF$7)*OFFSET(ORÇAMENTO!$W$15,ROW(AB16)-ROW(AB$15),0),15-13*ORÇAMENTO!$AF$11)),\n         0)","v":0},{"$f":"IF(AND($D16=\"Serviço\",AC$12<>0,$H16>0,OR(AUTOEVENTO<>\"manual\",$M16<>$A$15)),\n        IF(Import.TipoArredondamento<>\"TransfereGOV\",\n              ROUND(OFFSET($P16,0,AC$13),15-13*ORÇAMENTO!$AF$7)/$H16*OFFSET(ORÇAMENTO!$X$15,ROW(AC16)-ROW(AC$15),0),\n              ROUND(ROUND(OFFSET($P16,0,AC$13),15-13*ORÇAMENTO!$AF$7)*OFFSET(ORÇAMENTO!$W$15,ROW(AC16)-ROW(AC$15),0),15-13*ORÇAMENTO!$AF$11)),\n         0)","v":0},{"$f":"IF(AND($D16=\"Serviço\",AD$12<>0,$H16>0,OR(AUTOEVENTO<>\"manual\",$M16<>$A$15)),\n        IF(Import.TipoArredondamento<>\"TransfereGOV\",\n              ROUND(OFFSET($P16,0,AD$13),15-13*ORÇAMENTO!$AF$7)/$H16*OFFSET(ORÇAMENTO!$X$15,ROW(AD16)-ROW(AD$15),0),\n              ROUND(ROUND(OFFSET($P16,0,AD$13),15-13*ORÇAMENTO!$AF$7)*OFFSET(ORÇAMENTO!$W$15,ROW(AD16)-ROW(AD$15),0),15-13*ORÇAMENTO!$AF$11)),\n         0)","v":0},{"$f":"IF(AND($D16=\"Serviço\",AE$12<>0,$H16>0,OR(AUTOEVENTO<>\"manual\",$M16<>$A$15)),\n        IF(Import.TipoArredondamento<>\"TransfereGOV\",\n              ROUND(OFFSET($P16,0,AE$13),15-13*ORÇAMENTO!$AF$7)/$H16*OFFSET(ORÇAMENTO!$X$15,ROW(AE16)-ROW(AE$15),0),\n              ROUND(ROUND(OFFSET($P16,0,AE$13),15-13*ORÇAMENTO!$AF$7)*OFFSET(ORÇAMENTO!$W$15,ROW(AE16)-ROW(AE$15),0),15-13*ORÇAMENTO!$AF$11)),\n         0)","v":0},{"$f":"IF(AND($D16=\"Serviço\",AF$12<>0,$H16>0,OR(AUTOEVENTO<>\"manual\",$M16<>$A$15)),\n        IF(Import.TipoArredondamento<>\"TransfereGOV\",\n              ROUND(OFFSET($P16,0,AF$13),15-13*ORÇAMENTO!$AF$7)/$H16*OFFSET(ORÇAMENTO!$X$15,ROW(AF16)-ROW(AF$15),0),\n              ROUND(ROUND(OFFSET($P16,0,AF$13),15-13*ORÇAMENTO!$AF$7)*OFFSET(ORÇAMENTO!$W$15,ROW(AF16)-ROW(AF$15),0),15-13*ORÇAMENTO!$AF$11)),\n         0)","v":0},{"$f":"IF(AND($D16=\"Serviço\",AG$12<>0,$H16>0,OR(AUTOEVENTO<>\"manual\",$M16<>$A$15)),\n        IF(Import.TipoArredondamento<>\"TransfereGOV\",\n              ROUND(OFFSET($P16,0,AG$13),15-13*ORÇAMENTO!$AF$7)/$H16*OFFSET(ORÇAMENTO!$X$15,ROW(AG16)-ROW(AG$15),0),\n              ROUND(ROUND(OFFSET($P16,0,AG$13),15-13*ORÇAMENTO!$AF$7)*OFFSET(ORÇAMENTO!$W$15,ROW(AG16)-ROW(AG$15),0),15-13*ORÇAMENTO!$AF$11)),\n         0)","v":0},{"$f":"IF(AND($D16=\"Serviço\",AH$12<>0,$H16>0,OR(AUTOEVENTO<>\"manual\",$M16<>$A$15)),\n        IF(Import.TipoArredondamento<>\"TransfereGOV\",\n              ROUND(OFFSET($P16,0,AH$13),15-13*ORÇAMENTO!$AF$7)/$H16*OFFSET(ORÇAMENTO!$X$15,ROW(AH16)-ROW(AH$15),0),\n              ROUND(ROUND(OFFSET($P16,0,AH$13),15-13*ORÇAMENTO!$AF$7)*OFFSET(ORÇAMENTO!$W$15,ROW(AH16)-ROW(AH$15),0),15-13*ORÇAMENTO!$AF$11)),\n         0)","v":0},{"$f":"IF(AND($D16=\"Serviço\",AI$12<>0,$H16>0,OR(AUTOEVENTO<>\"manual\",$M16<>$A$15)),\n        IF(Import.TipoArredondamento<>\"TransfereGOV\",\n              ROUND(OFFSET($P16,0,AI$13),15-13*ORÇAMENTO!$AF$7)/$H16*OFFSET(ORÇAMENTO!$X$15,ROW(AI16)-ROW(AI$15),0),\n              ROUND(ROUND(OFFSET($P16,0,AI$13),15-13*ORÇAMENTO!$AF$7)*OFFSET(ORÇAMENTO!$W$15,ROW(AI16)-ROW(AI$15),0),15-13*ORÇAMENTO!$AF$11)),\n         0)","v":0},{"$f":"IF(AND($D16=\"Serviço\",AJ$12<>0,$H16>0,OR(AUTOEVENTO<>\"manual\",$M16<>$A$15)),\n        IF(Import.TipoArredondamento<>\"TransfereGOV\",\n              ROUND(OFFSET($P16,0,AJ$13),15-13*ORÇAMENTO!$AF$7)/$H16*OFFSET(ORÇAMENTO!$X$15,ROW(AJ16)-ROW(AJ$15),0),\n              ROUND(ROUND(OFFSET($P16,0,AJ$13),15-13*ORÇAMENTO!$AF$7)*OFFSET(ORÇAMENTO!$W$15,ROW(AJ16)-ROW(AJ$15),0),15-13*ORÇAMENTO!$AF$11)),\n         0)","v":0},{"$f":"IF(AND($D16=\"Serviço\",AK$12<>0,$H16>0,OR(AUTOEVENTO<>\"manual\",$M16<>$A$15)),\n        IF(Import.TipoArredondamento<>\"TransfereGOV\",\n              ROUND(OFFSET($P16,0,AK$13),15-13*ORÇAMENTO!$AF$7)/$H16*OFFSET(ORÇAMENTO!$X$15,ROW(AK16)-ROW(AK$15),0),\n              ROUND(ROUND(OFFSET($P16,0,AK$13),15-13*ORÇAMENTO!$AF$7)*OFFSET(ORÇAMENTO!$W$15,ROW(AK16)-ROW(AK$15),0),15-13*ORÇAMENTO!$AF$11)),\n         0)","v":0},null,{"$f":"IF(OR($D16<>\"Serviço\",AND(AUTOEVENTO=\"Manual\",$M16=$A$15)),0,\n         IF(OFFSET(CRONOPLE!$F$15,$M16-$A$15,AM$13)=0,10^12,OFFSET(CRONOPLE!$F$15,$M16-$A$15,AM$13)))","v":0},{"$f":"IF(OR($D16<>\"Serviço\",AND(AUTOEVENTO=\"Manual\",$M16=$A$15)),0,\n         IF(OFFSET(CRONOPLE!$F$15,$M16-$A$15,AN$13)=0,10^12,OFFSET(CRONOPLE!$F$15,$M16-$A$15,AN$13)))","v":0},{"$f":"IF(OR($D16<>\"Serviço\",AND(AUTOEVENTO=\"Manual\",$M16=$A$15)),0,\n         IF(OFFSET(CRONOPLE!$F$15,$M16-$A$15,AO$13)=0,10^12,OFFSET(CRONOPLE!$F$15,$M16-$A$15,AO$13)))","v":0},{"$f":"IF(OR($D16<>\"Serviço\",AND(AUTOEVENTO=\"Manual\",$M16=$A$15)),0,\n         IF(OFFSET(CRONOPLE!$F$15,$M16-$A$15,AP$13)=0,10^12,OFFSET(CRONOPLE!$F$15,$M16-$A$15,AP$13)))","v":0},{"$f":"IF(OR($D16<>\"Serviço\",AND(AUTOEVENTO=\"Manual\",$M16=$A$15)),0,\n         IF(OFFSET(CRONOPLE!$F$15,$M16-$A$15,AQ$13)=0,10^12,OFFSET(CRONOPLE!$F$15,$M16-$A$15,AQ$13)))","v":0},{"$f":"IF(OR($D16<>\"Serviço\",AND(AUTOEVENTO=\"Manual\",$M16=$A$15)),0,\n         IF(OFFSET(CRONOPLE!$F$15,$M16-$A$15,AR$13)=0,10^12,OFFSET(CRONOPLE!$F$15,$M16-$A$15,AR$13)))","v":0},{"$f":"IF(OR($D16<>\"Serviço\",AND(AUTOEVENTO=\"Manual\",$M16=$A$15)),0,\n         IF(OFFSET(CRONOPLE!$F$15,$M16-$A$15,AS$13)=0,10^12,OFFSET(CRONOPLE!$F$15,$M16-$A$15,AS$13)))","v":0},{"$f":"IF(OR($D16<>\"Serviço\",AND(AUTOEVENTO=\"Manual\",$M16=$A$15)),0,\n         IF(OFFSET(CRONOPLE!$F$15,$M16-$A$15,AT$13)=0,10^12,OFFSET(CRONOPLE!$F$15,$M16-$A$15,AT$13)))","v":0},{"$f":"IF(OR($D16<>\"Serviço\",AND(AUTOEVENTO=\"Manual\",$M16=$A$15)),0,\n         IF(OFFSET(CRONOPLE!$F$15,$M16-$A$15,AU$13)=0,10^12,OFFSET(CRONOPLE!$F$15,$M16-$A$15,AU$13)))","v":0},{"$f":"IF(OR($D16<>\"Serviço\",AND(AUTOEVENTO=\"Manual\",$M16=$A$15)),0,\n         IF(OFFSET(CRONOPLE!$F$15,$M16-$A$15,AV$13)=0,10^12,OFFSET(CRONOPLE!$F$15,$M16-$A$15,AV$13)))","v":0},null,{"$f":"IF(OR($D16<>\"Serviço\",AND(AUTOEVENTO=\"Manual\",$M16=$A$15),$M16>(ROW(PLE.lastrow)-ROW(PLE.firstrow))),0,\n           IF(OFFSET(PLE!$G$15,$M16-$A$15,AX$13)=\"\",10^12,OFFSET(PLE!$G$15,$M16-$A$15,AX$13)))","v":0},{"$f":"IF(OR($D16<>\"Serviço\",AND(AUTOEVENTO=\"Manual\",$M16=$A$15),$M16>(ROW(PLE.lastrow)-ROW(PLE.firstrow))),0,\n           IF(OFFSET(PLE!$G$15,$M16-$A$15,AY$13)=\"\",10^12,OFFSET(PLE!$G$15,$M16-$A$15,AY$13)))","v":0},{"$f":"IF(OR($D16<>\"Serviço\",AND(AUTOEVENTO=\"Manual\",$M16=$A$15),$M16>(ROW(PLE.lastrow)-ROW(PLE.firstrow))),0,\n           IF(OFFSET(PLE!$G$15,$M16-$A$15,AZ$13)=\"\",10^12,OFFSET(PLE!$G$15,$M16-$A$15,AZ$13)))","v":0},{"$f":"IF(OR($D16<>\"Serviço\",AND(AUTOEVENTO=\"Manual\",$M16=$A$15),$M16>(ROW(PLE.lastrow)-ROW(PLE.firstrow))),0,\n           IF(OFFSET(PLE!$G$15,$M16-$A$15,BA$13)=\"\",10^12,OFFSET(PLE!$G$15,$M16-$A$15,BA$13)))","v":0},{"$f":"IF(OR($D16<>\"Serviço\",AND(AUTOEVENTO=\"Manual\",$M16=$A$15),$M16>(ROW(PLE.lastrow)-ROW(PLE.firstrow))),0,\n           IF(OFFSET(PLE!$G$15,$M16-$A$15,BB$13)=\"\",10^12,OFFSET(PLE!$G$15,$M16-$A$15,BB$13)))","v":0},{"$f":"IF(OR($D16<>\"Serviço\",AND(AUTOEVENTO=\"Manual\",$M16=$A$15),$M16>(ROW(PLE.lastrow)-ROW(PLE.firstrow))),0,\n           IF(OFFSET(PLE!$G$15,$M16-$A$15,BC$13)=\"\",10^12,OFFSET(PLE!$G$15,$M16-$A$15,BC$13)))","v":0},{"$f":"IF(OR($D16<>\"Serviço\",AND(AUTOEVENTO=\"Manual\",$M16=$A$15),$M16>(ROW(PLE.lastrow)-ROW(PLE.firstrow))),0,\n           IF(OFFSET(PLE!$G$15,$M16-$A$15,BD$13)=\"\",10^12,OFFSET(PLE!$G$15,$M16-$A$15,BD$13)))","v":0},{"$f":"IF(OR($D16<>\"Serviço\",AND(AUTOEVENTO=\"Manual\",$M16=$A$15),$M16>(ROW(PLE.lastrow)-ROW(PLE.firstrow))),0,\n           IF(OFFSET(PLE!$G$15,$M16-$A$15,BE$13)=\"\",10^12,OFFSET(PLE!$G$15,$M16-$A$15,BE$13)))","v":0},{"$f":"IF(OR($D16<>\"Serviço\",AND(AUTOEVENTO=\"Manual\",$M16=$A$15),$M16>(ROW(PLE.lastrow)-ROW(PLE.firstrow))),0,\n           IF(OFFSET(PLE!$G$15,$M16-$A$15,BF$13)=\"\",10^12,OFFSET(PLE!$G$15,$M16-$A$15,BF$13)))","v":0},{"$f":"IF(OR($D16<>\"Serviço\",AND(AUTOEVENTO=\"Manual\",$M16=$A$15),$M16>(ROW(PLE.lastrow)-ROW(PLE.firstrow))),0,\n           IF(OFFSET(PLE!$G$15,$M16-$A$15,BG$13)=\"\",10^12,OFFSET(PLE!$G$15,$M16-$A$15,BG$13)))","v":0}]
["2.",{"$f":"OFFSET(ORÇAMENTO!C$15,ROW(B17)-ROW(B$15),0)","v":2},{"$f":"OFFSET(ORÇAMENTO!L$15,ROW(C17)-ROW(C$15),0)","v":"F"},{"$f":"OFFSET(ORÇAMENTO!N$15,ROW(D17)-ROW(D$15),0)","v":"Nível 2"},{"$f":"OFFSET(ORÇAMENTO!O$15,ROW(E17)-ROW(E$15),0)","v":"1.1."},{"$f":"OFFSET(ORÇAMENTO!R$15,ROW(F17)-ROW(F$15),0)","v":"PILARES PRÉ MOLDADO 20X25 CM"},{"$f":"IF($D17<>\"Serviço\",\"\",OFFSET(ORÇAMENTO!S$15,ROW(G17)-ROW(G$15),0))","v":""},{"$f":"IF($D17<>\"Serviço\",0,IF(ACOMPANHAMENTO=\"BM\",ROUND(OFFSET(ORÇAMENTO!AJ$15,ROW(H17)-ROW(H$15),0),15-13*ORÇAMENTO!$AF$7),SUMPRODUCT(($Q$1:$AA$1=1)*ROUND($Q17:$AA17,15-13*ORÇAMENTO!$AF$7))))","v":0},null,{"$f":"IF(OR(B17<>\"S\",CÁLCULO.FrentesPreenchidas=0),\"\",IF(AND(ACOMPANHAMENTO=\"PLE\",AUTOEVENTO=\"Manual\",OR(H17>0,ORÇAMENTO!AC17=\"QUANT.\"),OR(K17=\"\",M17=0,N17=\"\")),\"►E\",IF(AND(ACOMPANHAMENTO=\"PLE\",ORÇAMENTO!AC17=\"QUANT.\"),\"►Q\",IF(AND(ACOMPANHAMENTO=\"PLE\",H17<>SUMPRODUCT(($Q$1:$AA$1=1)*ROUND(Q17:AA17,15))),\"►S\",IF(AND(COUNTIF($P$11:$AA$11,\"▼\")=0,H17>0,I17=\"\"),\"◄M\",\"\")))))","v":""},null,".",{"$f":"IF($D17<>\"Serviço\",\"\",\n          IF(AUTOEVENTO=\"manual\",$A17,\n                IF(ISERROR(MATCH($A17,$A$15:OFFSET($A17,-1,0),0)),MAX($M$15:OFFSET(M17,-1,0))+1,\n                      INDEX($M$15:OFFSET(M17,-1,0),MATCH($A17,$A$15:OFFSET($A17,-1,0),0)))))","v":""},{"$f":"IF($D17<>\"Serviço\",\"\",\n         IF(AUTOEVENTO=\"Manual\",\n                IF($A17=0,\"<-- defina o número do agrupador\",\n                       OFFSET(EVENTOS!$D$15,$A17-$A$15,0)),\n                OFFSET($F$15,$A17,0)))","v":""},null,null,null,null,null,null,null,null,null,null,null,null,null,{"$f":"IF(AND($D17=\"Serviço\",AB$12<>0,$H17>0,OR(AUTOEVENTO<>\"manual\",$M17<>$A$15)),\n        IF(Import.TipoArredondamento<>\"TransfereGOV\",\n              ROUND(OFFSET($P17,0,AB$13),15-13*ORÇAMENTO!$AF$7)/$H17*OFFSET(ORÇAMENTO!$X$15,ROW(AB17)-ROW(AB$15),0),\n              ROUND(ROUND(OFFSET($P17,0,AB$13),15-13*ORÇAMENTO!$AF$7)*OFFSET(ORÇAMENTO!$W$15,ROW(AB17)-ROW(AB$15),0),15-13*ORÇAMENTO!$AF$11)),\n         0)","v":0},{"$f":"IF(AND($D17=\"Serviço\",AC$12<>0,$H17>0,OR(AUTOEVENTO<>\"manual\",$M17<>$A$15)),\n        IF(Import.TipoArredondamento<>\"TransfereGOV\",\n              ROUND(OFFSET($P17,0,AC$13),15-13*ORÇAMENTO!$AF$7)/$H17*OFFSET(ORÇAMENTO!$X$15,ROW(AC17)-ROW(AC$15),0),\n              ROUND(ROUND(OFFSET($P17,0,AC$13),15-13*ORÇAMENTO!$AF$7)*OFFSET(ORÇAMENTO!$W$15,ROW(AC17)-ROW(AC$15),0),15-13*ORÇAMENTO!$AF$11)),\n         0)","v":0},{"$f":"IF(AND($D17=\"Serviço\",AD$12<>0,$H17>0,OR(AUTOEVENTO<>\"manual\",$M17<>$A$15)),\n        IF(Import.TipoArredondamento<>\"TransfereGOV\",\n              ROUND(OFFSET($P17,0,AD$13),15-13*ORÇAMENTO!$AF$7)/$H17*OFFSET(ORÇAMENTO!$X$15,ROW(AD17)-ROW(AD$15),0),\n              ROUND(ROUND(OFFSET($P17,0,AD$13),15-13*ORÇAMENTO!$AF$7)*OFFSET(ORÇAMENTO!$W$15,ROW(AD17)-ROW(AD$15),0),15-13*ORÇAMENTO!$AF$11)),\n         0)","v":0},{"$f":"IF(AND($D17=\"Serviço\",AE$12<>0,$H17>0,OR(AUTOEVENTO<>\"manual\",$M17<>$A$15)),\n        IF(Import.TipoArredondamento<>\"TransfereGOV\",\n              ROUND(OFFSET($P17,0,AE$13),15-13*ORÇAMENTO!$AF$7)/$H17*OFFSET(ORÇAMENTO!$X$15,ROW(AE17)-ROW(AE$15),0),\n              ROUND(ROUND(OFFSET($P17,0,AE$13),15-13*ORÇAMENTO!$AF$7)*OFFSET(ORÇAMENTO!$W$15,ROW(AE17)-ROW(AE$15),0),15-13*ORÇAMENTO!$AF$11)),\n         0)","v":0},{"$f":"IF(AND($D17=\"Serviço\",AF$12<>0,$H17>0,OR(AUTOEVENTO<>\"manual\",$M17<>$A$15)),\n        IF(Import.TipoArredondamento<>\"TransfereGOV\",\n              ROUND(OFFSET($P17,0,AF$13),15-13*ORÇAMENTO!$AF$7)/$H17*OFFSET(ORÇAMENTO!$X$15,ROW(AF17)-ROW(AF$15),0),\n              ROUND(ROUND(OFFSET($P17,0,AF$13),15-13*ORÇAMENTO!$AF$7)*OFFSET(ORÇAMENTO!$W$15,ROW(AF17)-ROW(AF$15),0),15-13*ORÇAMENTO!$AF$11)),\n         0)","v":0},{"$f":"IF(AND($D17=\"Serviço\",AG$12<>0,$H17>0,OR(AUTOEVENTO<>\"manual\",$M17<>$A$15)),\n        IF(Import.TipoArredondamento<>\"TransfereGOV\",\n              ROUND(OFFSET($P17,0,AG$13),15-13*ORÇAMENTO!$AF$7)/$H17*OFFSET(ORÇAMENTO!$X$15,ROW(AG17)-ROW(AG$15),0),\n              ROUND(ROUND(OFFSET($P17,0,AG$13),15-13*ORÇAMENTO!$AF$7)*OFFSET(ORÇAMENTO!$W$15,ROW(AG17)-ROW(AG$15),0),15-13*ORÇAMENTO!$AF$11)),\n         0)","v":0},{"$f":"IF(AND($D17=\"Serviço\",AH$12<>0,$H17>0,OR(AUTOEVENTO<>\"manual\",$M17<>$A$15)),\n        IF(Import.TipoArredondamento<>\"TransfereGOV\",\n              ROUND(OFFSET($P17,0,AH$13),15-13*ORÇAMENTO!$AF$7)/$H17*OFFSET(ORÇAMENTO!$X$15,ROW(AH17)-ROW(AH$15),0),\n              ROUND(ROUND(OFFSET($P17,0,AH$13),15-13*ORÇAMENTO!$AF$7)*OFFSET(ORÇAMENTO!$W$15,ROW(AH17)-ROW(AH$15),0),15-13*ORÇAMENTO!$AF$11)),\n         0)","v":0},{"$f":"IF(AND($D17=\"Serviço\",AI$12<>0,$H17>0,OR(AUTOEVENTO<>\"manual\",$M17<>$A$15)),\n        IF(Import.TipoArredondamento<>\"TransfereGOV\",\n              ROUND(OFFSET($P17,0,AI$13),15-13*ORÇAMENTO!$AF$7)/$H17*OFFSET(ORÇAMENTO!$X$15,ROW(AI17)-ROW(AI$15),0),\n              ROUND(ROUND(OFFSET($P17,0,AI$13),15-13*ORÇAMENTO!$AF$7)*OFFSET(ORÇAMENTO!$W$15,ROW(AI17)-ROW(AI$15),0),15-13*ORÇAMENTO!$AF$11)),\n         0)","v":0},{"$f":"IF(AND($D17=\"Serviço\",AJ$12<>0,$H17>0,OR(AUTOEVENTO<>\"manual\",$M17<>$A$15)),\n        IF(Import.TipoArredondamento<>\"TransfereGOV\",\n              ROUND(OFFSET($P17,0,AJ$13),15-13*ORÇAMENTO!$AF$7)/$H17*OFFSET(ORÇAMENTO!$X$15,ROW(AJ17)-ROW(AJ$15),0),\n              ROUND(ROUND(OFFSET($P17,0,AJ$13),15-13*ORÇAMENTO!$AF$7)*OFFSET(ORÇAMENTO!$W$15,ROW(AJ17)-ROW(AJ$15),0),15-13*ORÇAMENTO!$AF$11)),\n         0)","v":0},{"$f":"IF(AND($D17=\"Serviço\",AK$12<>0,$H17>0,OR(AUTOEVENTO<>\"manual\",$M17<>$A$15)),\n        IF(Import.TipoArredondamento<>\"TransfereGOV\",\n              ROUND(OFFSET($P17,0,AK$13),15-13*ORÇAMENTO!$AF$7)/$H17*OFFSET(ORÇAMENTO!$X$15,ROW(AK17)-ROW(AK$15),0),\n              ROUND(ROUND(OFFSET($P17,0,AK$13),15-13*ORÇAMENTO!$AF$7)*OFFSET(ORÇAMENTO!$W$15,ROW(AK17)-ROW(AK$15),0),15-13*ORÇAMENTO!$AF$11)),\n         0)","v":0},null,{"$f":"IF(OR($D17<>\"Serviço\",AND(AUTOEVENTO=\"Manual\",$M17=$A$15)),0,\n         IF(OFFSET(CRONOPLE!$F$15,$M17-$A$15,AM$13)=0,10^12,OFFSET(CRONOPLE!$F$15,$M17-$A$15,AM$13)))","v":0},{"$f":"IF(OR($D17<>\"Serviço\",AND(AUTOEVENTO=\"Manual\",$M17=$A$15)),0,\n         IF(OFFSET(CRONOPLE!$F$15,$M17-$A$15,AN$13)=0,10^12,OFFSET(CRONOPLE!$F$15,$M17-$A$15,AN$13)))","v":0},{"$f":"IF(OR($D17<>\"Serviço\",AND(AUTOEVENTO=\"Manual\",$M17=$A$15)),0,\n         IF(OFFSET(CRONOPLE!$F$15,$M17-$A$15,AO$13)=0,10^12,OFFSET(CRONOPLE!$F$15,$M17-$A$15,AO$13)))","v":0},{"$f":"IF(OR($D17<>\"Serviço\",AND(AUTOEVENTO=\"Manual\",$M17=$A$15)),0,\n         IF(OFFSET(CRONOPLE!$F$15,$M17-$A$15,AP$13)=0,10^12,OFFSET(CRONOPLE!$F$15,$M17-$A$15,AP$13)))","v":0},{"$f":"IF(OR($D17<>\"Serviço\",AND(AUTOEVENTO=\"Manual\",$M17=$A$15)),0,\n         IF(OFFSET(CRONOPLE!$F$15,$M17-$A$15,AQ$13)=0,10^12,OFFSET(CRONOPLE!$F$15,$M17-$A$15,AQ$13)))","v":0},{"$f":"IF(OR($D17<>\"Serviço\",AND(AUTOEVENTO=\"Manual\",$M17=$A$15)),0,\n         IF(OFFSET(CRONOPLE!$F$15,$M17-$A$15,AR$13)=0,10^12,OFFSET(CRONOPLE!$F$15,$M17-$A$15,AR$13)))","v":0},{"$f":"IF(OR($D17<>\"Serviço\",AND(AUTOEVENTO=\"Manual\",$M17=$A$15)),0,\n         IF(OFFSET(CRONOPLE!$F$15,$M17-$A$15,AS$13)=0,10^12,OFFSET(CRONOPLE!$F$15,$M17-$A$15,AS$13)))","v":0},{"$f":"IF(OR($D17<>\"Serviço\",AND(AUTOEVENTO=\"Manual\",$M17=$A$15)),0,\n         IF(OFFSET(CRONOPLE!$F$15,$M17-$A$15,AT$13)=0,10^12,OFFSET(CRONOPLE!$F$15,$M17-$A$15,AT$13)))","v":0},{"$f":"IF(OR($D17<>\"Serviço\",AND(AUTOEVENTO=\"Manual\",$M17=$A$15)),0,\n         IF(OFFSET(CRONOPLE!$F$15,$M17-$A$15,AU$13)=0,10^12,OFFSET(CRONOPLE!$F$15,$M17-$A$15,AU$13)))","v":0},{"$f":"IF(OR($D17<>\"Serviço\",AND(AUTOEVENTO=\"Manual\",$M17=$A$15)),0,\n         IF(OFFSET(CRONOPLE!$F$15,$M17-$A$15,AV$13)=0,10^12,OFFSET(CRONOPLE!$F$15,$M17-$A$15,AV$13)))","v":0},null,{"$f":"IF(OR($D17<>\"Serviço\",AND(AUTOEVENTO=\"Manual\",$M17=$A$15),$M17>(ROW(PLE.lastrow)-ROW(PLE.firstrow))),0,\n           IF(OFFSET(PLE!$G$15,$M17-$A$15,AX$13)=\"\",10^12,OFFSET(PLE!$G$15,$M17-$A$15,AX$13)))","v":0},{"$f":"IF(OR($D17<>\"Serviço\",AND(AUTOEVENTO=\"Manual\",$M17=$A$15),$M17>(ROW(PLE.lastrow)-ROW(PLE.firstrow))),0,\n           IF(OFFSET(PLE!$G$15,$M17-$A$15,AY$13)=\"\",10^12,OFFSET(PLE!$G$15,$M17-$A$15,AY$13)))","v":0},{"$f":"IF(OR($D17<>\"Serviço\",AND(AUTOEVENTO=\"Manual\",$M17=$A$15),$M17>(ROW(PLE.lastrow)-ROW(PLE.firstrow))),0,\n           IF(OFFSET(PLE!$G$15,$M17-$A$15,AZ$13)=\"\",10^12,OFFSET(PLE!$G$15,$M17-$A$15,AZ$13)))","v":0},{"$f":"IF(OR($D17<>\"Serviço\",AND(AUTOEVENTO=\"Manual\",$M17=$A$15),$M17>(ROW(PLE.lastrow)-ROW(PLE.firstrow))),0,\n           IF(OFFSET(PLE!$G$15,$M17-$A$15,BA$13)=\"\",10^12,OFFSET(PLE!$G$15,$M17-$A$15,BA$13)))","v":0},{"$f":"IF(OR($D17<>\"Serviço\",AND(AUTOEVENTO=\"Manual\",$M17=$A$15),$M17>(ROW(PLE.lastrow)-ROW(PLE.firstrow))),0,\n           IF(OFFSET(PLE!$G$15,$M17-$A$15,BB$13)=\"\",10^12,OFFSET(PLE!$G$15,$M17-$A$15,BB$13)))","v":0},{"$f":"IF(OR($D17<>\"Serviço\",AND(AUTOEVENTO=\"Manual\",$M17=$A$15),$M17>(ROW(PLE.lastrow)-ROW(PLE.firstrow))),0,\n           IF(OFFSET(PLE!$G$15,$M17-$A$15,BC$13)=\"\",10^12,OFFSET(PLE!$G$15,$M17-$A$15,BC$13)))","v":0},{"$f":"IF(OR($D17<>\"Serviço\",AND(AUTOEVENTO=\"Manual\",$M17=$A$15),$M17>(ROW(PLE.lastrow)-ROW(PLE.firstrow))),0,\n           IF(OFFSET(PLE!$G$15,$M17-$A$15,BD$13)=\"\",10^12,OFFSET(PLE!$G$15,$M17-$A$15,BD$13)))","v":0},{"$f":"IF(OR($D17<>\"Serviço\",AND(AUTOEVENTO=\"Manual\",$M17=$A$15),$M17>(ROW(PLE.lastrow)-ROW(PLE.firstrow))),0,\n           IF(OFFSET(PLE!$G$15,$M17-$A$15,BE$13)=\"\",10^12,OFFSET(PLE!$G$15,$M17-$A$15,BE$13)))","v":0},{"$f":"IF(OR($D17<>\"Serviço\",AND(AUTOEVENTO=\"Manual\",$M17=$A$15),$M17>(ROW(PLE.lastrow)-ROW(PLE.firstrow))),0,\n           IF(OFFSET(PLE!$G$15,$M17-$A$15,BF$13)=\"\",10^12,OFFSET(PLE!$G$15,$M17-$A$15,BF$13)))","v":0},{"$f":"IF(OR($D17<>\"Serviço\",AND(AUTOEVENTO=\"Manual\",$M17=$A$15),$M17>(ROW(PLE.lastrow)-ROW(PLE.firstrow))),0,\n           IF(OFFSET(PLE!$G$15,$M17-$A$15,BG$13)=\"\",10^12,OFFSET(PLE!$G$15,$M17-$A$15,BG$13)))","v":0}]
["2",{"$f":"OFFSET(ORÇAMENTO!C$15,ROW(B18)-ROW(B$15),0)","v":"S"},{"$f":"OFFSET(ORÇAMENTO!L$15,ROW(C18)-ROW(C$15),0)","v":"F"},{"$f":"OFFSET(ORÇAMENTO!N$15,ROW(D18)-ROW(D$15),0)","v":"Serviço"},{"$f":"OFFSET(ORÇAMENTO!O$15,ROW(E18)-ROW(E$15),0)","v":"1.1.1."},{"$f":"OFFSET(ORÇAMENTO!R$15,ROW(F18)-ROW(F$15),0)","v":"PILAR EM CONCRETO PRÉ-MOLDADO 20X25 CM ARMADURA LONGITUDINAL 12,5MM ARMADURA TRANSVERSAL 5,0MM - PÉ DIREITO 4 METROS"},{"$f":"IF($D18<>\"Serviço\",\"\",OFFSET(ORÇAMENTO!S$15,ROW(G18)-ROW(G$15),0))","v":"UN"},{"$f":"IF($D18<>\"Serviço\",0,IF(ACOMPANHAMENTO=\"BM\",ROUND(OFFSET(ORÇAMENTO!AJ$15,ROW(H18)-ROW(H$15),0),15-13*ORÇAMENTO!$AF$7),SUMPRODUCT(($Q$1:$AA$1=1)*ROUND($Q18:$AA18,15-13*ORÇAMENTO!$AF$7))))","v":14},"14 unidades",{"$f":"IF(OR(B18<>\"S\",CÁLCULO.FrentesPreenchidas=0),\"\",IF(AND(ACOMPANHAMENTO=\"PLE\",AUTOEVENTO=\"Manual\",OR(H18>0,ORÇAMENTO!AC18=\"QUANT.\"),OR(K18=\"\",M18=0,N18=\"\")),\"►E\",IF(AND(ACOMPANHAMENTO=\"PLE\",ORÇAMENTO!AC18=\"QUANT.\"),\"►Q\",IF(AND(ACOMPANHAMENTO=\"PLE\",H18<>SUMPRODUCT(($Q$1:$AA$1=1)*ROUND(Q18:AA18,15))),\"►S\",IF(AND(COUNTIF($P$11:$AA$11,\"▼\")=0,H18>0,I18=\"\"),\"◄M\",\"\")))))","v":""},null,".",{"$f":"IF($D18<>\"Serviço\",\"\",\n          IF(AUTOEVENTO=\"manual\",$A18,\n                IF(ISERROR(MATCH($A18,$A$15:OFFSET($A18,-1,0),0)),MAX($M$15:OFFSET(M18,-1,0))+1,\n                      INDEX($M$15:OFFSET(M18,-1,0),MATCH($A18,$A$15:OFFSET($A18,-1,0),0)))))","v":1},{"$f":"IF($D18<>\"Serviço\",\"\",\n         IF(AUTOEVENTO=\"Manual\",\n                IF($A18=0,\"<-- defina o número do agrupador\",\n                       OFFSET(EVENTOS!$D$15,$A18-$A$15,0)),\n                OFFSET($F$15,$A18,0)))","v":"PILARES PRÉ MOLDADO 20X25 CM"},null,null,14,null,null,null,null,null,null,null,null,null,null,{"$f":"IF(AND($D18=\"Serviço\",AB$12<>0,$H18>0,OR(AUTOEVENTO<>\"manual\",$M18<>$A$15)),\n        IF(Import.TipoArredondamento<>\"TransfereGOV\",\n              ROUND(OFFSET($P18,0,AB$13),15-13*ORÇAMENTO!$AF$7)/$H18*OFFSET(ORÇAMENTO!$X$15,ROW(AB18)-ROW(AB$15),0),\n              ROUND(ROUND(OFFSET($P18,0,AB$13),15-13*ORÇAMENTO!$AF$7)*OFFSET(ORÇAMENTO!$W$15,ROW(AB18)-ROW(AB$15),0),15-13*ORÇAMENTO!$AF$11)),\n         0)","v":14441.56},{"$f":"IF(AND($D18=\"Serviço\",AC$12<>0,$H18>0,OR(AUTOEVENTO<>\"manual\",$M18<>$A$15)),\n        IF(Import.TipoArredondamento<>\"TransfereGOV\",\n              ROUND(OFFSET($P18,0,AC$13),15-13*ORÇAMENTO!$AF$7)/$H18*OFFSET(ORÇAMENTO!$X$15,ROW(AC18)-ROW(AC$15),0),\n              ROUND(ROUND(OFFSET($P18,0,AC$13),15-13*ORÇAMENTO!$AF$7)*OFFSET(ORÇAMENTO!$W$15,ROW(AC18)-ROW(AC$15),0),15-13*ORÇAMENTO!$AF$11)),\n         0)","v":0},{"$f":"IF(AND($D18=\"Serviço\",AD$12<>0,$H18>0,OR(AUTOEVENTO<>\"manual\",$M18<>$A$15)),\n        IF(Import.TipoArredondamento<>\"TransfereGOV\",\n              ROUND(OFFSET($P18,0,AD$13),15-13*ORÇAMENTO!$AF$7)/$H18*OFFSET(ORÇAMENTO!$X$15,ROW(AD18)-ROW(AD$15),0),\n              ROUND(ROUND(OFFSET($P18,0,AD$13),15-13*ORÇAMENTO!$AF$7)*OFFSET(ORÇAMENTO!$W$15,ROW(AD18)-ROW(AD$15),0),15-13*ORÇAMENTO!$AF$11)),\n         0)","v":0},{"$f":"IF(AND($D18=\"Serviço\",AE$12<>0,$H18>0,OR(AUTOEVENTO<>\"manual\",$M18<>$A$15)),\n        IF(Import.TipoArredondamento<>\"TransfereGOV\",\n              ROUND(OFFSET($P18,0,AE$13),15-13*ORÇAMENTO!$AF$7)/$H18*OFFSET(ORÇAMENTO!$X$15,ROW(AE18)-ROW(AE$15),0),\n              ROUND(ROUND(OFFSET($P18,0,AE$13),15-13*ORÇAMENTO!$AF$7)*OFFSET(ORÇAMENTO!$W$15,ROW(AE18)-ROW(AE$15),0),15-13*ORÇAMENTO!$AF$11)),\n         0)","v":0},{"$f":"IF(AND($D18=\"Serviço\",AF$12<>0,$H18>0,OR(AUTOEVENTO<>\"manual\",$M18<>$A$15)),\n        IF(Import.TipoArredondamento<>\"TransfereGOV\",\n              ROUND(OFFSET($P18,0,AF$13),15-13*ORÇAMENTO!$AF$7)/$H18*OFFSET(ORÇAMENTO!$X$15,ROW(AF18)-ROW(AF$15),0),\n              ROUND(ROUND(OFFSET($P18,0,AF$13),15-13*ORÇAMENTO!$AF$7)*OFFSET(ORÇAMENTO!$W$15,ROW(AF18)-ROW(AF$15),0),15-13*ORÇAMENTO!$AF$11)),\n         0)","v":0},{"$f":"IF(AND($D18=\"Serviço\",AG$12<>0,$H18>0,OR(AUTOEVENTO<>\"manual\",$M18<>$A$15)),\n        IF(Import.TipoArredondamento<>\"TransfereGOV\",\n              ROUND(OFFSET($P18,0,AG$13),15-13*ORÇAMENTO!$AF$7)/$H18*OFFSET(ORÇAMENTO!$X$15,ROW(AG18)-ROW(AG$15),0),\n              ROUND(ROUND(OFFSET($P18,0,AG$13),15-13*ORÇAMENTO!$AF$7)*OFFSET(ORÇAMENTO!$W$15,ROW(AG18)-ROW(AG$15),0),15-13*ORÇAMENTO!$AF$11)),\n         0)","v":0},{"$f":"IF(AND($D18=\"Serviço\",AH$12<>0,$H18>0,OR(AUTOEVENTO<>\"manual\",$M18<>$A$15)),\n        IF(Import.TipoArredondamento<>\"TransfereGOV\",\n              ROUND(OFFSET($P18,0,AH$13),15-13*ORÇAMENTO!$AF$7)/$H18*OFFSET(ORÇAMENTO!$X$15,ROW(AH18)-ROW(AH$15),0),\n              ROUND(ROUND(OFFSET($P18,0,AH$13),15-13*ORÇAMENTO!$AF$7)*OFFSET(ORÇAMENTO!$W$15,ROW(AH18)-ROW(AH$15),0),15-13*ORÇAMENTO!$AF$11)),\n         0)","v":0},{"$f":"IF(AND($D18=\"Serviço\",AI$12<>0,$H18>0,OR(AUTOEVENTO<>\"manual\",$M18<>$A$15)),\n        IF(Import.TipoArredondamento<>\"TransfereGOV\",\n              ROUND(OFFSET($P18,0,AI$13),15-13*ORÇAMENTO!$AF$7)/$H18*OFFSET(ORÇAMENTO!$X$15,ROW(AI18)-ROW(AI$15),0),\n              ROUND(ROUND(OFFSET($P18,0,AI$13),15-13*ORÇAMENTO!$AF$7)*OFFSET(ORÇAMENTO!$W$15,ROW(AI18)-ROW(AI$15),0),15-13*ORÇAMENTO!$AF$11)),\n         0)","v":0},{"$f":"IF(AND($D18=\"Serviço\",AJ$12<>0,$H18>0,OR(AUTOEVENTO<>\"manual\",$M18<>$A$15)),\n        IF(Import.TipoArredondamento<>\"TransfereGOV\",\n              ROUND(OFFSET($P18,0,AJ$13),15-13*ORÇAMENTO!$AF$7)/$H18*OFFSET(ORÇAMENTO!$X$15,ROW(AJ18)-ROW(AJ$15),0),\n              ROUND(ROUND(OFFSET($P18,0,AJ$13),15-13*ORÇAMENTO!$AF$7)*OFFSET(ORÇAMENTO!$W$15,ROW(AJ18)-ROW(AJ$15),0),15-13*ORÇAMENTO!$AF$11)),\n         0)","v":0},{"$f":"IF(AND($D18=\"Serviço\",AK$12<>0,$H18>0,OR(AUTOEVENTO<>\"manual\",$M18<>$A$15)),\n        IF(Import.TipoArredondamento<>\"TransfereGOV\",\n              ROUND(OFFSET($P18,0,AK$13),15-13*ORÇAMENTO!$AF$7)/$H18*OFFSET(ORÇAMENTO!$X$15,ROW(AK18)-ROW(AK$15),0),\n              ROUND(ROUND(OFFSET($P18,0,AK$13),15-13*ORÇAMENTO!$AF$7)*OFFSET(ORÇAMENTO!$W$15,ROW(AK18)-ROW(AK$15),0),15-13*ORÇAMENTO!$AF$11)),\n         0)","v":0},null,{"$f":"IF(OR($D18<>\"Serviço\",AND(AUTOEVENTO=\"Manual\",$M18=$A$15)),0,\n         IF(OFFSET(CRONOPLE!$F$15,$M18-$A$15,AM$13)=0,10^12,OFFSET(CRONOPLE!$F$15,$M18-$A$15,AM$13)))","v":1},{"$f":"IF(OR($D18<>\"Serviço\",AND(AUTOEVENTO=\"Manual\",$M18=$A$15)),0,\n         IF(OFFSET(CRONOPLE!$F$15,$M18-$A$15,AN$13)=0,10^12,OFFSET(CRONOPLE!$F$15,$M18-$A$15,AN$13)))","v":1},{"$f":"IF(OR($D18<>\"Serviço\",AND(AUTOEVENTO=\"Manual\",$M18=$A$15)),0,\n         IF(OFFSET(CRONOPLE!$F$15,$M18-$A$15,AO$13)=0,10^12,OFFSET(CRONOPLE!$F$15,$M18-$A$15,AO$13)))","v":1000000000000},{"$f":"IF(OR($D18<>\"Serviço\",AND(AUTOEVENTO=\"Manual\",$M18=$A$15)),0,\n         IF(OFFSET(CRONOPLE!$F$15,$M18-$A$15,AP$13)=0,10^12,OFFSET(CRONOPLE!$F$15,$M18-$A$15,AP$13)))","v":1000000000000},{"$f":"IF(OR($D18<>\"Serviço\",AND(AUTOEVENTO=\"Manual\",$M18=$A$15)),0,\n         IF(OFFSET(CRONOPLE!$F$15,$M18-$A$15,AQ$13)=0,10^12,OFFSET(CRONOPLE!$F$15,$M18-$A$15,AQ$13)))","v":1000000000000},{"$f":"IF(OR($D18<>\"Serviço\",AND(AUTOEVENTO=\"Manual\",$M18=$A$15)),0,\n         IF(OFFSET(CRONOPLE!$F$15,$M18-$A$15,AR$13)=0,10^12,OFFSET(CRONOPLE!$F$15,$M18-$A$15,AR$13)))","v":1000000000000},{"$f":"IF(OR($D18<>\"Serviço\",AND(AUTOEVENTO=\"Manual\",$M18=$A$15)),0,\n         IF(OFFSET(CRONOPLE!$F$15,$M18-$A$15,AS$13)=0,10^12,OFFSET(CRONOPLE!$F$15,$M18-$A$15,AS$13)))","v":1000000000000},{"$f":"IF(OR($D18<>\"Serviço\",AND(AUTOEVENTO=\"Manual\",$M18=$A$15)),0,\n         IF(OFFSET(CRONOPLE!$F$15,$M18-$A$15,AT$13)=0,10^12,OFFSET(CRONOPLE!$F$15,$M18-$A$15,AT$13)))","v":1000000000000},{"$f":"IF(OR($D18<>\"Serviço\",AND(AUTOEVENTO=\"Manual\",$M18=$A$15)),0,\n         IF(OFFSET(CRONOPLE!$F$15,$M18-$A$15,AU$13)=0,10^12,OFFSET(CRONOPLE!$F$15,$M18-$A$15,AU$13)))","v":1000000000000},{"$f":"IF(OR($D18<>\"Serviço\",AND(AUTOEVENTO=\"Manual\",$M18=$A$15)),0,\n         IF(OFFSET(CRONOPLE!$F$15,$M18-$A$15,AV$13)=0,10^12,OFFSET(CRONOPLE!$F$15,$M18-$A$15,AV$13)))","v":1000000000000},null,{"$f":"IF(OR($D18<>\"Serviço\",AND(AUTOEVENTO=\"Manual\",$M18=$A$15),$M18>(ROW(PLE.lastrow)-ROW(PLE.firstrow))),0,\n           IF(OFFSET(PLE!$G$15,$M18-$A$15,AX$13)=\"\",10^12,OFFSET(PLE!$G$15,$M18-$A$15,AX$13)))","v":1000000000000},{"$f":"IF(OR($D18<>\"Serviço\",AND(AUTOEVENTO=\"Manual\",$M18=$A$15),$M18>(ROW(PLE.lastrow)-ROW(PLE.firstrow))),0,\n           IF(OFFSET(PLE!$G$15,$M18-$A$15,AY$13)=\"\",10^12,OFFSET(PLE!$G$15,$M18-$A$15,AY$13)))","v":1000000000000},{"$f":"IF(OR($D18<>\"Serviço\",AND(AUTOEVENTO=\"Manual\",$M18=$A$15),$M18>(ROW(PLE.lastrow)-ROW(PLE.firstrow))),0,\n           IF(OFFSET(PLE!$G$15,$M18-$A$15,AZ$13)=\"\",10^12,OFFSET(PLE!$G$15,$M18-$A$15,AZ$13)))","v":1000000000000},{"$f":"IF(OR($D18<>\"Serviço\",AND(AUTOEVENTO=\"Manual\",$M18=$A$15),$M18>(ROW(PLE.lastrow)-ROW(PLE.firstrow))),0,\n           IF(OFFSET(PLE!$G$15,$M18-$A$15,BA$13)=\"\",10^12,OFFSET(PLE!$G$15,$M18-$A$15,BA$13)))","v":1000000000000},{"$f":"IF(OR($D18<>\"Serviço\",AND(AUTOEVENTO=\"Manual\",$M18=$A$15),$M18>(ROW(PLE.lastrow)-ROW(PLE.firstrow))),0,\n           IF(OFFSET(PLE!$G$15,$M18-$A$15,BB$13)=\"\",10^12,OFFSET(PLE!$G$15,$M18-$A$15,BB$13)))","v":1000000000000},{"$f":"IF(OR($D18<>\"Serviço\",AND(AUTOEVENTO=\"Manual\",$M18=$A$15),$M18>(ROW(PLE.lastrow)-ROW(PLE.firstrow))),0,\n           IF(OFFSET(PLE!$G$15,$M18-$A$15,BC$13)=\"\",10^12,OFFSET(PLE!$G$15,$M18-$A$15,BC$13)))","v":1000000000000},{"$f":"IF(OR($D18<>\"Serviço\",AND(AUTOEVENTO=\"Manual\",$M18=$A$15),$M18>(ROW(PLE.lastrow)-ROW(PLE.firstrow))),0,\n           IF(OFFSET(PLE!$G$15,$M18-$A$15,BD$13)=\"\",10^12,OFFSET(PLE!$G$15,$M18-$A$15,BD$13)))","v":1000000000000},{"$f":"IF(OR($D18<>\"Serviço\",AND(AUTOEVENTO=\"Manual\",$M18=$A$15),$M18>(ROW(PLE.lastrow)-ROW(PLE.firstrow))),0,\n           IF(OFFSET(PLE!$G$15,$M18-$A$15,BE$13)=\"\",10^12,OFFSET(PLE!$G$15,$M18-$A$15,BE$13)))","v":1000000000000},{"$f":"IF(OR($D18<>\"Serviço\",AND(AUTOEVENTO=\"Manual\",$M18=$A$15),$M18>(ROW(PLE.lastrow)-ROW(PLE.firstrow))),0,\n           IF(OFFSET(PLE!$G$15,$M18-$A$15,BF$13)=\"\",10^12,OFFSET(PLE!$G$15,$M18-$A$15,BF$13)))","v":1000000000000},{"$f":"IF(OR($D18<>\"Serviço\",AND(AUTOEVENTO=\"Manual\",$M18=$A$15),$M18>(ROW(PLE.lastrow)-ROW(PLE.firstrow))),0,\n           IF(OFFSET(PLE!$G$15,$M18-$A$15,BG$13)=\"\",10^12,OFFSET(PLE!$G$15,$M18-$A$15,BG$13)))","v":1000000000000}]
["4.",{"$f":"OFFSET(ORÇAMENTO!C$15,ROW(B19)-ROW(B$15),0)","v":2},{"$f":"OFFSET(ORÇAMENTO!L$15,ROW(C19)-ROW(C$15),0)","v":"F"},{"$f":"OFFSET(ORÇAMENTO!N$15,ROW(D19)-ROW(D$15),0)","v":"Nível 2"},{"$f":"OFFSET(ORÇAMENTO!O$15,ROW(E19)-ROW(E$15),0)","v":"1.2."},{"$f":"OFFSET(ORÇAMENTO!R$15,ROW(F19)-ROW(F$15),0)","v":"ESTRUTURA E COBERTURA "},{"$f":"IF($D19<>\"Serviço\",\"\",OFFSET(ORÇAMENTO!S$15,ROW(G19)-ROW(G$15),0))","v":""},{"$f":"IF($D19<>\"Serviço\",0,IF(ACOMPANHAMENTO=\"BM\",ROUND(OFFSET(ORÇAMENTO!AJ$15,ROW(H19)-ROW(H$15),0),15-13*ORÇAMENTO!$AF$7),SUMPRODUCT(($Q$1:$AA$1=1)*ROUND($Q19:$AA19,15-13*ORÇAMENTO!$AF$7))))","v":0},null,{"$f":"IF(OR(B19<>\"S\",CÁLCULO.FrentesPreenchidas=0),\"\",IF(AND(ACOMPANHAMENTO=\"PLE\",AUTOEVENTO=\"Manual\",OR(H19>0,ORÇAMENTO!AC19=\"QUANT.\"),OR(K19=\"\",M19=0,N19=\"\")),\"►E\",IF(AND(ACOMPANHAMENTO=\"PLE\",ORÇAMENTO!AC19=\"QUANT.\"),\"►Q\",IF(AND(ACOMPANHAMENTO=\"PLE\",H19<>SUMPRODUCT(($Q$1:$AA$1=1)*ROUND(Q19:AA19,15))),\"►S\",IF(AND(COUNTIF($P$11:$AA$11,\"▼\")=0,H19>0,I19=\"\"),\"◄M\",\"\")))))","v":""},null,".",{"$f":"IF($D19<>\"Serviço\",\"\",\n          IF(AUTOEVENTO=\"manual\",$A19,\n                IF(ISERROR(MATCH($A19,$A$15:OFFSET($A19,-1,0),0)),MAX($M$15:OFFSET(M19,-1,0))+1,\n                      INDEX($M$15:OFFSET(M19,-1,0),MATCH($A19,$A$15:OFFSET($A19,-1,0),0)))))","v":""},{"$f":"IF($D19<>\"Serviço\",\"\",\n         IF(AUTOEVENTO=\"Manual\",\n                IF($A19=0,\"<-- defina o número do agrupador\",\n                       OFFSET(EVENTOS!$D$15,$A19-$A$15,0)),\n                OFFSET($F$15,$A19,0)))","v":""},null,null,null,null,null,null,null,null,null,null,null,null,null,{"$f":"IF(AND($D19=\"Serviço\",AB$12<>0,$H19>0,OR(AUTOEVENTO<>\"manual\",$M19<>$A$15)),\n        IF(Import.TipoArredondamento<>\"TransfereGOV\",\n              ROUND(OFFSET($P19,0,AB$13),15-13*ORÇAMENTO!$AF$7)/$H19*OFFSET(ORÇAMENTO!$X$15,ROW(AB19)-ROW(AB$15),0),\n              ROUND(ROUND(OFFSET($P19,0,AB$13),15-13*ORÇAMENTO!$AF$7)*OFFSET(ORÇAMENTO!$W$15,ROW(AB19)-ROW(AB$15),0),15-13*ORÇAMENTO!$AF$11)),\n         0)","v":0},{"$f":"IF(AND($D19=\"Serviço\",AC$12<>0,$H19>0,OR(AUTOEVENTO<>\"manual\",$M19<>$A$15)),\n        IF(Import.TipoArredondamento<>\"TransfereGOV\",\n              ROUND(OFFSET($P19,0,AC$13),15-13*ORÇAMENTO!$AF$7)/$H19*OFFSET(ORÇAMENTO!$X$15,ROW(AC19)-ROW(AC$15),0),\n              ROUND(ROUND(OFFSET($P19,0,AC$13),15-13*ORÇAMENTO!$AF$7)*OFFSET(ORÇAMENTO!$W$15,ROW(AC19)-ROW(AC$15),0),15-13*ORÇAMENTO!$AF$11)),\n         0)","v":0},{"$f":"IF(AND($D19=\"Serviço\",AD$12<>0,$H19>0,OR(AUTOEVENTO<>\"manual\",$M19<>$A$15)),\n        IF(Import.TipoArredondamento<>\"TransfereGOV\",\n              ROUND(OFFSET($P19,0,AD$13),15-13*ORÇAMENTO!$AF$7)/$H19*OFFSET(ORÇAMENTO!$X$15,ROW(AD19)-ROW(AD$15),0),\n              ROUND(ROUND(OFFSET($P19,0,AD$13),15-13*ORÇAMENTO!$AF$7)*OFFSET(ORÇAMENTO!$W$15,ROW(AD19)-ROW(AD$15),0),15-13*ORÇAMENTO!$AF$11)),\n         0)","v":0},{"$f":"IF(AND($D19=\"Serviço\",AE$12<>0,$H19>0,OR(AUTOEVENTO<>\"manual\",$M19<>$A$15)),\n        IF(Import.TipoArredondamento<>\"TransfereGOV\",\n              ROUND(OFFSET($P19,0,AE$13),15-13*ORÇAMENTO!$AF$7)/$H19*OFFSET(ORÇAMENTO!$X$15,ROW(AE19)-ROW(AE$15),0),\n              ROUND(ROUND(OFFSET($P19,0,AE$13),15-13*ORÇAMENTO!$AF$7)*OFFSET(ORÇAMENTO!$W$15,ROW(AE19)-ROW(AE$15),0),15-13*ORÇAMENTO!$AF$11)),\n         0)","v":0},{"$f":"IF(AND($D19=\"Serviço\",AF$12<>0,$H19>0,OR(AUTOEVENTO<>\"manual\",$M19<>$A$15)),\n        IF(Import.TipoArredondamento<>\"TransfereGOV\",\n              ROUND(OFFSET($P19,0,AF$13),15-13*ORÇAMENTO!$AF$7)/$H19*OFFSET(ORÇAMENTO!$X$15,ROW(AF19)-ROW(AF$15),0),\n              ROUND(ROUND(OFFSET($P19,0,AF$13),15-13*ORÇAMENTO!$AF$7)*OFFSET(ORÇAMENTO!$W$15,ROW(AF19)-ROW(AF$15),0),15-13*ORÇAMENTO!$AF$11)),\n         0)","v":0},{"$f":"IF(AND($D19=\"Serviço\",AG$12<>0,$H19>0,OR(AUTOEVENTO<>\"manual\",$M19<>$A$15)),\n        IF(Import.TipoArredondamento<>\"TransfereGOV\",\n              ROUND(OFFSET($P19,0,AG$13),15-13*ORÇAMENTO!$AF$7)/$H19*OFFSET(ORÇAMENTO!$X$15,ROW(AG19)-ROW(AG$15),0),\n              ROUND(ROUND(OFFSET($P19,0,AG$13),15-13*ORÇAMENTO!$AF$7)*OFFSET(ORÇAMENTO!$W$15,ROW(AG19)-ROW(AG$15),0),15-13*ORÇAMENTO!$AF$11)),\n         0)","v":0},{"$f":"IF(AND($D19=\"Serviço\",AH$12<>0,$H19>0,OR(AUTOEVENTO<>\"manual\",$M19<>$A$15)),\n        IF(Import.TipoArredondamento<>\"TransfereGOV\",\n              ROUND(OFFSET($P19,0,AH$13),15-13*ORÇAMENTO!$AF$7)/$H19*OFFSET(ORÇAMENTO!$X$15,ROW(AH19)-ROW(AH$15),0),\n              ROUND(ROUND(OFFSET($P19,0,AH$13),15-13*ORÇAMENTO!$AF$7)*OFFSET(ORÇAMENTO!$W$15,ROW(AH19)-ROW(AH$15),0),15-13*ORÇAMENTO!$AF$11)),\n         0)","v":0},{"$f":"IF(AND($D19=\"Serviço\",AI$12<>0,$H19>0,OR(AUTOEVENTO<>\"manual\",$M19<>$A$15)),\n        IF(Import.TipoArredondamento<>\"TransfereGOV\",\n              ROUND(OFFSET($P19,0,AI$13),15-13*ORÇAMENTO!$AF$7)/$H19*OFFSET(ORÇAMENTO!$X$15,ROW(AI19)-ROW(AI$15),0),\n              ROUND(ROUND(OFFSET($P19,0,AI$13),15-13*ORÇAMENTO!$AF$7)*OFFSET(ORÇAMENTO!$W$15,ROW(AI19)-ROW(AI$15),0),15-13*ORÇAMENTO!$AF$11)),\n         0)","v":0},{"$f":"IF(AND($D19=\"Serviço\",AJ$12<>0,$H19>0,OR(AUTOEVENTO<>\"manual\",$M19<>$A$15)),\n        IF(Import.TipoArredondamento<>\"TransfereGOV\",\n              ROUND(OFFSET($P19,0,AJ$13),15-13*ORÇAMENTO!$AF$7)/$H19*OFFSET(ORÇAMENTO!$X$15,ROW(AJ19)-ROW(AJ$15),0),\n              ROUND(ROUND(OFFSET($P19,0,AJ$13),15-13*ORÇAMENTO!$AF$7)*OFFSET(ORÇAMENTO!$W$15,ROW(AJ19)-ROW(AJ$15),0),15-13*ORÇAMENTO!$AF$11)),\n         0)","v":0},{"$f":"IF(AND($D19=\"Serviço\",AK$12<>0,$H19>0,OR(AUTOEVENTO<>\"manual\",$M19<>$A$15)),\n        IF(Import.TipoArredondamento<>\"TransfereGOV\",\n              ROUND(OFFSET($P19,0,AK$13),15-13*ORÇAMENTO!$AF$7)/$H19*OFFSET(ORÇAMENTO!$X$15,ROW(AK19)-ROW(AK$15),0),\n              ROUND(ROUND(OFFSET($P19,0,AK$13),15-13*ORÇAMENTO!$AF$7)*OFFSET(ORÇAMENTO!$W$15,ROW(AK19)-ROW(AK$15),0),15-13*ORÇAMENTO!$AF$11)),\n         0)","v":0},null,{"$f":"IF(OR($D19<>\"Serviço\",AND(AUTOEVENTO=\"Manual\",$M19=$A$15)),0,\n         IF(OFFSET(CRONOPLE!$F$15,$M19-$A$15,AM$13)=0,10^12,OFFSET(CRONOPLE!$F$15,$M19-$A$15,AM$13)))","v":0},{"$f":"IF(OR($D19<>\"Serviço\",AND(AUTOEVENTO=\"Manual\",$M19=$A$15)),0,\n         IF(OFFSET(CRONOPLE!$F$15,$M19-$A$15,AN$13)=0,10^12,OFFSET(CRONOPLE!$F$15,$M19-$A$15,AN$13)))","v":0},{"$f":"IF(OR($D19<>\"Serviço\",AND(AUTOEVENTO=\"Manual\",$M19=$A$15)),0,\n         IF(OFFSET(CRONOPLE!$F$15,$M19-$A$15,AO$13)=0,10^12,OFFSET(CRONOPLE!$F$15,$M19-$A$15,AO$13)))","v":0},{"$f":"IF(OR($D19<>\"Serviço\",AND(AUTOEVENTO=\"Manual\",$M19=$A$15)),0,\n         IF(OFFSET(CRONOPLE!$F$15,$M19-$A$15,AP$13)=0,10^12,OFFSET(CRONOPLE!$F$15,$M19-$A$15,AP$13)))","v":0},{"$f":"IF(OR($D19<>\"Serviço\",AND(AUTOEVENTO=\"Manual\",$M19=$A$15)),0,\n         IF(OFFSET(CRONOPLE!$F$15,$M19-$A$15,AQ$13)=0,10^12,OFFSET(CRONOPLE!$F$15,$M19-$A$15,AQ$13)))","v":0},{"$f":"IF(OR($D19<>\"Serviço\",AND(AUTOEVENTO=\"Manual\",$M19=$A$15)),0,\n         IF(OFFSET(CRONOPLE!$F$15,$M19-$A$15,AR$13)=0,10^12,OFFSET(CRONOPLE!$F$15,$M19-$A$15,AR$13)))","v":0},{"$f":"IF(OR($D19<>\"Serviço\",AND(AUTOEVENTO=\"Manual\",$M19=$A$15)),0,\n         IF(OFFSET(CRONOPLE!$F$15,$M19-$A$15,AS$13)=0,10^12,OFFSET(CRONOPLE!$F$15,$M19-$A$15,AS$13)))","v":0},{"$f":"IF(OR($D19<>\"Serviço\",AND(AUTOEVENTO=\"Manual\",$M19=$A$15)),0,\n         IF(OFFSET(CRONOPLE!$F$15,$M19-$A$15,AT$13)=0,10^12,OFFSET(CRONOPLE!$F$15,$M19-$A$15,AT$13)))","v":0},{"$f":"IF(OR($D19<>\"Serviço\",AND(AUTOEVENTO=\"Manual\",$M19=$A$15)),0,\n         IF(OFFSET(CRONOPLE!$F$15,$M19-$A$15,AU$13)=0,10^12,OFFSET(CRONOPLE!$F$15,$M19-$A$15,AU$13)))","v":0},{"$f":"IF(OR($D19<>\"Serviço\",AND(AUTOEVENTO=\"Manual\",$M19=$A$15)),0,\n         IF(OFFSET(CRONOPLE!$F$15,$M19-$A$15,AV$13)=0,10^12,OFFSET(CRONOPLE!$F$15,$M19-$A$15,AV$13)))","v":0},null,{"$f":"IF(OR($D19<>\"Serviço\",AND(AUTOEVENTO=\"Manual\",$M19=$A$15),$M19>(ROW(PLE.lastrow)-ROW(PLE.firstrow))),0,\n           IF(OFFSET(PLE!$G$15,$M19-$A$15,AX$13)=\"\",10^12,OFFSET(PLE!$G$15,$M19-$A$15,AX$13)))","v":0},{"$f":"IF(OR($D19<>\"Serviço\",AND(AUTOEVENTO=\"Manual\",$M19=$A$15),$M19>(ROW(PLE.lastrow)-ROW(PLE.firstrow))),0,\n           IF(OFFSET(PLE!$G$15,$M19-$A$15,AY$13)=\"\",10^12,OFFSET(PLE!$G$15,$M19-$A$15,AY$13)))","v":0},{"$f":"IF(OR($D19<>\"Serviço\",AND(AUTOEVENTO=\"Manual\",$M19=$A$15),$M19>(ROW(PLE.lastrow)-ROW(PLE.firstrow))),0,\n           IF(OFFSET(PLE!$G$15,$M19-$A$15,AZ$13)=\"\",10^12,OFFSET(PLE!$G$15,$M19-$A$15,AZ$13)))","v":0},{"$f":"IF(OR($D19<>\"Serviço\",AND(AUTOEVENTO=\"Manual\",$M19=$A$15),$M19>(ROW(PLE.lastrow)-ROW(PLE.firstrow))),0,\n           IF(OFFSET(PLE!$G$15,$M19-$A$15,BA$13)=\"\",10^12,OFFSET(PLE!$G$15,$M19-$A$15,BA$13)))","v":0},{"$f":"IF(OR($D19<>\"Serviço\",AND(AUTOEVENTO=\"Manual\",$M19=$A$15),$M19>(ROW(PLE.lastrow)-ROW(PLE.firstrow))),0,\n           IF(OFFSET(PLE!$G$15,$M19-$A$15,BB$13)=\"\",10^12,OFFSET(PLE!$G$15,$M19-$A$15,BB$13)))","v":0},{"$f":"IF(OR($D19<>\"Serviço\",AND(AUTOEVENTO=\"Manual\",$M19=$A$15),$M19>(ROW(PLE.lastrow)-ROW(PLE.firstrow))),0,\n           IF(OFFSET(PLE!$G$15,$M19-$A$15,BC$13)=\"\",10^12,OFFSET(PLE!$G$15,$M19-$A$15,BC$13)))","v":0},{"$f":"IF(OR($D19<>\"Serviço\",AND(AUTOEVENTO=\"Manual\",$M19=$A$15),$M19>(ROW(PLE.lastrow)-ROW(PLE.firstrow))),0,\n           IF(OFFSET(PLE!$G$15,$M19-$A$15,BD$13)=\"\",10^12,OFFSET(PLE!$G$15,$M19-$A$15,BD$13)))","v":0},{"$f":"IF(OR($D19<>\"Serviço\",AND(AUTOEVENTO=\"Manual\",$M19=$A$15),$M19>(ROW(PLE.lastrow)-ROW(PLE.firstrow))),0,\n           IF(OFFSET(PLE!$G$15,$M19-$A$15,BE$13)=\"\",10^12,OFFSET(PLE!$G$15,$M19-$A$15,BE$13)))","v":0},{"$f":"IF(OR($D19<>\"Serviço\",AND(AUTOEVENTO=\"Manual\",$M19=$A$15),$M19>(ROW(PLE.lastrow)-ROW(PLE.firstrow))),0,\n           IF(OFFSET(PLE!$G$15,$M19-$A$15,BF$13)=\"\",10^12,OFFSET(PLE!$G$15,$M19-$A$15,BF$13)))","v":0},{"$f":"IF(OR($D19<>\"Serviço\",AND(AUTOEVENTO=\"Manual\",$M19=$A$15),$M19>(ROW(PLE.lastrow)-ROW(PLE.firstrow))),0,\n           IF(OFFSET(PLE!$G$15,$M19-$A$15,BG$13)=\"\",10^12,OFFSET(PLE!$G$15,$M19-$A$15,BG$13)))","v":0}]
["4",{"$f":"OFFSET(ORÇAMENTO!C$15,ROW(B20)-ROW(B$15),0)","v":"S"},{"$f":"OFFSET(ORÇAMENTO!L$15,ROW(C20)-ROW(C$15),0)","v":"F"},{"$f":"OFFSET(ORÇAMENTO!N$15,ROW(D20)-ROW(D$15),0)","v":"Serviço"},{"$f":"OFFSET(ORÇAMENTO!O$15,ROW(E20)-ROW(E$15),0)","v":"1.2.1."},{"$f":"OFFSET(ORÇAMENTO!R$15,ROW(F20)-ROW(F$15),0)","v":"(abra o arquivo 'Referência 02-2026.xlsm)"},{"$f":"IF($D20<>\"Serviço\",\"\",OFFSET(ORÇAMENTO!S$15,ROW(G20)-ROW(G$15),0))","v":"M"},{"$f":"IF($D20<>\"Serviço\",0,IF(ACOMPANHAMENTO=\"BM\",ROUND(OFFSET(ORÇAMENTO!AJ$15,ROW(H20)-ROW(H$15),0),15-13*ORÇAMENTO!$AF$7),SUMPRODUCT(($Q$1:$AA$1=1)*ROUND($Q20:$AA20,15-13*ORÇAMENTO!$AF$7))))","v":68},"68 metros",{"$f":"IF(OR(B20<>\"S\",CÁLCULO.FrentesPreenchidas=0),\"\",IF(AND(ACOMPANHAMENTO=\"PLE\",AUTOEVENTO=\"Manual\",OR(H20>0,ORÇAMENTO!AC20=\"QUANT.\"),OR(K20=\"\",M20=0,N20=\"\")),\"►E\",IF(AND(ACOMPANHAMENTO=\"PLE\",ORÇAMENTO!AC20=\"QUANT.\"),\"►Q\",IF(AND(ACOMPANHAMENTO=\"PLE\",H20<>SUMPRODUCT(($Q$1:$AA$1=1)*ROUND(Q20:AA20,15))),\"►S\",IF(AND(COUNTIF($P$11:$AA$11,\"▼\")=0,H20>0,I20=\"\"),\"◄M\",\"\")))))","v":""},null,".",{"$f":"IF($D20<>\"Serviço\",\"\",\n          IF(AUTOEVENTO=\"manual\",$A20,\n                IF(ISERROR(MATCH($A20,$A$15:OFFSET($A20,-1,0),0)),MAX($M$15:OFFSET(M20,-1,0))+1,\n                      INDEX($M$15:OFFSET(M20,-1,0),MATCH($A20,$A$15:OFFSET($A20,-1,0),0)))))","v":2},{"$f":"IF($D20<>\"Serviço\",\"\",\n         IF(AUTOEVENTO=\"Manual\",\n                IF($A20=0,\"<-- defina o número do agrupador\",\n                       OFFSET(EVENTOS!$D$15,$A20-$A$15,0)),\n                OFFSET($F$15,$A20,0)))","v":"ESTRUTURA E COBERTURA "},null,null,null,68,null,null,null,null,null,null,null,null,null,{"$f":"IF(AND($D20=\"Serviço\",AB$12<>0,$H20>0,OR(AUTOEVENTO<>\"manual\",$M20<>$A$15)),\n        IF(Import.TipoArredondamento<>\"TransfereGOV\",\n              ROUND(OFFSET($P20,0,AB$13),15-13*ORÇAMENTO!$AF$7)/$H20*OFFSET(ORÇAMENTO!$X$15,ROW(AB20)-ROW(AB$15),0),\n              ROUND(ROUND(OFFSET($P20,0,AB$13),15-13*ORÇAMENTO!$AF$7)*OFFSET(ORÇAMENTO!$W$15,ROW(AB20)-ROW(AB$15),0),15-13*ORÇAMENTO!$AF$11)),\n         0)","v":0},{"$f":"IF(AND($D20=\"Serviço\",AC$12<>0,$H20>0,OR(AUTOEVENTO<>\"manual\",$M20<>$A$15)),\n        IF(Import.TipoArredondamento<>\"TransfereGOV\",\n              ROUND(OFFSET($P20,0,AC$13),15-13*ORÇAMENTO!$AF$7)/$H20*OFFSET(ORÇAMENTO!$X$15,ROW(AC20)-ROW(AC$15),0),\n              ROUND(ROUND(OFFSET($P20,0,AC$13),15-13*ORÇAMENTO!$AF$7)*OFFSET(ORÇAMENTO!$W$15,ROW(AC20)-ROW(AC$15),0),15-13*ORÇAMENTO!$AF$11)),\n         0)","v":10488.32},{"$f":"IF(AND($D20=\"Serviço\",AD$12<>0,$H20>0,OR(AUTOEVENTO<>\"manual\",$M20<>$A$15)),\n        IF(Import.TipoArredondamento<>\"TransfereGOV\",\n              ROUND(OFFSET($P20,0,AD$13),15-13*ORÇAMENTO!$AF$7)/$H20*OFFSET(ORÇAMENTO!$X$15,ROW(AD20)-ROW(AD$15),0),\n              ROUND(ROUND(OFFSET($P20,0,AD$13),15-13*ORÇAMENTO!$AF$7)*OFFSET(ORÇAMENTO!$W$15,ROW(AD20)-ROW(AD$15),0),15-13*ORÇAMENTO!$AF$11)),\n         0)","v":0},{"$f":"IF(AND($D20=\"Serviço\",AE$12<>0,$H20>0,OR(AUTOEVENTO<>\"manual\",$M20<>$A$15)),\n        IF(Import.TipoArredondamento<>\"TransfereGOV\",\n              ROUND(OFFSET($P20,0,AE$13),15-13*ORÇAMENTO!$AF$7)/$H20*OFFSET(ORÇAMENTO!$X$15,ROW(AE20)-ROW(AE$15),0),\n              ROUND(ROUND(OFFSET($P20,0,AE$13),15-13*ORÇAMENTO!$AF$7)*OFFSET(ORÇAMENTO!$W$15,ROW(AE20)-ROW(AE$15),0),15-13*ORÇAMENTO!$AF$11)),\n         0)","v":0},{"$f":"IF(AND($D20=\"Serviço\",AF$12<>0,$H20>0,OR(AUTOEVENTO<>\"manual\",$M20<>$A$15)),\n        IF(Import.TipoArredondamento<>\"TransfereGOV\",\n              ROUND(OFFSET($P20,0,AF$13),15-13*ORÇAMENTO!$AF$7)/$H20*OFFSET(ORÇAMENTO!$X$15,ROW(AF20)-ROW(AF$15),0),\n              ROUND(ROUND(OFFSET($P20,0,AF$13),15-13*ORÇAMENTO!$AF$7)*OFFSET(ORÇAMENTO!$W$15,ROW(AF20)-ROW(AF$15),0),15-13*ORÇAMENTO!$AF$11)),\n         0)","v":0},{"$f":"IF(AND($D20=\"Serviço\",AG$12<>0,$H20>0,OR(AUTOEVENTO<>\"manual\",$M20<>$A$15)),\n        IF(Import.TipoArredondamento<>\"TransfereGOV\",\n              ROUND(OFFSET($P20,0,AG$13),15-13*ORÇAMENTO!$AF$7)/$H20*OFFSET(ORÇAMENTO!$X$15,ROW(AG20)-ROW(AG$15),0),\n              ROUND(ROUND(OFFSET($P20,0,AG$13),15-13*ORÇAMENTO!$AF$7)*OFFSET(ORÇAMENTO!$W$15,ROW(AG20)-ROW(AG$15),0),15-13*ORÇAMENTO!$AF$11)),\n         0)","v":0},{"$f":"IF(AND($D20=\"Serviço\",AH$12<>0,$H20>0,OR(AUTOEVENTO<>\"manual\",$M20<>$A$15)),\n        IF(Import.TipoArredondamento<>\"TransfereGOV\",\n              ROUND(OFFSET($P20,0,AH$13),15-13*ORÇAMENTO!$AF$7)/$H20*OFFSET(ORÇAMENTO!$X$15,ROW(AH20)-ROW(AH$15),0),\n              ROUND(ROUND(OFFSET($P20,0,AH$13),15-13*ORÇAMENTO!$AF$7)*OFFSET(ORÇAMENTO!$W$15,ROW(AH20)-ROW(AH$15),0),15-13*ORÇAMENTO!$AF$11)),\n         0)","v":0},{"$f":"IF(AND($D20=\"Serviço\",AI$12<>0,$H20>0,OR(AUTOEVENTO<>\"manual\",$M20<>$A$15)),\n        IF(Import.TipoArredondamento<>\"TransfereGOV\",\n              ROUND(OFFSET($P20,0,AI$13),15-13*ORÇAMENTO!$AF$7)/$H20*OFFSET(ORÇAMENTO!$X$15,ROW(AI20)-ROW(AI$15),0),\n              ROUND(ROUND(OFFSET($P20,0,AI$13),15-13*ORÇAMENTO!$AF$7)*OFFSET(ORÇAMENTO!$W$15,ROW(AI20)-ROW(AI$15),0),15-13*ORÇAMENTO!$AF$11)),\n         0)","v":0},{"$f":"IF(AND($D20=\"Serviço\",AJ$12<>0,$H20>0,OR(AUTOEVENTO<>\"manual\",$M20<>$A$15)),\n        IF(Import.TipoArredondamento<>\"TransfereGOV\",\n              ROUND(OFFSET($P20,0,AJ$13),15-13*ORÇAMENTO!$AF$7)/$H20*OFFSET(ORÇAMENTO!$X$15,ROW(AJ20)-ROW(AJ$15),0),\n              ROUND(ROUND(OFFSET($P20,0,AJ$13),15-13*ORÇAMENTO!$AF$7)*OFFSET(ORÇAMENTO!$W$15,ROW(AJ20)-ROW(AJ$15),0),15-13*ORÇAMENTO!$AF$11)),\n         0)","v":0},{"$f":"IF(AND($D20=\"Serviço\",AK$12<>0,$H20>0,OR(AUTOEVENTO<>\"manual\",$M20<>$A$15)),\n        IF(Import.TipoArredondamento<>\"TransfereGOV\",\n              ROUND(OFFSET($P20,0,AK$13),15-13*ORÇAMENTO!$AF$7)/$H20*OFFSET(ORÇAMENTO!$X$15,ROW(AK20)-ROW(AK$15),0),\n              ROUND(ROUND(OFFSET($P20,0,AK$13),15-13*ORÇAMENTO!$AF$7)*OFFSET(ORÇAMENTO!$W$15,ROW(AK20)-ROW(AK$15),0),15-13*ORÇAMENTO!$AF$11)),\n         0)","v":0},null,{"$f":"IF(OR($D20<>\"Serviço\",AND(AUTOEVENTO=\"Manual\",$M20=$A$15)),0,\n         IF(OFFSET(CRONOPLE!$F$15,$M20-$A$15,AM$13)=0,10^12,OFFSET(CRONOPLE!$F$15,$M20-$A$15,AM$13)))","v":1000000000000},{"$f":"IF(OR($D20<>\"Serviço\",AND(AUTOEVENTO=\"Manual\",$M20=$A$15)),0,\n         IF(OFFSET(CRONOPLE!$F$15,$M20-$A$15,AN$13)=0,10^12,OFFSET(CRONOPLE!$F$15,$M20-$A$15,AN$13)))","v":1},{"$f":"IF(OR($D20<>\"Serviço\",AND(AUTOEVENTO=\"Manual\",$M20=$A$15)),0,\n         IF(OFFSET(CRONOPLE!$F$15,$M20-$A$15,AO$13)=0,10^12,OFFSET(CRONOPLE!$F$15,$M20-$A$15,AO$13)))","v":2},{"$f":"IF(OR($D20<>\"Serviço\",AND(AUTOEVENTO=\"Manual\",$M20=$A$15)),0,\n         IF(OFFSET(CRONOPLE!$F$15,$M20-$A$15,AP$13)=0,10^12,OFFSET(CRONOPLE!$F$15,$M20-$A$15,AP$13)))","v":1000000000000},{"$f":"IF(OR($D20<>\"Serviço\",AND(AUTOEVENTO=\"Manual\",$M20=$A$15)),0,\n         IF(OFFSET(CRONOPLE!$F$15,$M20-$A$15,AQ$13)=0,10^12,OFFSET(CRONOPLE!$F$15,$M20-$A$15,AQ$13)))","v":1000000000000},{"$f":"IF(OR($D20<>\"Serviço\",AND(AUTOEVENTO=\"Manual\",$M20=$A$15)),0,\n         IF(OFFSET(CRONOPLE!$F$15,$M20-$A$15,AR$13)=0,10^12,OFFSET(CRONOPLE!$F$15,$M20-$A$15,AR$13)))","v":1000000000000},{"$f":"IF(OR($D20<>\"Serviço\",AND(AUTOEVENTO=\"Manual\",$M20=$A$15)),0,\n         IF(OFFSET(CRONOPLE!$F$15,$M20-$A$15,AS$13)=0,10^12,OFFSET(CRONOPLE!$F$15,$M20-$A$15,AS$13)))","v":1000000000000},{"$f":"IF(OR($D20<>\"Serviço\",AND(AUTOEVENTO=\"Manual\",$M20=$A$15)),0,\n         IF(OFFSET(CRONOPLE!$F$15,$M20-$A$15,AT$13)=0,10^12,OFFSET(CRONOPLE!$F$15,$M20-$A$15,AT$13)))","v":1000000000000},{"$f":"IF(OR($D20<>\"Serviço\",AND(AUTOEVENTO=\"Manual\",$M20=$A$15)),0,\n         IF(OFFSET(CRONOPLE!$F$15,$M20-$A$15,AU$13)=0,10^12,OFFSET(CRONOPLE!$F$15,$M20-$A$15,AU$13)))","v":1000000000000},{"$f":"IF(OR($D20<>\"Serviço\",AND(AUTOEVENTO=\"Manual\",$M20=$A$15)),0,\n         IF(OFFSET(CRONOPLE!$F$15,$M20-$A$15,AV$13)=0,10^12,OFFSET(CRONOPLE!$F$15,$M20-$A$15,AV$13)))","v":1000000000000},null,{"$f":"IF(OR($D20<>\"Serviço\",AND(AUTOEVENTO=\"Manual\",$M20=$A$15),$M20>(ROW(PLE.lastrow)-ROW(PLE.firstrow))),0,\n           IF(OFFSET(PLE!$G$15,$M20-$A$15,AX$13)=\"\",10^12,OFFSET(PLE!$G$15,$M20-$A$15,AX$13)))","v":1000000000000},{"$f":"IF(OR($D20<>\"Serviço\",AND(AUTOEVENTO=\"Manual\",$M20=$A$15),$M20>(ROW(PLE.lastrow)-ROW(PLE.firstrow))),0,\n           IF(OFFSET(PLE!$G$15,$M20-$A$15,AY$13)=\"\",10^12,OFFSET(PLE!$G$15,$M20-$A$15,AY$13)))","v":1000000000000},{"$f":"IF(OR($D20<>\"Serviço\",AND(AUTOEVENTO=\"Manual\",$M20=$A$15),$M20>(ROW(PLE.lastrow)-ROW(PLE.firstrow))),0,\n           IF(OFFSET(PLE!$G$15,$M20-$A$15,AZ$13)=\"\",10^12,OFFSET(PLE!$G$15,$M20-$A$15,AZ$13)))","v":1000000000000},{"$f":"IF(OR($D20<>\"Serviço\",AND(AUTOEVENTO=\"Manual\",$M20=$A$15),$M20>(ROW(PLE.lastrow)-ROW(PLE.firstrow))),0,\n           IF(OFFSET(PLE!$G$15,$M20-$A$15,BA$13)=\"\",10^12,OFFSET(PLE!$G$15,$M20-$A$15,BA$13)))","v":1000000000000},{"$f":"IF(OR($D20<>\"Serviço\",AND(AUTOEVENTO=\"Manual\",$M20=$A$15),$M20>(ROW(PLE.lastrow)-ROW(PLE.firstrow))),0,\n           IF(OFFSET(PLE!$G$15,$M20-$A$15,BB$13)=\"\",10^12,OFFSET(PLE!$G$15,$M20-$A$15,BB$13)))","v":1000000000000},{"$f":"IF(OR($D20<>\"Serviço\",AND(AUTOEVENTO=\"Manual\",$M20=$A$15),$M20>(ROW(PLE.lastrow)-ROW(PLE.firstrow))),0,\n           IF(OFFSET(PLE!$G$15,$M20-$A$15,BC$13)=\"\",10^12,OFFSET(PLE!$G$15,$M20-$A$15,BC$13)))","v":1000000000000},{"$f":"IF(OR($D20<>\"Serviço\",AND(AUTOEVENTO=\"Manual\",$M20=$A$15),$M20>(ROW(PLE.lastrow)-ROW(PLE.firstrow))),0,\n           IF(OFFSET(PLE!$G$15,$M20-$A$15,BD$13)=\"\",10^12,OFFSET(PLE!$G$15,$M20-$A$15,BD$13)))","v":1000000000000},{"$f":"IF(OR($D20<>\"Serviço\",AND(AUTOEVENTO=\"Manual\",$M20=$A$15),$M20>(ROW(PLE.lastrow)-ROW(PLE.firstrow))),0,\n           IF(OFFSET(PLE!$G$15,$M20-$A$15,BE$13)=\"\",10^12,OFFSET(PLE!$G$15,$M20-$A$15,BE$13)))","v":1000000000000},{"$f":"IF(OR($D20<>\"Serviço\",AND(AUTOEVENTO=\"Manual\",$M20=$A$15),$M20>(ROW(PLE.lastrow)-ROW(PLE.firstrow))),0,\n           IF(OFFSET(PLE!$G$15,$M20-$A$15,BF$13)=\"\",10^12,OFFSET(PLE!$G$15,$M20-$A$15,BF$13)))","v":1000000000000},{"$f":"IF(OR($D20<>\"Serviço\",AND(AUTOEVENTO=\"Manual\",$M20=$A$15),$M20>(ROW(PLE.lastrow)-ROW(PLE.firstrow))),0,\n           IF(OFFSET(PLE!$G$15,$M20-$A$15,BG$13)=\"\",10^12,OFFSET(PLE!$G$15,$M20-$A$15,BG$13)))","v":1000000000000}]
["4",{"$f":"OFFSET(ORÇAMENTO!C$15,ROW(B21)-ROW(B$15),0)","v":"S"},{"$f":"OFFSET(ORÇAMENTO!L$15,ROW(C21)-ROW(C$15),0)","v":"F"},{"$f":"OFFSET(ORÇAMENTO!N$15,ROW(D21)-ROW(D$15),0)","v":"Serviço"},{"$f":"OFFSET(ORÇAMENTO!O$15,ROW(E21)-ROW(E$15),0)","v":"1.2.2."},{"$f":"OFFSET(ORÇAMENTO!R$15,ROW(F21)-ROW(F$15),0)","v":"(abra o arquivo 'Referência 02-2026.xlsm)"},{"$f":"IF($D21<>\"Serviço\",\"\",OFFSET(ORÇAMENTO!S$15,ROW(G21)-ROW(G$15),0))","v":"UN"},{"$f":"IF($D21<>\"Serviço\",0,IF(ACOMPANHAMENTO=\"BM\",ROUND(OFFSET(ORÇAMENTO!AJ$15,ROW(H21)-ROW(H$15),0),15-13*ORÇAMENTO!$AF$7),SUMPRODUCT(($Q$1:$AA$1=1)*ROUND($Q21:$AA21,15-13*ORÇAMENTO!$AF$7))))","v":8},"8 unidades",{"$f":"IF(OR(B21<>\"S\",CÁLCULO.FrentesPreenchidas=0),\"\",IF(AND(ACOMPANHAMENTO=\"PLE\",AUTOEVENTO=\"Manual\",OR(H21>0,ORÇAMENTO!AC21=\"QUANT.\"),OR(K21=\"\",M21=0,N21=\"\")),\"►E\",IF(AND(ACOMPANHAMENTO=\"PLE\",ORÇAMENTO!AC21=\"QUANT.\"),\"►Q\",IF(AND(ACOMPANHAMENTO=\"PLE\",H21<>SUMPRODUCT(($Q$1:$AA$1=1)*ROUND(Q21:AA21,15))),\"►S\",IF(AND(COUNTIF($P$11:$AA$11,\"▼\")=0,H21>0,I21=\"\"),\"◄M\",\"\")))))","v":""},null,".",{"$f":"IF($D21<>\"Serviço\",\"\",\n          IF(AUTOEVENTO=\"manual\",$A21,\n                IF(ISERROR(MATCH($A21,$A$15:OFFSET($A21,-1,0),0)),MAX($M$15:OFFSET(M21,-1,0))+1,\n                      INDEX($M$15:OFFSET(M21,-1,0),MATCH($A21,$A$15:OFFSET($A21,-1,0),0)))))","v":2},{"$f":"IF($D21<>\"Serviço\",\"\",\n         IF(AUTOEVENTO=\"Manual\",\n                IF($A21=0,\"<-- defina o número do agrupador\",\n                       OFFSET(EVENTOS!$D$15,$A21-$A$15,0)),\n                OFFSET($F$15,$A21,0)))","v":"ESTRUTURA E COBERTURA "},null,null,null,8,null,null,null,null,null,null,null,null,null,{"$f":"IF(AND($D21=\"Serviço\",AB$12<>0,$H21>0,OR(AUTOEVENTO<>\"manual\",$M21<>$A$15)),\n        IF(Import.TipoArredondamento<>\"TransfereGOV\",\n              ROUND(OFFSET($P21,0,AB$13),15-13*ORÇAMENTO!$AF$7)/$H21*OFFSET(ORÇAMENTO!$X$15,ROW(AB21)-ROW(AB$15),0),\n              ROUND(ROUND(OFFSET($P21,0,AB$13),15-13*ORÇAMENTO!$AF$7)*OFFSET(ORÇAMENTO!$W$15,ROW(AB21)-ROW(AB$15),0),15-13*ORÇAMENTO!$AF$11)),\n         0)","v":0},{"$f":"IF(AND($D21=\"Serviço\",AC$12<>0,$H21>0,OR(AUTOEVENTO<>\"manual\",$M21<>$A$15)),\n        IF(Import.TipoArredondamento<>\"TransfereGOV\",\n              ROUND(OFFSET($P21,0,AC$13),15-13*ORÇAMENTO!$AF$7)/$H21*OFFSET(ORÇAMENTO!$X$15,ROW(AC21)-ROW(AC$15),0),\n              ROUND(ROUND(OFFSET($P21,0,AC$13),15-13*ORÇAMENTO!$AF$7)*OFFSET(ORÇAMENTO!$W$15,ROW(AC21)-ROW(AC$15),0),15-13*ORÇAMENTO!$AF$11)),\n         0)","v":18261.759999999998},{"$f":"IF(AND($D21=\"Serviço\",AD$12<>0,$H21>0,OR(AUTOEVENTO<>\"manual\",$M21<>$A$15)),\n        IF(Import.TipoArredondamento<>\"TransfereGOV\",\n              ROUND(OFFSET($P21,0,AD$13),15-13*ORÇAMENTO!$AF$7)/$H21*OFFSET(ORÇAMENTO!$X$15,ROW(AD21)-ROW(AD$15),0),\n              ROUND(ROUND(OFFSET($P21,0,AD$13),15-13*ORÇAMENTO!$AF$7)*OFFSET(ORÇAMENTO!$W$15,ROW(AD21)-ROW(AD$15),0),15-13*ORÇAMENTO!$AF$11)),\n         0)","v":0},{"$f":"IF(AND($D21=\"Serviço\",AE$12<>0,$H21>0,OR(AUTOEVENTO<>\"manual\",$M21<>$A$15)),\n        IF(Import.TipoArredondamento<>\"TransfereGOV\",\n              ROUND(OFFSET($P21,0,AE$13),15-13*ORÇAMENTO!$AF$7)/$H21*OFFSET(ORÇAMENTO!$X$15,ROW(AE21)-ROW(AE$15),0),\n              ROUND(ROUND(OFFSET($P21,0,AE$13),15-13*ORÇAMENTO!$AF$7)*OFFSET(ORÇAMENTO!$W$15,ROW(AE21)-ROW(AE$15),0),15-13*ORÇAMENTO!$AF$11)),\n         0)","v":0},{"$f":"IF(AND($D21=\"Serviço\",AF$12<>0,$H21>0,OR(AUTOEVENTO<>\"manual\",$M21<>$A$15)),\n        IF(Import.TipoArredondamento<>\"TransfereGOV\",\n              ROUND(OFFSET($P21,0,AF$13),15-13*ORÇAMENTO!$AF$7)/$H21*OFFSET(ORÇAMENTO!$X$15,ROW(AF21)-ROW(AF$15),0),\n              ROUND(ROUND(OFFSET($P21,0,AF$13),15-13*ORÇAMENTO!$AF$7)*OFFSET(ORÇAMENTO!$W$15,ROW(AF21)-ROW(AF$15),0),15-13*ORÇAMENTO!$AF$11)),\n         0)","v":0},{"$f":"IF(AND($D21=\"Serviço\",AG$12<>0,$H21>0,OR(AUTOEVENTO<>\"manual\",$M21<>$A$15)),\n        IF(Import.TipoArredondamento<>\"TransfereGOV\",\n              ROUND(OFFSET($P21,0,AG$13),15-13*ORÇAMENTO!$AF$7)/$H21*OFFSET(ORÇAMENTO!$X$15,ROW(AG21)-ROW(AG$15),0),\n              ROUND(ROUND(OFFSET($P21,0,AG$13),15-13*ORÇAMENTO!$AF$7)*OFFSET(ORÇAMENTO!$W$15,ROW(AG21)-ROW(AG$15),0),15-13*ORÇAMENTO!$AF$11)),\n         0)","v":0},{"$f":"IF(AND($D21=\"Serviço\",AH$12<>0,$H21>0,OR(AUTOEVENTO<>\"manual\",$M21<>$A$15)),\n        IF(Import.TipoArredondamento<>\"TransfereGOV\",\n              ROUND(OFFSET($P21,0,AH$13),15-13*ORÇAMENTO!$AF$7)/$H21*OFFSET(ORÇAMENTO!$X$15,ROW(AH21)-ROW(AH$15),0),\n              ROUND(ROUND(OFFSET($P21,0,AH$13),15-13*ORÇAMENTO!$AF$7)*OFFSET(ORÇAMENTO!$W$15,ROW(AH21)-ROW(AH$15),0),15-13*ORÇAMENTO!$AF$11)),\n         0)","v":0},{"$f":"IF(AND($D21=\"Serviço\",AI$12<>0,$H21>0,OR(AUTOEVENTO<>\"manual\",$M21<>$A$15)),\n        IF(Import.TipoArredondamento<>\"TransfereGOV\",\n              ROUND(OFFSET($P21,0,AI$13),15-13*ORÇAMENTO!$AF$7)/$H21*OFFSET(ORÇAMENTO!$X$15,ROW(AI21)-ROW(AI$15),0),\n              ROUND(ROUND(OFFSET($P21,0,AI$13),15-13*ORÇAMENTO!$AF$7)*OFFSET(ORÇAMENTO!$W$15,ROW(AI21)-ROW(AI$15),0),15-13*ORÇAMENTO!$AF$11)),\n         0)","v":0},{"$f":"IF(AND($D21=\"Serviço\",AJ$12<>0,$H21>0,OR(AUTOEVENTO<>\"manual\",$M21<>$A$15)),\n        IF(Import.TipoArredondamento<>\"TransfereGOV\",\n              ROUND(OFFSET($P21,0,AJ$13),15-13*ORÇAMENTO!$AF$7)/$H21*OFFSET(ORÇAMENTO!$X$15,ROW(AJ21)-ROW(AJ$15),0),\n              ROUND(ROUND(OFFSET($P21,0,AJ$13),15-13*ORÇAMENTO!$AF$7)*OFFSET(ORÇAMENTO!$W$15,ROW(AJ21)-ROW(AJ$15),0),15-13*ORÇAMENTO!$AF$11)),\n         0)","v":0},{"$f":"IF(AND($D21=\"Serviço\",AK$12<>0,$H21>0,OR(AUTOEVENTO<>\"manual\",$M21<>$A$15)),\n        IF(Import.TipoArredondamento<>\"TransfereGOV\",\n              ROUND(OFFSET($P21,0,AK$13),15-13*ORÇAMENTO!$AF$7)/$H21*OFFSET(ORÇAMENTO!$X$15,ROW(AK21)-ROW(AK$15),0),\n              ROUND(ROUND(OFFSET($P21,0,AK$13),15-13*ORÇAMENTO!$AF$7)*OFFSET(ORÇAMENTO!$W$15,ROW(AK21)-ROW(AK$15),0),15-13*ORÇAMENTO!$AF$11)),\n         0)","v":0},null,{"$f":"IF(OR($D21<>\"Serviço\",AND(AUTOEVENTO=\"Manual\",$M21=$A$15)),0,\n         IF(OFFSET(CRONOPLE!$F$15,$M21-$A$15,AM$13)=0,10^12,OFFSET(CRONOPLE!$F$15,$M21-$A$15,AM$13)))","v":1000000000000},{"$f":"IF(OR($D21<>\"Serviço\",AND(AUTOEVENTO=\"Manual\",$M21=$A$15)),0,\n         IF(OFFSET(CRONOPLE!$F$15,$M21-$A$15,AN$13)=0,10^12,OFFSET(CRONOPLE!$F$15,$M21-$A$15,AN$13)))","v":1},{"$f":"IF(OR($D21<>\"Serviço\",AND(AUTOEVENTO=\"Manual\",$M21=$A$15)),0,\n         IF(OFFSET(CRONOPLE!$F$15,$M21-$A$15,AO$13)=0,10^12,OFFSET(CRONOPLE!$F$15,$M21-$A$15,AO$13)))","v":2},{"$f":"IF(OR($D21<>\"Serviço\",AND(AUTOEVENTO=\"Manual\",$M21=$A$15)),0,\n         IF(OFFSET(CRONOPLE!$F$15,$M21-$A$15,AP$13)=0,10^12,OFFSET(CRONOPLE!$F$15,$M21-$A$15,AP$13)))","v":1000000000000},{"$f":"IF(OR($D21<>\"Serviço\",AND(AUTOEVENTO=\"Manual\",$M21=$A$15)),0,\n         IF(OFFSET(CRONOPLE!$F$15,$M21-$A$15,AQ$13)=0,10^12,OFFSET(CRONOPLE!$F$15,$M21-$A$15,AQ$13)))","v":1000000000000},{"$f":"IF(OR($D21<>\"Serviço\",AND(AUTOEVENTO=\"Manual\",$M21=$A$15)),0,\n         IF(OFFSET(CRONOPLE!$F$15,$M21-$A$15,AR$13)=0,10^12,OFFSET(CRONOPLE!$F$15,$M21-$A$15,AR$13)))","v":1000000000000},{"$f":"IF(OR($D21<>\"Serviço\",AND(AUTOEVENTO=\"Manual\",$M21=$A$15)),0,\n         IF(OFFSET(CRONOPLE!$F$15,$M21-$A$15,AS$13)=0,10^12,OFFSET(CRONOPLE!$F$15,$M21-$A$15,AS$13)))","v":1000000000000},{"$f":"IF(OR($D21<>\"Serviço\",AND(AUTOEVENTO=\"Manual\",$M21=$A$15)),0,\n         IF(OFFSET(CRONOPLE!$F$15,$M21-$A$15,AT$13)=0,10^12,OFFSET(CRONOPLE!$F$15,$M21-$A$15,AT$13)))","v":1000000000000},{"$f":"IF(OR($D21<>\"Serviço\",AND(AUTOEVENTO=\"Manual\",$M21=$A$15)),0,\n         IF(OFFSET(CRONOPLE!$F$15,$M21-$A$15,AU$13)=0,10^12,OFFSET(CRONOPLE!$F$15,$M21-$A$15,AU$13)))","v":1000000000000},{"$f":"IF(OR($D21<>\"Serviço\",AND(AUTOEVENTO=\"Manual\",$M21=$A$15)),0,\n         IF(OFFSET(CRONOPLE!$F$15,$M21-$A$15,AV$13)=0,10^12,OFFSET(CRONOPLE!$F$15,$M21-$A$15,AV$13)))","v":1000000000000},null,{"$f":"IF(OR($D21<>\"Serviço\",AND(AUTOEVENTO=\"Manual\",$M21=$A$15),$M21>(ROW(PLE.lastrow)-ROW(PLE.firstrow))),0,\n           IF(OFFSET(PLE!$G$15,$M21-$A$15,AX$13)=\"\",10^12,OFFSET(PLE!$G$15,$M21-$A$15,AX$13)))","v":1000000000000},{"$f":"IF(OR($D21<>\"Serviço\",AND(AUTOEVENTO=\"Manual\",$M21=$A$15),$M21>(ROW(PLE.lastrow)-ROW(PLE.firstrow))),0,\n           IF(OFFSET(PLE!$G$15,$M21-$A$15,AY$13)=\"\",10^12,OFFSET(PLE!$G$15,$M21-$A$15,AY$13)))","v":1000000000000},{"$f":"IF(OR($D21<>\"Serviço\",AND(AUTOEVENTO=\"Manual\",$M21=$A$15),$M21>(ROW(PLE.lastrow)-ROW(PLE.firstrow))),0,\n           IF(OFFSET(PLE!$G$15,$M21-$A$15,AZ$13)=\"\",10^12,OFFSET(PLE!$G$15,$M21-$A$15,AZ$13)))","v":1000000000000},{"$f":"IF(OR($D21<>\"Serviço\",AND(AUTOEVENTO=\"Manual\",$M21=$A$15),$M21>(ROW(PLE.lastrow)-ROW(PLE.firstrow))),0,\n           IF(OFFSET(PLE!$G$15,$M21-$A$15,BA$13)=\"\",10^12,OFFSET(PLE!$G$15,$M21-$A$15,BA$13)))","v":1000000000000},{"$f":"IF(OR($D21<>\"Serviço\",AND(AUTOEVENTO=\"Manual\",$M21=$A$15),$M21>(ROW(PLE.lastrow)-ROW(PLE.firstrow))),0,\n           IF(OFFSET(PLE!$G$15,$M21-$A$15,BB$13)=\"\",10^12,OFFSET(PLE!$G$15,$M21-$A$15,BB$13)))","v":1000000000000},{"$f":"IF(OR($D21<>\"Serviço\",AND(AUTOEVENTO=\"Manual\",$M21=$A$15),$M21>(ROW(PLE.lastrow)-ROW(PLE.firstrow))),0,\n           IF(OFFSET(PLE!$G$15,$M21-$A$15,BC$13)=\"\",10^12,OFFSET(PLE!$G$15,$M21-$A$15,BC$13)))","v":1000000000000},{"$f":"IF(OR($D21<>\"Serviço\",AND(AUTOEVENTO=\"Manual\",$M21=$A$15),$M21>(ROW(PLE.lastrow)-ROW(PLE.firstrow))),0,\n           IF(OFFSET(PLE!$G$15,$M21-$A$15,BD$13)=\"\",10^12,OFFSET(PLE!$G$15,$M21-$A$15,BD$13)))","v":1000000000000},{"$f":"IF(OR($D21<>\"Serviço\",AND(AUTOEVENTO=\"Manual\",$M21=$A$15),$M21>(ROW(PLE.lastrow)-ROW(PLE.firstrow))),0,\n           IF(OFFSET(PLE!$G$15,$M21-$A$15,BE$13)=\"\",10^12,OFFSET(PLE!$G$15,$M21-$A$15,BE$13)))","v":1000000000000},{"$f":"IF(OR($D21<>\"Serviço\",AND(AUTOEVENTO=\"Manual\",$M21=$A$15),$M21>(ROW(PLE.lastrow)-ROW(PLE.firstrow))),0,\n           IF(OFFSET(PLE!$G$15,$M21-$A$15,BF$13)=\"\",10^12,OFFSET(PLE!$G$15,$M21-$A$15,BF$13)))","v":1000000000000},{"$f":"IF(OR($D21<>\"Serviço\",AND(AUTOEVENTO=\"Manual\",$M21=$A$15),$M21>(ROW(PLE.lastrow)-ROW(PLE.firstrow))),0,\n           IF(OFFSET(PLE!$G$15,$M21-$A$15,BG$13)=\"\",10^12,OFFSET(PLE!$G$15,$M21-$A$15,BG$13)))","v":1000000000000}]
["4",{"$f":"OFFSET(ORÇAMENTO!C$15,ROW(B22)-ROW(B$15),0)","v":"S"},{"$f":"OFFSET(ORÇAMENTO!L$15,ROW(C22)-ROW(C$15),0)","v":"F"},{"$f":"OFFSET(ORÇAMENTO!N$15,ROW(D22)-ROW(D$15),0)","v":"Serviço"},{"$f":"OFFSET(ORÇAMENTO!O$15,ROW(E22)-ROW(E$15),0)","v":"1.2.3."},{"$f":"OFFSET(ORÇAMENTO!R$15,ROW(F22)-ROW(F$15),0)","v":"(abra o arquivo 'Referência 02-2026.xlsm)"},{"$f":"IF($D22<>\"Serviço\",\"\",OFFSET(ORÇAMENTO!S$15,ROW(G22)-ROW(G$15),0))","v":"M"},{"$f":"IF($D22<>\"Serviço\",0,IF(ACOMPANHAMENTO=\"BM\",ROUND(OFFSET(ORÇAMENTO!AJ$15,ROW(H22)-ROW(H$15),0),15-13*ORÇAMENTO!$AF$7),SUMPRODUCT(($Q$1:$AA$1=1)*ROUND($Q22:$AA22,15-13*ORÇAMENTO!$AF$7))))","v":578},"578 m",{"$f":"IF(OR(B22<>\"S\",CÁLCULO.FrentesPreenchidas=0),\"\",IF(AND(ACOMPANHAMENTO=\"PLE\",AUTOEVENTO=\"Manual\",OR(H22>0,ORÇAMENTO!AC22=\"QUANT.\"),OR(K22=\"\",M22=0,N22=\"\")),\"►E\",IF(AND(ACOMPANHAMENTO=\"PLE\",ORÇAMENTO!AC22=\"QUANT.\"),\"►Q\",IF(AND(ACOMPANHAMENTO=\"PLE\",H22<>SUMPRODUCT(($Q$1:$AA$1=1)*ROUND(Q22:AA22,15))),\"►S\",IF(AND(COUNTIF($P$11:$AA$11,\"▼\")=0,H22>0,I22=\"\"),\"◄M\",\"\")))))","v":""},null,".",{"$f":"IF($D22<>\"Serviço\",\"\",\n          IF(AUTOEVENTO=\"manual\",$A22,\n                IF(ISERROR(MATCH($A22,$A$15:OFFSET($A22,-1,0),0)),MAX($M$15:OFFSET(M22,-1,0))+1,\n                      INDEX($M$15:OFFSET(M22,-1,0),MATCH($A22,$A$15:OFFSET($A22,-1,0),0)))))","v":2},{"$f":"IF($D22<>\"Serviço\",\"\",\n         IF(AUTOEVENTO=\"Manual\",\n                IF($A22=0,\"<-- defina o número do agrupador\",\n                       OFFSET(EVENTOS!$D$15,$A22-$A$15,0)),\n                OFFSET($F$15,$A22,0)))","v":"ESTRUTURA E COBERTURA "},null,null,null,578,null,null,null,null,null,null,null,null,null,{"$f":"IF(AND($D22=\"Serviço\",AB$12<>0,$H22>0,OR(AUTOEVENTO<>\"manual\",$M22<>$A$15)),\n        IF(Import.TipoArredondamento<>\"TransfereGOV\",\n              ROUND(OFFSET($P22,0,AB$13),15-13*ORÇAMENTO!$AF$7)/$H22*OFFSET(ORÇAMENTO!$X$15,ROW(AB22)-ROW(AB$15),0),\n              ROUND(ROUND(OFFSET($P22,0,AB$13),15-13*ORÇAMENTO!$AF$7)*OFFSET(ORÇAMENTO!$W$15,ROW(AB22)-ROW(AB$15),0),15-13*ORÇAMENTO!$AF$11)),\n         0)","v":0},{"$f":"IF(AND($D22=\"Serviço\",AC$12<>0,$H22>0,OR(AUTOEVENTO<>\"manual\",$M22<>$A$15)),\n        IF(Import.TipoArredondamento<>\"TransfereGOV\",\n              ROUND(OFFSET($P22,0,AC$13),15-13*ORÇAMENTO!$AF$7)/$H22*OFFSET(ORÇAMENTO!$X$15,ROW(AC22)-ROW(AC$15),0),\n              ROUND(ROUND(OFFSET($P22,0,AC$13),15-13*ORÇAMENTO!$AF$7)*OFFSET(ORÇAMENTO!$W$15,ROW(AC22)-ROW(AC$15),0),15-13*ORÇAMENTO!$AF$11)),\n         0)","v":16403.64},{"$f":"IF(AND($D22=\"Serviço\",AD$12<>0,$H22>0,OR(AUTOEVENTO<>\"manual\",$M22<>$A$15)),\n        IF(Import.TipoArredondamento<>\"TransfereGOV\",\n              ROUND(OFFSET($P22,0,AD$13),15-13*ORÇAMENTO!$AF$7)/$H22*OFFSET(ORÇAMENTO!$X$15,ROW(AD22)-ROW(AD$15),0),\n              ROUND(ROUND(OFFSET($P22,0,AD$13),15-13*ORÇAMENTO!$AF$7)*OFFSET(ORÇAMENTO!$W$15,ROW(AD22)-ROW(AD$15),0),15-13*ORÇAMENTO!$AF$11)),\n         0)","v":0},{"$f":"IF(AND($D22=\"Serviço\",AE$12<>0,$H22>0,OR(AUTOEVENTO<>\"manual\",$M22<>$A$15)),\n        IF(Import.TipoArredondamento<>\"TransfereGOV\",\n              ROUND(OFFSET($P22,0,AE$13),15-13*ORÇAMENTO!$AF$7)/$H22*OFFSET(ORÇAMENTO!$X$15,ROW(AE22)-ROW(AE$15),0),\n              ROUND(ROUND(OFFSET($P22,0,AE$13),15-13*ORÇAMENTO!$AF$7)*OFFSET(ORÇAMENTO!$W$15,ROW(AE22)-ROW(AE$15),0),15-13*ORÇAMENTO!$AF$11)),\n         0)","v":0},{"$f":"IF(AND($D22=\"Serviço\",AF$12<>0,$H22>0,OR(AUTOEVENTO<>\"manual\",$M22<>$A$15)),\n        IF(Import.TipoArredondamento<>\"TransfereGOV\",\n              ROUND(OFFSET($P22,0,AF$13),15-13*ORÇAMENTO!$AF$7)/$H22*OFFSET(ORÇAMENTO!$X$15,ROW(AF22)-ROW(AF$15),0),\n              ROUND(ROUND(OFFSET($P22,0,AF$13),15-13*ORÇAMENTO!$AF$7)*OFFSET(ORÇAMENTO!$W$15,ROW(AF22)-ROW(AF$15),0),15-13*ORÇAMENTO!$AF$11)),\n         0)","v":0},{"$f":"IF(AND($D22=\"Serviço\",AG$12<>0,$H22>0,OR(AUTOEVENTO<>\"manual\",$M22<>$A$15)),\n        IF(Import.TipoArredondamento<>\"TransfereGOV\",\n              ROUND(OFFSET($P22,0,AG$13),15-13*ORÇAMENTO!$AF$7)/$H22*OFFSET(ORÇAMENTO!$X$15,ROW(AG22)-ROW(AG$15),0),\n              ROUND(ROUND(OFFSET($P22,0,AG$13),15-13*ORÇAMENTO!$AF$7)*OFFSET(ORÇAMENTO!$W$15,ROW(AG22)-ROW(AG$15),0),15-13*ORÇAMENTO!$AF$11)),\n         0)","v":0},{"$f":"IF(AND($D22=\"Serviço\",AH$12<>0,$H22>0,OR(AUTOEVENTO<>\"manual\",$M22<>$A$15)),\n        IF(Import.TipoArredondamento<>\"TransfereGOV\",\n              ROUND(OFFSET($P22,0,AH$13),15-13*ORÇAMENTO!$AF$7)/$H22*OFFSET(ORÇAMENTO!$X$15,ROW(AH22)-ROW(AH$15),0),\n              ROUND(ROUND(OFFSET($P22,0,AH$13),15-13*ORÇAMENTO!$AF$7)*OFFSET(ORÇAMENTO!$W$15,ROW(AH22)-ROW(AH$15),0),15-13*ORÇAMENTO!$AF$11)),\n         0)","v":0},{"$f":"IF(AND($D22=\"Serviço\",AI$12<>0,$H22>0,OR(AUTOEVENTO<>\"manual\",$M22<>$A$15)),\n        IF(Import.TipoArredondamento<>\"TransfereGOV\",\n              ROUND(OFFSET($P22,0,AI$13),15-13*ORÇAMENTO!$AF$7)/$H22*OFFSET(ORÇAMENTO!$X$15,ROW(AI22)-ROW(AI$15),0),\n              ROUND(ROUND(OFFSET($P22,0,AI$13),15-13*ORÇAMENTO!$AF$7)*OFFSET(ORÇAMENTO!$W$15,ROW(AI22)-ROW(AI$15),0),15-13*ORÇAMENTO!$AF$11)),\n         0)","v":0},{"$f":"IF(AND($D22=\"Serviço\",AJ$12<>0,$H22>0,OR(AUTOEVENTO<>\"manual\",$M22<>$A$15)),\n        IF(Import.TipoArredondamento<>\"TransfereGOV\",\n              ROUND(OFFSET($P22,0,AJ$13),15-13*ORÇAMENTO!$AF$7)/$H22*OFFSET(ORÇAMENTO!$X$15,ROW(AJ22)-ROW(AJ$15),0),\n              ROUND(ROUND(OFFSET($P22,0,AJ$13),15-13*ORÇAMENTO!$AF$7)*OFFSET(ORÇAMENTO!$W$15,ROW(AJ22)-ROW(AJ$15),0),15-13*ORÇAMENTO!$AF$11)),\n         0)","v":0},{"$f":"IF(AND($D22=\"Serviço\",AK$12<>0,$H22>0,OR(AUTOEVENTO<>\"manual\",$M22<>$A$15)),\n        IF(Import.TipoArredondamento<>\"TransfereGOV\",\n              ROUND(OFFSET($P22,0,AK$13),15-13*ORÇAMENTO!$AF$7)/$H22*OFFSET(ORÇAMENTO!$X$15,ROW(AK22)-ROW(AK$15),0),\n              ROUND(ROUND(OFFSET($P22,0,AK$13),15-13*ORÇAMENTO!$AF$7)*OFFSET(ORÇAMENTO!$W$15,ROW(AK22)-ROW(AK$15),0),15-13*ORÇAMENTO!$AF$11)),\n         0)","v":0},null,{"$f":"IF(OR($D22<>\"Serviço\",AND(AUTOEVENTO=\"Manual\",$M22=$A$15)),0,\n         IF(OFFSET(CRONOPLE!$F$15,$M22-$A$15,AM$13)=0,10^12,OFFSET(CRONOPLE!$F$15,$M22-$A$15,AM$13)))","v":1000000000000},{"$f":"IF(OR($D22<>\"Serviço\",AND(AUTOEVENTO=\"Manual\",$M22=$A$15)),0,\n         IF(OFFSET(CRONOPLE!$F$15,$M22-$A$15,AN$13)=0,10^12,OFFSET(CRONOPLE!$F$15,$M22-$A$15,AN$13)))","v":1},{"$f":"IF(OR($D22<>\"Serviço\",AND(AUTOEVENTO=\"Manual\",$M22=$A$15)),0,\n         IF(OFFSET(CRONOPLE!$F$15,$M22-$A$15,AO$13)=0,10^12,OFFSET(CRONOPLE!$F$15,$M22-$A$15,AO$13)))","v":2},{"$f":"IF(OR($D22<>\"Serviço\",AND(AUTOEVENTO=\"Manual\",$M22=$A$15)),0,\n         IF(OFFSET(CRONOPLE!$F$15,$M22-$A$15,AP$13)=0,10^12,OFFSET(CRONOPLE!$F$15,$M22-$A$15,AP$13)))","v":1000000000000},{"$f":"IF(OR($D22<>\"Serviço\",AND(AUTOEVENTO=\"Manual\",$M22=$A$15)),0,\n         IF(OFFSET(CRONOPLE!$F$15,$M22-$A$15,AQ$13)=0,10^12,OFFSET(CRONOPLE!$F$15,$M22-$A$15,AQ$13)))","v":1000000000000},{"$f":"IF(OR($D22<>\"Serviço\",AND(AUTOEVENTO=\"Manual\",$M22=$A$15)),0,\n         IF(OFFSET(CRONOPLE!$F$15,$M22-$A$15,AR$13)=0,10^12,OFFSET(CRONOPLE!$F$15,$M22-$A$15,AR$13)))","v":1000000000000},{"$f":"IF(OR($D22<>\"Serviço\",AND(AUTOEVENTO=\"Manual\",$M22=$A$15)),0,\n         IF(OFFSET(CRONOPLE!$F$15,$M22-$A$15,AS$13)=0,10^12,OFFSET(CRONOPLE!$F$15,$M22-$A$15,AS$13)))","v":1000000000000},{"$f":"IF(OR($D22<>\"Serviço\",AND(AUTOEVENTO=\"Manual\",$M22=$A$15)),0,\n         IF(OFFSET(CRONOPLE!$F$15,$M22-$A$15,AT$13)=0,10^12,OFFSET(CRONOPLE!$F$15,$M22-$A$15,AT$13)))","v":1000000000000},{"$f":"IF(OR($D22<>\"Serviço\",AND(AUTOEVENTO=\"Manual\",$M22=$A$15)),0,\n         IF(OFFSET(CRONOPLE!$F$15,$M22-$A$15,AU$13)=0,10^12,OFFSET(CRONOPLE!$F$15,$M22-$A$15,AU$13)))","v":1000000000000},{"$f":"IF(OR($D22<>\"Serviço\",AND(AUTOEVENTO=\"Manual\",$M22=$A$15)),0,\n         IF(OFFSET(CRONOPLE!$F$15,$M22-$A$15,AV$13)=0,10^12,OFFSET(CRONOPLE!$F$15,$M22-$A$15,AV$13)))","v":1000000000000},null,{"$f":"IF(OR($D22<>\"Serviço\",AND(AUTOEVENTO=\"Manual\",$M22=$A$15),$M22>(ROW(PLE.lastrow)-ROW(PLE.firstrow))),0,\n           IF(OFFSET(PLE!$G$15,$M22-$A$15,AX$13)=\"\",10^12,OFFSET(PLE!$G$15,$M22-$A$15,AX$13)))","v":1000000000000},{"$f":"IF(OR($D22<>\"Serviço\",AND(AUTOEVENTO=\"Manual\",$M22=$A$15),$M22>(ROW(PLE.lastrow)-ROW(PLE.firstrow))),0,\n           IF(OFFSET(PLE!$G$15,$M22-$A$15,AY$13)=\"\",10^12,OFFSET(PLE!$G$15,$M22-$A$15,AY$13)))","v":1000000000000},{"$f":"IF(OR($D22<>\"Serviço\",AND(AUTOEVENTO=\"Manual\",$M22=$A$15),$M22>(ROW(PLE.lastrow)-ROW(PLE.firstrow))),0,\n           IF(OFFSET(PLE!$G$15,$M22-$A$15,AZ$13)=\"\",10^12,OFFSET(PLE!$G$15,$M22-$A$15,AZ$13)))","v":1000000000000},{"$f":"IF(OR($D22<>\"Serviço\",AND(AUTOEVENTO=\"Manual\",$M22=$A$15),$M22>(ROW(PLE.lastrow)-ROW(PLE.firstrow))),0,\n           IF(OFFSET(PLE!$G$15,$M22-$A$15,BA$13)=\"\",10^12,OFFSET(PLE!$G$15,$M22-$A$15,BA$13)))","v":1000000000000},{"$f":"IF(OR($D22<>\"Serviço\",AND(AUTOEVENTO=\"Manual\",$M22=$A$15),$M22>(ROW(PLE.lastrow)-ROW(PLE.firstrow))),0,\n           IF(OFFSET(PLE!$G$15,$M22-$A$15,BB$13)=\"\",10^12,OFFSET(PLE!$G$15,$M22-$A$15,BB$13)))","v":1000000000000},{"$f":"IF(OR($D22<>\"Serviço\",AND(AUTOEVENTO=\"Manual\",$M22=$A$15),$M22>(ROW(PLE.lastrow)-ROW(PLE.firstrow))),0,\n           IF(OFFSET(PLE!$G$15,$M22-$A$15,BC$13)=\"\",10^12,OFFSET(PLE!$G$15,$M22-$A$15,BC$13)))","v":1000000000000},{"$f":"IF(OR($D22<>\"Serviço\",AND(AUTOEVENTO=\"Manual\",$M22=$A$15),$M22>(ROW(PLE.lastrow)-ROW(PLE.firstrow))),0,\n           IF(OFFSET(PLE!$G$15,$M22-$A$15,BD$13)=\"\",10^12,OFFSET(PLE!$G$15,$M22-$A$15,BD$13)))","v":1000000000000},{"$f":"IF(OR($D22<>\"Serviço\",AND(AUTOEVENTO=\"Manual\",$M22=$A$15),$M22>(ROW(PLE.lastrow)-ROW(PLE.firstrow))),0,\n           IF(OFFSET(PLE!$G$15,$M22-$A$15,BE$13)=\"\",10^12,OFFSET(PLE!$G$15,$M22-$A$15,BE$13)))","v":1000000000000},{"$f":"IF(OR($D22<>\"Serviço\",AND(AUTOEVENTO=\"Manual\",$M22=$A$15),$M22>(ROW(PLE.lastrow)-ROW(PLE.firstrow))),0,\n           IF(OFFSET(PLE!$G$15,$M22-$A$15,BF$13)=\"\",10^12,OFFSET(PLE!$G$15,$M22-$A$15,BF$13)))","v":1000000000000},{"$f":"IF(OR($D22<>\"Serviço\",AND(AUTOEVENTO=\"Manual\",$M22=$A$15),$M22>(ROW(PLE.lastrow)-ROW(PLE.firstrow))),0,\n           IF(OFFSET(PLE!$G$15,$M22-$A$15,BG$13)=\"\",10^12,OFFSET(PLE!$G$15,$M22-$A$15,BG$13)))","v":1000000000000}]
["4",{"$f":"OFFSET(ORÇAMENTO!C$15,ROW(B23)-ROW(B$15),0)","v":"S"},{"$f":"OFFSET(ORÇAMENTO!L$15,ROW(C23)-ROW(C$15),0)","v":"F"},{"$f":"OFFSET(ORÇAMENTO!N$15,ROW(D23)-ROW(D$15),0)","v":"Serviço"},{"$f":"OFFSET(ORÇAMENTO!O$15,ROW(E23)-ROW(E$15),0)","v":"1.2.4."},{"$f":"OFFSET(ORÇAMENTO!R$15,ROW(F23)-ROW(F$15),0)","v":"(abra o arquivo 'Referência 02-2026.xlsm)"},{"$f":"IF($D23<>\"Serviço\",\"\",OFFSET(ORÇAMENTO!S$15,ROW(G23)-ROW(G$15),0))","v":"M2"},{"$f":"IF($D23<>\"Serviço\",0,IF(ACOMPANHAMENTO=\"BM\",ROUND(OFFSET(ORÇAMENTO!AJ$15,ROW(H23)-ROW(H$15),0),15-13*ORÇAMENTO!$AF$7),SUMPRODUCT(($Q$1:$AA$1=1)*ROUND($Q23:$AA23,15-13*ORÇAMENTO!$AF$7))))","v":656},"656 M²",{"$f":"IF(OR(B23<>\"S\",CÁLCULO.FrentesPreenchidas=0),\"\",IF(AND(ACOMPANHAMENTO=\"PLE\",AUTOEVENTO=\"Manual\",OR(H23>0,ORÇAMENTO!AC23=\"QUANT.\"),OR(K23=\"\",M23=0,N23=\"\")),\"►E\",IF(AND(ACOMPANHAMENTO=\"PLE\",ORÇAMENTO!AC23=\"QUANT.\"),\"►Q\",IF(AND(ACOMPANHAMENTO=\"PLE\",H23<>SUMPRODUCT(($Q$1:$AA$1=1)*ROUND(Q23:AA23,15))),\"►S\",IF(AND(COUNTIF($P$11:$AA$11,\"▼\")=0,H23>0,I23=\"\"),\"◄M\",\"\")))))","v":""},null,".",{"$f":"IF($D23<>\"Serviço\",\"\",\n          IF(AUTOEVENTO=\"manual\",$A23,\n                IF(ISERROR(MATCH($A23,$A$15:OFFSET($A23,-1,0),0)),MAX($M$15:OFFSET(M23,-1,0))+1,\n                      INDEX($M$15:OFFSET(M23,-1,0),MATCH($A23,$A$15:OFFSET($A23,-1,0),0)))))","v":2},{"$f":"IF($D23<>\"Serviço\",\"\",\n         IF(AUTOEVENTO=\"Manual\",\n                IF($A23=0,\"<-- defina o número do agrupador\",\n                       OFFSET(EVENTOS!$D$15,$A23-$A$15,0)),\n                OFFSET($F$15,$A23,0)))","v":"ESTRUTURA E COBERTURA "},null,null,null,null,656,null,null,null,null,null,null,null,null,{"$f":"IF(AND($D23=\"Serviço\",AB$12<>0,$H23>0,OR(AUTOEVENTO<>\"manual\",$M23<>$A$15)),\n        IF(Import.TipoArredondamento<>\"TransfereGOV\",\n              ROUND(OFFSET($P23,0,AB$13),15-13*ORÇAMENTO!$AF$7)/$H23*OFFSET(ORÇAMENTO!$X$15,ROW(AB23)-ROW(AB$15),0),\n              ROUND(ROUND(OFFSET($P23,0,AB$13),15-13*ORÇAMENTO!$AF$7)*OFFSET(ORÇAMENTO!$W$15,ROW(AB23)-ROW(AB$15),0),15-13*ORÇAMENTO!$AF$11)),\n         0)","v":0},{"$f":"IF(AND($D23=\"Serviço\",AC$12<>0,$H23>0,OR(AUTOEVENTO<>\"manual\",$M23<>$A$15)),\n        IF(Import.TipoArredondamento<>\"TransfereGOV\",\n              ROUND(OFFSET($P23,0,AC$13),15-13*ORÇAMENTO!$AF$7)/$H23*OFFSET(ORÇAMENTO!$X$15,ROW(AC23)-ROW(AC$15),0),\n              ROUND(ROUND(OFFSET($P23,0,AC$13),15-13*ORÇAMENTO!$AF$7)*OFFSET(ORÇAMENTO!$W$15,ROW(AC23)-ROW(AC$15),0),15-13*ORÇAMENTO!$AF$11)),\n         0)","v":0},{"$f":"IF(AND($D23=\"Serviço\",AD$12<>0,$H23>0,OR(AUTOEVENTO<>\"manual\",$M23<>$A$15)),\n        IF(Import.TipoArredondamento<>\"TransfereGOV\",\n              ROUND(OFFSET($P23,0,AD$13),15-13*ORÇAMENTO!$AF$7)/$H23*OFFSET(ORÇAMENTO!$X$15,ROW(AD23)-ROW(AD$15),0),\n              ROUND(ROUND(OFFSET($P23,0,AD$13),15-13*ORÇAMENTO!$AF$7)*OFFSET(ORÇAMENTO!$W$15,ROW(AD23)-ROW(AD$15),0),15-13*ORÇAMENTO!$AF$11)),\n         0)","v":47750.239999999998},{"$f":"IF(AND($D23=\"Serviço\",AE$12<>0,$H23>0,OR(AUTOEVENTO<>\"manual\",$M23<>$A$15)),\n        IF(Import.TipoArredondamento<>\"TransfereGOV\",\n              ROUND(OFFSET($P23,0,AE$13),15-13*ORÇAMENTO!$AF$7)/$H23*OFFSET(ORÇAMENTO!$X$15,ROW(AE23)-ROW(AE$15),0),\n              ROUND(ROUND(OFFSET($P23,0,AE$13),15-13*ORÇAMENTO!$AF$7)*OFFSET(ORÇAMENTO!$W$15,ROW(AE23)-ROW(AE$15),0),15-13*ORÇAMENTO!$AF$11)),\n         0)","v":0},{"$f":"IF(AND($D23=\"Serviço\",AF$12<>0,$H23>0,OR(AUTOEVENTO<>\"manual\",$M23<>$A$15)),\n        IF(Import.TipoArredondamento<>\"TransfereGOV\",\n              ROUND(OFFSET($P23,0,AF$13),15-13*ORÇAMENTO!$AF$7)/$H23*OFFSET(ORÇAMENTO!$X$15,ROW(AF23)-ROW(AF$15),0),\n              ROUND(ROUND(OFFSET($P23,0,AF$13),15-13*ORÇAMENTO!$AF$7)*OFFSET(ORÇAMENTO!$W$15,ROW(AF23)-ROW(AF$15),0),15-13*ORÇAMENTO!$AF$11)),\n         0)","v":0},{"$f":"IF(AND($D23=\"Serviço\",AG$12<>0,$H23>0,OR(AUTOEVENTO<>\"manual\",$M23<>$A$15)),\n        IF(Import.TipoArredondamento<>\"TransfereGOV\",\n              ROUND(OFFSET($P23,0,AG$13),15-13*ORÇAMENTO!$AF$7)/$H23*OFFSET(ORÇAMENTO!$X$15,ROW(AG23)-ROW(AG$15),0),\n              ROUND(ROUND(OFFSET($P23,0,AG$13),15-13*ORÇAMENTO!$AF$7)*OFFSET(ORÇAMENTO!$W$15,ROW(AG23)-ROW(AG$15),0),15-13*ORÇAMENTO!$AF$11)),\n         0)","v":0},{"$f":"IF(AND($D23=\"Serviço\",AH$12<>0,$H23>0,OR(AUTOEVENTO<>\"manual\",$M23<>$A$15)),\n        IF(Import.TipoArredondamento<>\"TransfereGOV\",\n              ROUND(OFFSET($P23,0,AH$13),15-13*ORÇAMENTO!$AF$7)/$H23*OFFSET(ORÇAMENTO!$X$15,ROW(AH23)-ROW(AH$15),0),\n              ROUND(ROUND(OFFSET($P23,0,AH$13),15-13*ORÇAMENTO!$AF$7)*OFFSET(ORÇAMENTO!$W$15,ROW(AH23)-ROW(AH$15),0),15-13*ORÇAMENTO!$AF$11)),\n         0)","v":0},{"$f":"IF(AND($D23=\"Serviço\",AI$12<>0,$H23>0,OR(AUTOEVENTO<>\"manual\",$M23<>$A$15)),\n        IF(Import.TipoArredondamento<>\"TransfereGOV\",\n              ROUND(OFFSET($P23,0,AI$13),15-13*ORÇAMENTO!$AF$7)/$H23*OFFSET(ORÇAMENTO!$X$15,ROW(AI23)-ROW(AI$15),0),\n              ROUND(ROUND(OFFSET($P23,0,AI$13),15-13*ORÇAMENTO!$AF$7)*OFFSET(ORÇAMENTO!$W$15,ROW(AI23)-ROW(AI$15),0),15-13*ORÇAMENTO!$AF$11)),\n         0)","v":0},{"$f":"IF(AND($D23=\"Serviço\",AJ$12<>0,$H23>0,OR(AUTOEVENTO<>\"manual\",$M23<>$A$15)),\n        IF(Import.TipoArredondamento<>\"TransfereGOV\",\n              ROUND(OFFSET($P23,0,AJ$13),15-13*ORÇAMENTO!$AF$7)/$H23*OFFSET(ORÇAMENTO!$X$15,ROW(AJ23)-ROW(AJ$15),0),\n              ROUND(ROUND(OFFSET($P23,0,AJ$13),15-13*ORÇAMENTO!$AF$7)*OFFSET(ORÇAMENTO!$W$15,ROW(AJ23)-ROW(AJ$15),0),15-13*ORÇAMENTO!$AF$11)),\n         0)","v":0},{"$f":"IF(AND($D23=\"Serviço\",AK$12<>0,$H23>0,OR(AUTOEVENTO<>\"manual\",$M23<>$A$15)),\n        IF(Import.TipoArredondamento<>\"TransfereGOV\",\n              ROUND(OFFSET($P23,0,AK$13),15-13*ORÇAMENTO!$AF$7)/$H23*OFFSET(ORÇAMENTO!$X$15,ROW(AK23)-ROW(AK$15),0),\n              ROUND(ROUND(OFFSET($P23,0,AK$13),15-13*ORÇAMENTO!$AF$7)*OFFSET(ORÇAMENTO!$W$15,ROW(AK23)-ROW(AK$15),0),15-13*ORÇAMENTO!$AF$11)),\n         0)","v":0},null,{"$f":"IF(OR($D23<>\"Serviço\",AND(AUTOEVENTO=\"Manual\",$M23=$A$15)),0,\n         IF(OFFSET(CRONOPLE!$F$15,$M23-$A$15,AM$13)=0,10^12,OFFSET(CRONOPLE!$F$15,$M23-$A$15,AM$13)))","v":1000000000000},{"$f":"IF(OR($D23<>\"Serviço\",AND(AUTOEVENTO=\"Manual\",$M23=$A$15)),0,\n         IF(OFFSET(CRONOPLE!$F$15,$M23-$A$15,AN$13)=0,10^12,OFFSET(CRONOPLE!$F$15,$M23-$A$15,AN$13)))","v":1},{"$f":"IF(OR($D23<>\"Serviço\",AND(AUTOEVENTO=\"Manual\",$M23=$A$15)),0,\n         IF(OFFSET(CRONOPLE!$F$15,$M23-$A$15,AO$13)=0,10^12,OFFSET(CRONOPLE!$F$15,$M23-$A$15,AO$13)))","v":2},{"$f":"IF(OR($D23<>\"Serviço\",AND(AUTOEVENTO=\"Manual\",$M23=$A$15)),0,\n         IF(OFFSET(CRONOPLE!$F$15,$M23-$A$15,AP$13)=0,10^12,OFFSET(CRONOPLE!$F$15,$M23-$A$15,AP$13)))","v":1000000000000},{"$f":"IF(OR($D23<>\"Serviço\",AND(AUTOEVENTO=\"Manual\",$M23=$A$15)),0,\n         IF(OFFSET(CRONOPLE!$F$15,$M23-$A$15,AQ$13)=0,10^12,OFFSET(CRONOPLE!$F$15,$M23-$A$15,AQ$13)))","v":1000000000000},{"$f":"IF(OR($D23<>\"Serviço\",AND(AUTOEVENTO=\"Manual\",$M23=$A$15)),0,\n         IF(OFFSET(CRONOPLE!$F$15,$M23-$A$15,AR$13)=0,10^12,OFFSET(CRONOPLE!$F$15,$M23-$A$15,AR$13)))","v":1000000000000},{"$f":"IF(OR($D23<>\"Serviço\",AND(AUTOEVENTO=\"Manual\",$M23=$A$15)),0,\n         IF(OFFSET(CRONOPLE!$F$15,$M23-$A$15,AS$13)=0,10^12,OFFSET(CRONOPLE!$F$15,$M23-$A$15,AS$13)))","v":1000000000000},{"$f":"IF(OR($D23<>\"Serviço\",AND(AUTOEVENTO=\"Manual\",$M23=$A$15)),0,\n         IF(OFFSET(CRONOPLE!$F$15,$M23-$A$15,AT$13)=0,10^12,OFFSET(CRONOPLE!$F$15,$M23-$A$15,AT$13)))","v":1000000000000},{"$f":"IF(OR($D23<>\"Serviço\",AND(AUTOEVENTO=\"Manual\",$M23=$A$15)),0,\n         IF(OFFSET(CRONOPLE!$F$15,$M23-$A$15,AU$13)=0,10^12,OFFSET(CRONOPLE!$F$15,$M23-$A$15,AU$13)))","v":1000000000000},{"$f":"IF(OR($D23<>\"Serviço\",AND(AUTOEVENTO=\"Manual\",$M23=$A$15)),0,\n         IF(OFFSET(CRONOPLE!$F$15,$M23-$A$15,AV$13)=0,10^12,OFFSET(CRONOPLE!$F$15,$M23-$A$15,AV$13)))","v":1000000000000},null,{"$f":"IF(OR($D23<>\"Serviço\",AND(AUTOEVENTO=\"Manual\",$M23=$A$15),$M23>(ROW(PLE.lastrow)-ROW(PLE.firstrow))),0,\n           IF(OFFSET(PLE!$G$15,$M23-$A$15,AX$13)=\"\",10^12,OFFSET(PLE!$G$15,$M23-$A$15,AX$13)))","v":1000000000000},{"$f":"IF(OR($D23<>\"Serviço\",AND(AUTOEVENTO=\"Manual\",$M23=$A$15),$M23>(ROW(PLE.lastrow)-ROW(PLE.firstrow))),0,\n           IF(OFFSET(PLE!$G$15,$M23-$A$15,AY$13)=\"\",10^12,OFFSET(PLE!$G$15,$M23-$A$15,AY$13)))","v":1000000000000},{"$f":"IF(OR($D23<>\"Serviço\",AND(AUTOEVENTO=\"Manual\",$M23=$A$15),$M23>(ROW(PLE.lastrow)-ROW(PLE.firstrow))),0,\n           IF(OFFSET(PLE!$G$15,$M23-$A$15,AZ$13)=\"\",10^12,OFFSET(PLE!$G$15,$M23-$A$15,AZ$13)))","v":1000000000000},{"$f":"IF(OR($D23<>\"Serviço\",AND(AUTOEVENTO=\"Manual\",$M23=$A$15),$M23>(ROW(PLE.lastrow)-ROW(PLE.firstrow))),0,\n           IF(OFFSET(PLE!$G$15,$M23-$A$15,BA$13)=\"\",10^12,OFFSET(PLE!$G$15,$M23-$A$15,BA$13)))","v":1000000000000},{"$f":"IF(OR($D23<>\"Serviço\",AND(AUTOEVENTO=\"Manual\",$M23=$A$15),$M23>(ROW(PLE.lastrow)-ROW(PLE.firstrow))),0,\n           IF(OFFSET(PLE!$G$15,$M23-$A$15,BB$13)=\"\",10^12,OFFSET(PLE!$G$15,$M23-$A$15,BB$13)))","v":1000000000000},{"$f":"IF(OR($D23<>\"Serviço\",AND(AUTOEVENTO=\"Manual\",$M23=$A$15),$M23>(ROW(PLE.lastrow)-ROW(PLE.firstrow))),0,\n           IF(OFFSET(PLE!$G$15,$M23-$A$15,BC$13)=\"\",10^12,OFFSET(PLE!$G$15,$M23-$A$15,BC$13)))","v":1000000000000},{"$f":"IF(OR($D23<>\"Serviço\",AND(AUTOEVENTO=\"Manual\",$M23=$A$15),$M23>(ROW(PLE.lastrow)-ROW(PLE.firstrow))),0,\n           IF(OFFSET(PLE!$G$15,$M23-$A$15,BD$13)=\"\",10^12,OFFSET(PLE!$G$15,$M23-$A$15,BD$13)))","v":1000000000000},{"$f":"IF(OR($D23<>\"Serviço\",AND(AUTOEVENTO=\"Manual\",$M23=$A$15),$M23>(ROW(PLE.lastrow)-ROW(PLE.firstrow))),0,\n           IF(OFFSET(PLE!$G$15,$M23-$A$15,BE$13)=\"\",10^12,OFFSET(PLE!$G$15,$M23-$A$15,BE$13)))","v":1000000000000},{"$f":"IF(OR($D23<>\"Serviço\",AND(AUTOEVENTO=\"Manual\",$M23=$A$15),$M23>(ROW(PLE.lastrow)-ROW(PLE.firstrow))),0,\n           IF(OFFSET(PLE!$G$15,$M23-$A$15,BF$13)=\"\",10^12,OFFSET(PLE!$G$15,$M23-$A$15,BF$13)))","v":1000000000000},{"$f":"IF(OR($D23<>\"Serviço\",AND(AUTOEVENTO=\"Manual\",$M23=$A$15),$M23>(ROW(PLE.lastrow)-ROW(PLE.firstrow))),0,\n           IF(OFFSET(PLE!$G$15,$M23-$A$15,BG$13)=\"\",10^12,OFFSET(PLE!$G$15,$M23-$A$15,BG$13)))","v":1000000000000}]
["4",{"$f":"OFFSET(ORÇAMENTO!C$15,ROW(B24)-ROW(B$15),0)","v":"S"},{"$f":"OFFSET(ORÇAMENTO!L$15,ROW(C24)-ROW(C$15),0)","v":"F"},{"$f":"OFFSET(ORÇAMENTO!N$15,ROW(D24)-ROW(D$15),0)","v":"Serviço"},{"$f":"OFFSET(ORÇAMENTO!O$15,ROW(E24)-ROW(E$15),0)","v":"1.2.5."},{"$f":"OFFSET(ORÇAMENTO!R$15,ROW(F24)-ROW(F$15),0)","v":"(abra o arquivo 'Referência 02-2026.xlsm)"},{"$f":"IF($D24<>\"Serviço\",\"\",OFFSET(ORÇAMENTO!S$15,ROW(G24)-ROW(G$15),0))","v":"-"},{"$f":"IF($D24<>\"Serviço\",0,IF(ACOMPANHAMENTO=\"BM\",ROUND(OFFSET(ORÇAMENTO!AJ$15,ROW(H24)-ROW(H$15),0),15-13*ORÇAMENTO!$AF$7),SUMPRODUCT(($Q$1:$AA$1=1)*ROUND($Q24:$AA24,15-13*ORÇAMENTO!$AF$7))))","v":70},"70 metros",{"$f":"IF(OR(B24<>\"S\",CÁLCULO.FrentesPreenchidas=0),\"\",IF(AND(ACOMPANHAMENTO=\"PLE\",AUTOEVENTO=\"Manual\",OR(H24>0,ORÇAMENTO!AC24=\"QUANT.\"),OR(K24=\"\",M24=0,N24=\"\")),\"►E\",IF(AND(ACOMPANHAMENTO=\"PLE\",ORÇAMENTO!AC24=\"QUANT.\"),\"►Q\",IF(AND(ACOMPANHAMENTO=\"PLE\",H24<>SUMPRODUCT(($Q$1:$AA$1=1)*ROUND(Q24:AA24,15))),\"►S\",IF(AND(COUNTIF($P$11:$AA$11,\"▼\")=0,H24>0,I24=\"\"),\"◄M\",\"\")))))","v":""},null,".",{"$f":"IF($D24<>\"Serviço\",\"\",\n          IF(AUTOEVENTO=\"manual\",$A24,\n                IF(ISERROR(MATCH($A24,$A$15:OFFSET($A24,-1,0),0)),MAX($M$15:OFFSET(M24,-1,0))+1,\n                      INDEX($M$15:OFFSET(M24,-1,0),MATCH($A24,$A$15:OFFSET($A24,-1,0),0)))))","v":2},{"$f":"IF($D24<>\"Serviço\",\"\",\n         IF(AUTOEVENTO=\"Manual\",\n                IF($A24=0,\"<-- defina o número do agrupador\",\n                       OFFSET(EVENTOS!$D$15,$A24-$A$15,0)),\n                OFFSET($F$15,$A24,0)))","v":"ESTRUTURA E COBERTURA "},null,null,null,null,70,null,null,null,null,null,null,null,null,{"$f":"IF(AND($D24=\"Serviço\",AB$12<>0,$H24>0,OR(AUTOEVENTO<>\"manual\",$M24<>$A$15)),\n        IF(Import.TipoArredondamento<>\"TransfereGOV\",\n              ROUND(OFFSET($P24,0,AB$13),15-13*ORÇAMENTO!$AF$7)/$H24*OFFSET(ORÇAMENTO!$X$15,ROW(AB24)-ROW(AB$15),0),\n              ROUND(ROUND(OFFSET($P24,0,AB$13),15-13*ORÇAMENTO!$AF$7)*OFFSET(ORÇAMENTO!$W$15,ROW(AB24)-ROW(AB$15),0),15-13*ORÇAMENTO!$AF$11)),\n         0)","v":0},{"$f":"IF(AND($D24=\"Serviço\",AC$12<>0,$H24>0,OR(AUTOEVENTO<>\"manual\",$M24<>$A$15)),\n        IF(Import.TipoArredondamento<>\"TransfereGOV\",\n              ROUND(OFFSET($P24,0,AC$13),15-13*ORÇAMENTO!$AF$7)/$H24*OFFSET(ORÇAMENTO!$X$15,ROW(AC24)-ROW(AC$15),0),\n              ROUND(ROUND(OFFSET($P24,0,AC$13),15-13*ORÇAMENTO!$AF$7)*OFFSET(ORÇAMENTO!$W$15,ROW(AC24)-ROW(AC$15),0),15-13*ORÇAMENTO!$AF$11)),\n         0)","v":0},{"$f":"IF(AND($D24=\"Serviço\",AD$12<>0,$H24>0,OR(AUTOEVENTO<>\"manual\",$M24<>$A$15)),\n        IF(Import.TipoArredondamento<>\"TransfereGOV\",\n              ROUND(OFFSET($P24,0,AD$13),15-13*ORÇAMENTO!$AF$7)/$H24*OFFSET(ORÇAMENTO!$X$15,ROW(AD24)-ROW(AD$15),0),\n              ROUND(ROUND(OFFSET($P24,0,AD$13),15-13*ORÇAMENTO!$AF$7)*OFFSET(ORÇAMENTO!$W$15,ROW(AD24)-ROW(AD$15),0),15-13*ORÇAMENTO!$AF$11)),\n         0)","v":6494.6},{"$f":"IF(AND($D24=\"Serviço\",AE$12<>0,$H24>0,OR(AUTOEVENTO<>\"manual\",$M24<>$A$15)),\n        IF(Import.TipoArredondamento<>\"TransfereGOV\",\n              ROUND(OFFSET($P24,0,AE$13),15-13*ORÇAMENTO!$AF$7)/$H24*OFFSET(ORÇAMENTO!$X$15,ROW(AE24)-ROW(AE$15),0),\n              ROUND(ROUND(OFFSET($P24,0,AE$13),15-13*ORÇAMENTO!$AF$7)*OFFSET(ORÇAMENTO!$W$15,ROW(AE24)-ROW(AE$15),0),15-13*ORÇAMENTO!$AF$11)),\n         0)","v":0},{"$f":"IF(AND($D24=\"Serviço\",AF$12<>0,$H24>0,OR(AUTOEVENTO<>\"manual\",$M24<>$A$15)),\n        IF(Import.TipoArredondamento<>\"TransfereGOV\",\n              ROUND(OFFSET($P24,0,AF$13),15-13*ORÇAMENTO!$AF$7)/$H24*OFFSET(ORÇAMENTO!$X$15,ROW(AF24)-ROW(AF$15),0),\n              ROUND(ROUND(OFFSET($P24,0,AF$13),15-13*ORÇAMENTO!$AF$7)*OFFSET(ORÇAMENTO!$W$15,ROW(AF24)-ROW(AF$15),0),15-13*ORÇAMENTO!$AF$11)),\n         0)","v":0},{"$f":"IF(AND($D24=\"Serviço\",AG$12<>0,$H24>0,OR(AUTOEVENTO<>\"manual\",$M24<>$A$15)),\n        IF(Import.TipoArredondamento<>\"TransfereGOV\",\n              ROUND(OFFSET($P24,0,AG$13),15-13*ORÇAMENTO!$AF$7)/$H24*OFFSET(ORÇAMENTO!$X$15,ROW(AG24)-ROW(AG$15),0),\n              ROUND(ROUND(OFFSET($P24,0,AG$13),15-13*ORÇAMENTO!$AF$7)*OFFSET(ORÇAMENTO!$W$15,ROW(AG24)-ROW(AG$15),0),15-13*ORÇAMENTO!$AF$11)),\n         0)","v":0},{"$f":"IF(AND($D24=\"Serviço\",AH$12<>0,$H24>0,OR(AUTOEVENTO<>\"manual\",$M24<>$A$15)),\n        IF(Import.TipoArredondamento<>\"TransfereGOV\",\n              ROUND(OFFSET($P24,0,AH$13),15-13*ORÇAMENTO!$AF$7)/$H24*OFFSET(ORÇAMENTO!$X$15,ROW(AH24)-ROW(AH$15),0),\n              ROUND(ROUND(OFFSET($P24,0,AH$13),15-13*ORÇAMENTO!$AF$7)*OFFSET(ORÇAMENTO!$W$15,ROW(AH24)-ROW(AH$15),0),15-13*ORÇAMENTO!$AF$11)),\n         0)","v":0},{"$f":"IF(AND($D24=\"Serviço\",AI$12<>0,$H24>0,OR(AUTOEVENTO<>\"manual\",$M24<>$A$15)),\n        IF(Import.TipoArredondamento<>\"TransfereGOV\",\n              ROUND(OFFSET($P24,0,AI$13),15-13*ORÇAMENTO!$AF$7)/$H24*OFFSET(ORÇAMENTO!$X$15,ROW(AI24)-ROW(AI$15),0),\n              ROUND(ROUND(OFFSET($P24,0,AI$13),15-13*ORÇAMENTO!$AF$7)*OFFSET(ORÇAMENTO!$W$15,ROW(AI24)-ROW(AI$15),0),15-13*ORÇAMENTO!$AF$11)),\n         0)","v":0},{"$f":"IF(AND($D24=\"Serviço\",AJ$12<>0,$H24>0,OR(AUTOEVENTO<>\"manual\",$M24<>$A$15)),\n        IF(Import.TipoArredondamento<>\"TransfereGOV\",\n              ROUND(OFFSET($P24,0,AJ$13),15-13*ORÇAMENTO!$AF$7)/$H24*OFFSET(ORÇAMENTO!$X$15,ROW(AJ24)-ROW(AJ$15),0),\n              ROUND(ROUND(OFFSET($P24,0,AJ$13),15-13*ORÇAMENTO!$AF$7)*OFFSET(ORÇAMENTO!$W$15,ROW(AJ24)-ROW(AJ$15),0),15-13*ORÇAMENTO!$AF$11)),\n         0)","v":0},{"$f":"IF(AND($D24=\"Serviço\",AK$12<>0,$H24>0,OR(AUTOEVENTO<>\"manual\",$M24<>$A$15)),\n        IF(Import.TipoArredondamento<>\"TransfereGOV\",\n              ROUND(OFFSET($P24,0,AK$13),15-13*ORÇAMENTO!$AF$7)/$H24*OFFSET(ORÇAMENTO!$X$15,ROW(AK24)-ROW(AK$15),0),\n              ROUND(ROUND(OFFSET($P24,0,AK$13),15-13*ORÇAMENTO!$AF$7)*OFFSET(ORÇAMENTO!$W$15,ROW(AK24)-ROW(AK$15),0),15-13*ORÇAMENTO!$AF$11)),\n         0)","v":0},null,{"$f":"IF(OR($D24<>\"Serviço\",AND(AUTOEVENTO=\"Manual\",$M24=$A$15)),0,\n         IF(OFFSET(CRONOPLE!$F$15,$M24-$A$15,AM$13)=0,10^12,OFFSET(CRONOPLE!$F$15,$M24-$A$15,AM$13)))","v":1000000000000},{"$f":"IF(OR($D24<>\"Serviço\",AND(AUTOEVENTO=\"Manual\",$M24=$A$15)),0,\n         IF(OFFSET(CRONOPLE!$F$15,$M24-$A$15,AN$13)=0,10^12,OFFSET(CRONOPLE!$F$15,$M24-$A$15,AN$13)))","v":1},{"$f":"IF(OR($D24<>\"Serviço\",AND(AUTOEVENTO=\"Manual\",$M24=$A$15)),0,\n         IF(OFFSET(CRONOPLE!$F$15,$M24-$A$15,AO$13)=0,10^12,OFFSET(CRONOPLE!$F$15,$M24-$A$15,AO$13)))","v":2},{"$f":"IF(OR($D24<>\"Serviço\",AND(AUTOEVENTO=\"Manual\",$M24=$A$15)),0,\n         IF(OFFSET(CRONOPLE!$F$15,$M24-$A$15,AP$13)=0,10^12,OFFSET(CRONOPLE!$F$15,$M24-$A$15,AP$13)))","v":1000000000000},{"$f":"IF(OR($D24<>\"Serviço\",AND(AUTOEVENTO=\"Manual\",$M24=$A$15)),0,\n         IF(OFFSET(CRONOPLE!$F$15,$M24-$A$15,AQ$13)=0,10^12,OFFSET(CRONOPLE!$F$15,$M24-$A$15,AQ$13)))","v":1000000000000},{"$f":"IF(OR($D24<>\"Serviço\",AND(AUTOEVENTO=\"Manual\",$M24=$A$15)),0,\n         IF(OFFSET(CRONOPLE!$F$15,$M24-$A$15,AR$13)=0,10^12,OFFSET(CRONOPLE!$F$15,$M24-$A$15,AR$13)))","v":1000000000000},{"$f":"IF(OR($D24<>\"Serviço\",AND(AUTOEVENTO=\"Manual\",$M24=$A$15)),0,\n         IF(OFFSET(CRONOPLE!$F$15,$M24-$A$15,AS$13)=0,10^12,OFFSET(CRONOPLE!$F$15,$M24-$A$15,AS$13)))","v":1000000000000},{"$f":"IF(OR($D24<>\"Serviço\",AND(AUTOEVENTO=\"Manual\",$M24=$A$15)),0,\n         IF(OFFSET(CRONOPLE!$F$15,$M24-$A$15,AT$13)=0,10^12,OFFSET(CRONOPLE!$F$15,$M24-$A$15,AT$13)))","v":1000000000000},{"$f":"IF(OR($D24<>\"Serviço\",AND(AUTOEVENTO=\"Manual\",$M24=$A$15)),0,\n         IF(OFFSET(CRONOPLE!$F$15,$M24-$A$15,AU$13)=0,10^12,OFFSET(CRONOPLE!$F$15,$M24-$A$15,AU$13)))","v":1000000000000},{"$f":"IF(OR($D24<>\"Serviço\",AND(AUTOEVENTO=\"Manual\",$M24=$A$15)),0,\n         IF(OFFSET(CRONOPLE!$F$15,$M24-$A$15,AV$13)=0,10^12,OFFSET(CRONOPLE!$F$15,$M24-$A$15,AV$13)))","v":1000000000000},null,{"$f":"IF(OR($D24<>\"Serviço\",AND(AUTOEVENTO=\"Manual\",$M24=$A$15),$M24>(ROW(PLE.lastrow)-ROW(PLE.firstrow))),0,\n           IF(OFFSET(PLE!$G$15,$M24-$A$15,AX$13)=\"\",10^12,OFFSET(PLE!$G$15,$M24-$A$15,AX$13)))","v":1000000000000},{"$f":"IF(OR($D24<>\"Serviço\",AND(AUTOEVENTO=\"Manual\",$M24=$A$15),$M24>(ROW(PLE.lastrow)-ROW(PLE.firstrow))),0,\n           IF(OFFSET(PLE!$G$15,$M24-$A$15,AY$13)=\"\",10^12,OFFSET(PLE!$G$15,$M24-$A$15,AY$13)))","v":1000000000000},{"$f":"IF(OR($D24<>\"Serviço\",AND(AUTOEVENTO=\"Manual\",$M24=$A$15),$M24>(ROW(PLE.lastrow)-ROW(PLE.firstrow))),0,\n           IF(OFFSET(PLE!$G$15,$M24-$A$15,AZ$13)=\"\",10^12,OFFSET(PLE!$G$15,$M24-$A$15,AZ$13)))","v":1000000000000},{"$f":"IF(OR($D24<>\"Serviço\",AND(AUTOEVENTO=\"Manual\",$M24=$A$15),$M24>(ROW(PLE.lastrow)-ROW(PLE.firstrow))),0,\n           IF(OFFSET(PLE!$G$15,$M24-$A$15,BA$13)=\"\",10^12,OFFSET(PLE!$G$15,$M24-$A$15,BA$13)))","v":1000000000000},{"$f":"IF(OR($D24<>\"Serviço\",AND(AUTOEVENTO=\"Manual\",$M24=$A$15),$M24>(ROW(PLE.lastrow)-ROW(PLE.firstrow))),0,\n           IF(OFFSET(PLE!$G$15,$M24-$A$15,BB$13)=\"\",10^12,OFFSET(PLE!$G$15,$M24-$A$15,BB$13)))","v":1000000000000},{"$f":"IF(OR($D24<>\"Serviço\",AND(AUTOEVENTO=\"Manual\",$M24=$A$15),$M24>(ROW(PLE.lastrow)-ROW(PLE.firstrow))),0,\n           IF(OFFSET(PLE!$G$15,$M24-$A$15,BC$13)=\"\",10^12,OFFSET(PLE!$G$15,$M24-$A$15,BC$13)))","v":1000000000000},{"$f":"IF(OR($D24<>\"Serviço\",AND(AUTOEVENTO=\"Manual\",$M24=$A$15),$M24>(ROW(PLE.lastrow)-ROW(PLE.firstrow))),0,\n           IF(OFFSET(PLE!$G$15,$M24-$A$15,BD$13)=\"\",10^12,OFFSET(PLE!$G$15,$M24-$A$15,BD$13)))","v":1000000000000},{"$f":"IF(OR($D24<>\"Serviço\",AND(AUTOEVENTO=\"Manual\",$M24=$A$15),$M24>(ROW(PLE.lastrow)-ROW(PLE.firstrow))),0,\n           IF(OFFSET(PLE!$G$15,$M24-$A$15,BE$13)=\"\",10^12,OFFSET(PLE!$G$15,$M24-$A$15,BE$13)))","v":1000000000000},{"$f":"IF(OR($D24<>\"Serviço\",AND(AUTOEVENTO=\"Manual\",$M24=$A$15),$M24>(ROW(PLE.lastrow)-ROW(PLE.firstrow))),0,\n           IF(OFFSET(PLE!$G$15,$M24-$A$15,BF$13)=\"\",10^12,OFFSET(PLE!$G$15,$M24-$A$15,BF$13)))","v":1000000000000},{"$f":"IF(OR($D24<>\"Serviço\",AND(AUTOEVENTO=\"Manual\",$M24=$A$15),$M24>(ROW(PLE.lastrow)-ROW(PLE.firstrow))),0,\n           IF(OFFSET(PLE!$G$15,$M24-$A$15,BG$13)=\"\",10^12,OFFSET(PLE!$G$15,$M24-$A$15,BG$13)))","v":1000000000000}]
["4",{"$f":"OFFSET(ORÇAMENTO!C$15,ROW(B25)-ROW(B$15),0)","v":"S"},{"$f":"OFFSET(ORÇAMENTO!L$15,ROW(C25)-ROW(C$15),0)","v":"F"},{"$f":"OFFSET(ORÇAMENTO!N$15,ROW(D25)-ROW(D$15),0)","v":"Serviço"},{"$f":"OFFSET(ORÇAMENTO!O$15,ROW(E25)-ROW(E$15),0)","v":"1.2.6."},{"$f":"OFFSET(ORÇAMENTO!R$15,ROW(F25)-ROW(F$15),0)","v":"(abra o arquivo 'Referência 02-2026.xlsm)"},{"$f":"IF($D25<>\"Serviço\",\"\",OFFSET(ORÇAMENTO!S$15,ROW(G25)-ROW(G$15),0))","v":"-"},{"$f":"IF($D25<>\"Serviço\",0,IF(ACOMPANHAMENTO=\"BM\",ROUND(OFFSET(ORÇAMENTO!AJ$15,ROW(H25)-ROW(H$15),0),15-13*ORÇAMENTO!$AF$7),SUMPRODUCT(($Q$1:$AA$1=1)*ROUND($Q25:$AA25,15-13*ORÇAMENTO!$AF$7))))","v":48},"48 metros",{"$f":"IF(OR(B25<>\"S\",CÁLCULO.FrentesPreenchidas=0),\"\",IF(AND(ACOMPANHAMENTO=\"PLE\",AUTOEVENTO=\"Manual\",OR(H25>0,ORÇAMENTO!AC25=\"QUANT.\"),OR(K25=\"\",M25=0,N25=\"\")),\"►E\",IF(AND(ACOMPANHAMENTO=\"PLE\",ORÇAMENTO!AC25=\"QUANT.\"),\"►Q\",IF(AND(ACOMPANHAMENTO=\"PLE\",H25<>SUMPRODUCT(($Q$1:$AA$1=1)*ROUND(Q25:AA25,15))),\"►S\",IF(AND(COUNTIF($P$11:$AA$11,\"▼\")=0,H25>0,I25=\"\"),\"◄M\",\"\")))))","v":""},null,".",{"$f":"IF($D25<>\"Serviço\",\"\",\n          IF(AUTOEVENTO=\"manual\",$A25,\n                IF(ISERROR(MATCH($A25,$A$15:OFFSET($A25,-1,0),0)),MAX($M$15:OFFSET(M25,-1,0))+1,\n                      INDEX($M$15:OFFSET(M25,-1,0),MATCH($A25,$A$15:OFFSET($A25,-1,0),0)))))","v":2},{"$f":"IF($D25<>\"Serviço\",\"\",\n         IF(AUTOEVENTO=\"Manual\",\n                IF($A25=0,\"<-- defina o número do agrupador\",\n                       OFFSET(EVENTOS!$D$15,$A25-$A$15,0)),\n                OFFSET($F$15,$A25,0)))","v":"ESTRUTURA E COBERTURA "},null,null,null,null,48,null,null,null,null,null,null,null,null,{"$f":"IF(AND($D25=\"Serviço\",AB$12<>0,$H25>0,OR(AUTOEVENTO<>\"manual\",$M25<>$A$15)),\n        IF(Import.TipoArredondamento<>\"TransfereGOV\",\n              ROUND(OFFSET($P25,0,AB$13),15-13*ORÇAMENTO!$AF$7)/$H25*OFFSET(ORÇAMENTO!$X$15,ROW(AB25)-ROW(AB$15),0),\n              ROUND(ROUND(OFFSET($P25,0,AB$13),15-13*ORÇAMENTO!$AF$7)*OFFSET(ORÇAMENTO!$W$15,ROW(AB25)-ROW(AB$15),0),15-13*ORÇAMENTO!$AF$11)),\n         0)","v":0},{"$f":"IF(AND($D25=\"Serviço\",AC$12<>0,$H25>0,OR(AUTOEVENTO<>\"manual\",$M25<>$A$15)),\n        IF(Import.TipoArredondamento<>\"TransfereGOV\",\n              ROUND(OFFSET($P25,0,AC$13),15-13*ORÇAMENTO!$AF$7)/$H25*OFFSET(ORÇAMENTO!$X$15,ROW(AC25)-ROW(AC$15),0),\n              ROUND(ROUND(OFFSET($P25,0,AC$13),15-13*ORÇAMENTO!$AF$7)*OFFSET(ORÇAMENTO!$W$15,ROW(AC25)-ROW(AC$15),0),15-13*ORÇAMENTO!$AF$11)),\n         0)","v":0},{"$f":"IF(AND($D25=\"Serviço\",AD$12<>0,$H25>0,OR(AUTOEVENTO<>\"manual\",$M25<>$A$15)),\n        IF(Import.TipoArredondamento<>\"TransfereGOV\",\n              ROUND(OFFSET($P25,0,AD$13),15-13*ORÇAMENTO!$AF$7)/$H25*OFFSET(ORÇAMENTO!$X$15,ROW(AD25)-ROW(AD$15),0),\n              ROUND(ROUND(OFFSET($P25,0,AD$13),15-13*ORÇAMENTO!$AF$7)*OFFSET(ORÇAMENTO!$W$15,ROW(AD25)-ROW(AD$15),0),15-13*ORÇAMENTO!$AF$11)),\n         0)","v":1940.64},{"$f":"IF(AND($D25=\"Serviço\",AE$12<>0,$H25>0,OR(AUTOEVENTO<>\"manual\",$M25<>$A$15)),\n        IF(Import.TipoArredondamento<>\"TransfereGOV\",\n              ROUND(OFFSET($P25,0,AE$13),15-13*ORÇAMENTO!$AF$7)/$H25*OFFSET(ORÇAMENTO!$X$15,ROW(AE25)-ROW(AE$15),0),\n              ROUND(ROUND(OFFSET($P25,0,AE$13),15-13*ORÇAMENTO!$AF$7)*OFFSET(ORÇAMENTO!$W$15,ROW(AE25)-ROW(AE$15),0),15-13*ORÇAMENTO!$AF$11)),\n         0)","v":0},{"$f":"IF(AND($D25=\"Serviço\",AF$12<>0,$H25>0,OR(AUTOEVENTO<>\"manual\",$M25<>$A$15)),\n        IF(Import.TipoArredondamento<>\"TransfereGOV\",\n              ROUND(OFFSET($P25,0,AF$13),15-13*ORÇAMENTO!$AF$7)/$H25*OFFSET(ORÇAMENTO!$X$15,ROW(AF25)-ROW(AF$15),0),\n              ROUND(ROUND(OFFSET($P25,0,AF$13),15-13*ORÇAMENTO!$AF$7)*OFFSET(ORÇAMENTO!$W$15,ROW(AF25)-ROW(AF$15),0),15-13*ORÇAMENTO!$AF$11)),\n         0)","v":0},{"$f":"IF(AND($D25=\"Serviço\",AG$12<>0,$H25>0,OR(AUTOEVENTO<>\"manual\",$M25<>$A$15)),\n        IF(Import.TipoArredondamento<>\"TransfereGOV\",\n              ROUND(OFFSET($P25,0,AG$13),15-13*ORÇAMENTO!$AF$7)/$H25*OFFSET(ORÇAMENTO!$X$15,ROW(AG25)-ROW(AG$15),0),\n              ROUND(ROUND(OFFSET($P25,0,AG$13),15-13*ORÇAMENTO!$AF$7)*OFFSET(ORÇAMENTO!$W$15,ROW(AG25)-ROW(AG$15),0),15-13*ORÇAMENTO!$AF$11)),\n         0)","v":0},{"$f":"IF(AND($D25=\"Serviço\",AH$12<>0,$H25>0,OR(AUTOEVENTO<>\"manual\",$M25<>$A$15)),\n        IF(Import.TipoArredondamento<>\"TransfereGOV\",\n              ROUND(OFFSET($P25,0,AH$13),15-13*ORÇAMENTO!$AF$7)/$H25*OFFSET(ORÇAMENTO!$X$15,ROW(AH25)-ROW(AH$15),0),\n              ROUND(ROUND(OFFSET($P25,0,AH$13),15-13*ORÇAMENTO!$AF$7)*OFFSET(ORÇAMENTO!$W$15,ROW(AH25)-ROW(AH$15),0),15-13*ORÇAMENTO!$AF$11)),\n         0)","v":0},{"$f":"IF(AND($D25=\"Serviço\",AI$12<>0,$H25>0,OR(AUTOEVENTO<>\"manual\",$M25<>$A$15)),\n        IF(Import.TipoArredondamento<>\"TransfereGOV\",\n              ROUND(OFFSET($P25,0,AI$13),15-13*ORÇAMENTO!$AF$7)/$H25*OFFSET(ORÇAMENTO!$X$15,ROW(AI25)-ROW(AI$15),0),\n              ROUND(ROUND(OFFSET($P25,0,AI$13),15-13*ORÇAMENTO!$AF$7)*OFFSET(ORÇAMENTO!$W$15,ROW(AI25)-ROW(AI$15),0),15-13*ORÇAMENTO!$AF$11)),\n         0)","v":0},{"$f":"IF(AND($D25=\"Serviço\",AJ$12<>0,$H25>0,OR(AUTOEVENTO<>\"manual\",$M25<>$A$15)),\n        IF(Import.TipoArredondamento<>\"TransfereGOV\",\n              ROUND(OFFSET($P25,0,AJ$13),15-13*ORÇAMENTO!$AF$7)/$H25*OFFSET(ORÇAMENTO!$X$15,ROW(AJ25)-ROW(AJ$15),0),\n              ROUND(ROUND(OFFSET($P25,0,AJ$13),15-13*ORÇAMENTO!$AF$7)*OFFSET(ORÇAMENTO!$W$15,ROW(AJ25)-ROW(AJ$15),0),15-13*ORÇAMENTO!$AF$11)),\n         0)","v":0},{"$f":"IF(AND($D25=\"Serviço\",AK$12<>0,$H25>0,OR(AUTOEVENTO<>\"manual\",$M25<>$A$15)),\n        IF(Import.TipoArredondamento<>\"TransfereGOV\",\n              ROUND(OFFSET($P25,0,AK$13),15-13*ORÇAMENTO!$AF$7)/$H25*OFFSET(ORÇAMENTO!$X$15,ROW(AK25)-ROW(AK$15),0),\n              ROUND(ROUND(OFFSET($P25,0,AK$13),15-13*ORÇAMENTO!$AF$7)*OFFSET(ORÇAMENTO!$W$15,ROW(AK25)-ROW(AK$15),0),15-13*ORÇAMENTO!$AF$11)),\n         0)","v":0},null,{"$f":"IF(OR($D25<>\"Serviço\",AND(AUTOEVENTO=\"Manual\",$M25=$A$15)),0,\n         IF(OFFSET(CRONOPLE!$F$15,$M25-$A$15,AM$13)=0,10^12,OFFSET(CRONOPLE!$F$15,$M25-$A$15,AM$13)))","v":1000000000000},{"$f":"IF(OR($D25<>\"Serviço\",AND(AUTOEVENTO=\"Manual\",$M25=$A$15)),0,\n         IF(OFFSET(CRONOPLE!$F$15,$M25-$A$15,AN$13)=0,10^12,OFFSET(CRONOPLE!$F$15,$M25-$A$15,AN$13)))","v":1},{"$f":"IF(OR($D25<>\"Serviço\",AND(AUTOEVENTO=\"Manual\",$M25=$A$15)),0,\n         IF(OFFSET(CRONOPLE!$F$15,$M25-$A$15,AO$13)=0,10^12,OFFSET(CRONOPLE!$F$15,$M25-$A$15,AO$13)))","v":2},{"$f":"IF(OR($D25<>\"Serviço\",AND(AUTOEVENTO=\"Manual\",$M25=$A$15)),0,\n         IF(OFFSET(CRONOPLE!$F$15,$M25-$A$15,AP$13)=0,10^12,OFFSET(CRONOPLE!$F$15,$M25-$A$15,AP$13)))","v":1000000000000},{"$f":"IF(OR($D25<>\"Serviço\",AND(AUTOEVENTO=\"Manual\",$M25=$A$15)),0,\n         IF(OFFSET(CRONOPLE!$F$15,$M25-$A$15,AQ$13)=0,10^12,OFFSET(CRONOPLE!$F$15,$M25-$A$15,AQ$13)))","v":1000000000000},{"$f":"IF(OR($D25<>\"Serviço\",AND(AUTOEVENTO=\"Manual\",$M25=$A$15)),0,\n         IF(OFFSET(CRONOPLE!$F$15,$M25-$A$15,AR$13)=0,10^12,OFFSET(CRONOPLE!$F$15,$M25-$A$15,AR$13)))","v":1000000000000},{"$f":"IF(OR($D25<>\"Serviço\",AND(AUTOEVENTO=\"Manual\",$M25=$A$15)),0,\n         IF(OFFSET(CRONOPLE!$F$15,$M25-$A$15,AS$13)=0,10^12,OFFSET(CRONOPLE!$F$15,$M25-$A$15,AS$13)))","v":1000000000000},{"$f":"IF(OR($D25<>\"Serviço\",AND(AUTOEVENTO=\"Manual\",$M25=$A$15)),0,\n         IF(OFFSET(CRONOPLE!$F$15,$M25-$A$15,AT$13)=0,10^12,OFFSET(CRONOPLE!$F$15,$M25-$A$15,AT$13)))","v":1000000000000},{"$f":"IF(OR($D25<>\"Serviço\",AND(AUTOEVENTO=\"Manual\",$M25=$A$15)),0,\n         IF(OFFSET(CRONOPLE!$F$15,$M25-$A$15,AU$13)=0,10^12,OFFSET(CRONOPLE!$F$15,$M25-$A$15,AU$13)))","v":1000000000000},{"$f":"IF(OR($D25<>\"Serviço\",AND(AUTOEVENTO=\"Manual\",$M25=$A$15)),0,\n         IF(OFFSET(CRONOPLE!$F$15,$M25-$A$15,AV$13)=0,10^12,OFFSET(CRONOPLE!$F$15,$M25-$A$15,AV$13)))","v":1000000000000},null,{"$f":"IF(OR($D25<>\"Serviço\",AND(AUTOEVENTO=\"Manual\",$M25=$A$15),$M25>(ROW(PLE.lastrow)-ROW(PLE.firstrow))),0,\n           IF(OFFSET(PLE!$G$15,$M25-$A$15,AX$13)=\"\",10^12,OFFSET(PLE!$G$15,$M25-$A$15,AX$13)))","v":1000000000000},{"$f":"IF(OR($D25<>\"Serviço\",AND(AUTOEVENTO=\"Manual\",$M25=$A$15),$M25>(ROW(PLE.lastrow)-ROW(PLE.firstrow))),0,\n           IF(OFFSET(PLE!$G$15,$M25-$A$15,AY$13)=\"\",10^12,OFFSET(PLE!$G$15,$M25-$A$15,AY$13)))","v":1000000000000},{"$f":"IF(OR($D25<>\"Serviço\",AND(AUTOEVENTO=\"Manual\",$M25=$A$15),$M25>(ROW(PLE.lastrow)-ROW(PLE.firstrow))),0,\n           IF(OFFSET(PLE!$G$15,$M25-$A$15,AZ$13)=\"\",10^12,OFFSET(PLE!$G$15,$M25-$A$15,AZ$13)))","v":1000000000000},{"$f":"IF(OR($D25<>\"Serviço\",AND(AUTOEVENTO=\"Manual\",$M25=$A$15),$M25>(ROW(PLE.lastrow)-ROW(PLE.firstrow))),0,\n           IF(OFFSET(PLE!$G$15,$M25-$A$15,BA$13)=\"\",10^12,OFFSET(PLE!$G$15,$M25-$A$15,BA$13)))","v":1000000000000},{"$f":"IF(OR($D25<>\"Serviço\",AND(AUTOEVENTO=\"Manual\",$M25=$A$15),$M25>(ROW(PLE.lastrow)-ROW(PLE.firstrow))),0,\n           IF(OFFSET(PLE!$G$15,$M25-$A$15,BB$13)=\"\",10^12,OFFSET(PLE!$G$15,$M25-$A$15,BB$13)))","v":1000000000000},{"$f":"IF(OR($D25<>\"Serviço\",AND(AUTOEVENTO=\"Manual\",$M25=$A$15),$M25>(ROW(PLE.lastrow)-ROW(PLE.firstrow))),0,\n           IF(OFFSET(PLE!$G$15,$M25-$A$15,BC$13)=\"\",10^12,OFFSET(PLE!$G$15,$M25-$A$15,BC$13)))","v":1000000000000},{"$f":"IF(OR($D25<>\"Serviço\",AND(AUTOEVENTO=\"Manual\",$M25=$A$15),$M25>(ROW(PLE.lastrow)-ROW(PLE.firstrow))),0,\n           IF(OFFSET(PLE!$G$15,$M25-$A$15,BD$13)=\"\",10^12,OFFSET(PLE!$G$15,$M25-$A$15,BD$13)))","v":1000000000000},{"$f":"IF(OR($D25<>\"Serviço\",AND(AUTOEVENTO=\"Manual\",$M25=$A$15),$M25>(ROW(PLE.lastrow)-ROW(PLE.firstrow))),0,\n           IF(OFFSET(PLE!$G$15,$M25-$A$15,BE$13)=\"\",10^12,OFFSET(PLE!$G$15,$M25-$A$15,BE$13)))","v":1000000000000},{"$f":"IF(OR($D25<>\"Serviço\",AND(AUTOEVENTO=\"Manual\",$M25=$A$15),$M25>(ROW(PLE.lastrow)-ROW(PLE.firstrow))),0,\n           IF(OFFSET(PLE!$G$15,$M25-$A$15,BF$13)=\"\",10^12,OFFSET(PLE!$G$15,$M25-$A$15,BF$13)))","v":1000000000000},{"$f":"IF(OR($D25<>\"Serviço\",AND(AUTOEVENTO=\"Manual\",$M25=$A$15),$M25>(ROW(PLE.lastrow)-ROW(PLE.firstrow))),0,\n           IF(OFFSET(PLE!$G$15,$M25-$A$15,BG$13)=\"\",10^12,OFFSET(PLE!$G$15,$M25-$A$15,BG$13)))","v":1000000000000}]
["4",{"$f":"OFFSET(ORÇAMENTO!C$15,ROW(B26)-ROW(B$15),0)","v":"S"},{"$f":"OFFSET(ORÇAMENTO!L$15,ROW(C26)-ROW(C$15),0)","v":"F"},{"$f":"OFFSET(ORÇAMENTO!N$15,ROW(D26)-ROW(D$15),0)","v":"Serviço"},{"$f":"OFFSET(ORÇAMENTO!O$15,ROW(E26)-ROW(E$15),0)","v":"1.2.7."},{"$f":"OFFSET(ORÇAMENTO!R$15,ROW(F26)-ROW(F$15),0)","v":"MÃO DE OBRA P/ MONTAGEM DA ESTRUTURA"},{"$f":"IF($D26<>\"Serviço\",\"\",OFFSET(ORÇAMENTO!S$15,ROW(G26)-ROW(G$15),0))","v":"M2"},{"$f":"IF($D26<>\"Serviço\",0,IF(ACOMPANHAMENTO=\"BM\",ROUND(OFFSET(ORÇAMENTO!AJ$15,ROW(H26)-ROW(H$15),0),15-13*ORÇAMENTO!$AF$7),SUMPRODUCT(($Q$1:$AA$1=1)*ROUND($Q26:$AA26,15-13*ORÇAMENTO!$AF$7))))","v":612},"612 m²",{"$f":"IF(OR(B26<>\"S\",CÁLCULO.FrentesPreenchidas=0),\"\",IF(AND(ACOMPANHAMENTO=\"PLE\",AUTOEVENTO=\"Manual\",OR(H26>0,ORÇAMENTO!AC26=\"QUANT.\"),OR(K26=\"\",M26=0,N26=\"\")),\"►E\",IF(AND(ACOMPANHAMENTO=\"PLE\",ORÇAMENTO!AC26=\"QUANT.\"),\"►Q\",IF(AND(ACOMPANHAMENTO=\"PLE\",H26<>SUMPRODUCT(($Q$1:$AA$1=1)*ROUND(Q26:AA26,15))),\"►S\",IF(AND(COUNTIF($P$11:$AA$11,\"▼\")=0,H26>0,I26=\"\"),\"◄M\",\"\")))))","v":""},null,".",{"$f":"IF($D26<>\"Serviço\",\"\",\n          IF(AUTOEVENTO=\"manual\",$A26,\n                IF(ISERROR(MATCH($A26,$A$15:OFFSET($A26,-1,0),0)),MAX($M$15:OFFSET(M26,-1,0))+1,\n                      INDEX($M$15:OFFSET(M26,-1,0),MATCH($A26,$A$15:OFFSET($A26,-1,0),0)))))","v":2},{"$f":"IF($D26<>\"Serviço\",\"\",\n         IF(AUTOEVENTO=\"Manual\",\n                IF($A26=0,\"<-- defina o número do agrupador\",\n                       OFFSET(EVENTOS!$D$15,$A26-$A$15,0)),\n                OFFSET($F$15,$A26,0)))","v":"ESTRUTURA E COBERTURA "},null,null,null,null,612,null,null,null,null,null,null,null,null,{"$f":"IF(AND($D26=\"Serviço\",AB$12<>0,$H26>0,OR(AUTOEVENTO<>\"manual\",$M26<>$A$15)),\n        IF(Import.TipoArredondamento<>\"TransfereGOV\",\n              ROUND(OFFSET($P26,0,AB$13),15-13*ORÇAMENTO!$AF$7)/$H26*OFFSET(ORÇAMENTO!$X$15,ROW(AB26)-ROW(AB$15),0),\n              ROUND(ROUND(OFFSET($P26,0,AB$13),15-13*ORÇAMENTO!$AF$7)*OFFSET(ORÇAMENTO!$W$15,ROW(AB26)-ROW(AB$15),0),15-13*ORÇAMENTO!$AF$11)),\n         0)","v":0},{"$f":"IF(AND($D26=\"Serviço\",AC$12<>0,$H26>0,OR(AUTOEVENTO<>\"manual\",$M26<>$A$15)),\n        IF(Import.TipoArredondamento<>\"TransfereGOV\",\n              ROUND(OFFSET($P26,0,AC$13),15-13*ORÇAMENTO!$AF$7)/$H26*OFFSET(ORÇAMENTO!$X$15,ROW(AC26)-ROW(AC$15),0),\n              ROUND(ROUND(OFFSET($P26,0,AC$13),15-13*ORÇAMENTO!$AF$7)*OFFSET(ORÇAMENTO!$W$15,ROW(AC26)-ROW(AC$15),0),15-13*ORÇAMENTO!$AF$11)),\n         0)","v":0},{"$f":"IF(AND($D26=\"Serviço\",AD$12<>0,$H26>0,OR(AUTOEVENTO<>\"manual\",$M26<>$A$15)),\n        IF(Import.TipoArredondamento<>\"TransfereGOV\",\n              ROUND(OFFSET($P26,0,AD$13),15-13*ORÇAMENTO!$AF$7)/$H26*OFFSET(ORÇAMENTO!$X$15,ROW(AD26)-ROW(AD$15),0),\n              ROUND(ROUND(OFFSET($P26,0,AD$13),15-13*ORÇAMENTO!$AF$7)*OFFSET(ORÇAMENTO!$W$15,ROW(AD26)-ROW(AD$15),0),15-13*ORÇAMENTO!$AF$11)),\n         0)","v":18880.2},{"$f":"IF(AND($D26=\"Serviço\",AE$12<>0,$H26>0,OR(AUTOEVENTO<>\"manual\",$M26<>$A$15)),\n        IF(Import.TipoArredondamento<>\"TransfereGOV\",\n              ROUND(OFFSET($P26,0,AE$13),15-13*ORÇAMENTO!$AF$7)/$H26*OFFSET(ORÇAMENTO!$X$15,ROW(AE26)-ROW(AE$15),0),\n              ROUND(ROUND(OFFSET($P26,0,AE$13),15-13*ORÇAMENTO!$AF$7)*OFFSET(ORÇAMENTO!$W$15,ROW(AE26)-ROW(AE$15),0),15-13*ORÇAMENTO!$AF$11)),\n         0)","v":0},{"$f":"IF(AND($D26=\"Serviço\",AF$12<>0,$H26>0,OR(AUTOEVENTO<>\"manual\",$M26<>$A$15)),\n        IF(Import.TipoArredondamento<>\"TransfereGOV\",\n              ROUND(OFFSET($P26,0,AF$13),15-13*ORÇAMENTO!$AF$7)/$H26*OFFSET(ORÇAMENTO!$X$15,ROW(AF26)-ROW(AF$15),0),\n              ROUND(ROUND(OFFSET($P26,0,AF$13),15-13*ORÇAMENTO!$AF$7)*OFFSET(ORÇAMENTO!$W$15,ROW(AF26)-ROW(AF$15),0),15-13*ORÇAMENTO!$AF$11)),\n         0)","v":0},{"$f":"IF(AND($D26=\"Serviço\",AG$12<>0,$H26>0,OR(AUTOEVENTO<>\"manual\",$M26<>$A$15)),\n        IF(Import.TipoArredondamento<>\"TransfereGOV\",\n              ROUND(OFFSET($P26,0,AG$13),15-13*ORÇAMENTO!$AF$7)/$H26*OFFSET(ORÇAMENTO!$X$15,ROW(AG26)-ROW(AG$15),0),\n              ROUND(ROUND(OFFSET($P26,0,AG$13),15-13*ORÇAMENTO!$AF$7)*OFFSET(ORÇAMENTO!$W$15,ROW(AG26)-ROW(AG$15),0),15-13*ORÇAMENTO!$AF$11)),\n         0)","v":0},{"$f":"IF(AND($D26=\"Serviço\",AH$12<>0,$H26>0,OR(AUTOEVENTO<>\"manual\",$M26<>$A$15)),\n        IF(Import.TipoArredondamento<>\"TransfereGOV\",\n              ROUND(OFFSET($P26,0,AH$13),15-13*ORÇAMENTO!$AF$7)/$H26*OFFSET(ORÇAMENTO!$X$15,ROW(AH26)-ROW(AH$15),0),\n              ROUND(ROUND(OFFSET($P26,0,AH$13),15-13*ORÇAMENTO!$AF$7)*OFFSET(ORÇAMENTO!$W$15,ROW(AH26)-ROW(AH$15),0),15-13*ORÇAMENTO!$AF$11)),\n         0)","v":0},{"$f":"IF(AND($D26=\"Serviço\",AI$12<>0,$H26>0,OR(AUTOEVENTO<>\"manual\",$M26<>$A$15)),\n        IF(Import.TipoArredondamento<>\"TransfereGOV\",\n              ROUND(OFFSET($P26,0,AI$13),15-13*ORÇAMENTO!$AF$7)/$H26*OFFSET(ORÇAMENTO!$X$15,ROW(AI26)-ROW(AI$15),0),\n              ROUND(ROUND(OFFSET($P26,0,AI$13),15-13*ORÇAMENTO!$AF$7)*OFFSET(ORÇAMENTO!$W$15,ROW(AI26)-ROW(AI$15),0),15-13*ORÇAMENTO!$AF$11)),\n         0)","v":0},{"$f":"IF(AND($D26=\"Serviço\",AJ$12<>0,$H26>0,OR(AUTOEVENTO<>\"manual\",$M26<>$A$15)),\n        IF(Import.TipoArredondamento<>\"TransfereGOV\",\n              ROUND(OFFSET($P26,0,AJ$13),15-13*ORÇAMENTO!$AF$7)/$H26*OFFSET(ORÇAMENTO!$X$15,ROW(AJ26)-ROW(AJ$15),0),\n              ROUND(ROUND(OFFSET($P26,0,AJ$13),15-13*ORÇAMENTO!$AF$7)*OFFSET(ORÇAMENTO!$W$15,ROW(AJ26)-ROW(AJ$15),0),15-13*ORÇAMENTO!$AF$11)),\n         0)","v":0},{"$f":"IF(AND($D26=\"Serviço\",AK$12<>0,$H26>0,OR(AUTOEVENTO<>\"manual\",$M26<>$A$15)),\n        IF(Import.TipoArredondamento<>\"TransfereGOV\",\n              ROUND(OFFSET($P26,0,AK$13),15-13*ORÇAMENTO!$AF$7)/$H26*OFFSET(ORÇAMENTO!$X$15,ROW(AK26)-ROW(AK$15),0),\n              ROUND(ROUND(OFFSET($P26,0,AK$13),15-13*ORÇAMENTO!$AF$7)*OFFSET(ORÇAMENTO!$W$15,ROW(AK26)-ROW(AK$15),0),15-13*ORÇAMENTO!$AF$11)),\n         0)","v":0},null,{"$f":"IF(OR($D26<>\"Serviço\",AND(AUTOEVENTO=\"Manual\",$M26=$A$15)),0,\n         IF(OFFSET(CRONOPLE!$F$15,$M26-$A$15,AM$13)=0,10^12,OFFSET(CRONOPLE!$F$15,$M26-$A$15,AM$13)))","v":1000000000000},{"$f":"IF(OR($D26<>\"Serviço\",AND(AUTOEVENTO=\"Manual\",$M26=$A$15)),0,\n         IF(OFFSET(CRONOPLE!$F$15,$M26-$A$15,AN$13)=0,10^12,OFFSET(CRONOPLE!$F$15,$M26-$A$15,AN$13)))","v":1},{"$f":"IF(OR($D26<>\"Serviço\",AND(AUTOEVENTO=\"Manual\",$M26=$A$15)),0,\n         IF(OFFSET(CRONOPLE!$F$15,$M26-$A$15,AO$13)=0,10^12,OFFSET(CRONOPLE!$F$15,$M26-$A$15,AO$13)))","v":2},{"$f":"IF(OR($D26<>\"Serviço\",AND(AUTOEVENTO=\"Manual\",$M26=$A$15)),0,\n         IF(OFFSET(CRONOPLE!$F$15,$M26-$A$15,AP$13)=0,10^12,OFFSET(CRONOPLE!$F$15,$M26-$A$15,AP$13)))","v":1000000000000},{"$f":"IF(OR($D26<>\"Serviço\",AND(AUTOEVENTO=\"Manual\",$M26=$A$15)),0,\n         IF(OFFSET(CRONOPLE!$F$15,$M26-$A$15,AQ$13)=0,10^12,OFFSET(CRONOPLE!$F$15,$M26-$A$15,AQ$13)))","v":1000000000000},{"$f":"IF(OR($D26<>\"Serviço\",AND(AUTOEVENTO=\"Manual\",$M26=$A$15)),0,\n         IF(OFFSET(CRONOPLE!$F$15,$M26-$A$15,AR$13)=0,10^12,OFFSET(CRONOPLE!$F$15,$M26-$A$15,AR$13)))","v":1000000000000},{"$f":"IF(OR($D26<>\"Serviço\",AND(AUTOEVENTO=\"Manual\",$M26=$A$15)),0,\n         IF(OFFSET(CRONOPLE!$F$15,$M26-$A$15,AS$13)=0,10^12,OFFSET(CRONOPLE!$F$15,$M26-$A$15,AS$13)))","v":1000000000000},{"$f":"IF(OR($D26<>\"Serviço\",AND(AUTOEVENTO=\"Manual\",$M26=$A$15)),0,\n         IF(OFFSET(CRONOPLE!$F$15,$M26-$A$15,AT$13)=0,10^12,OFFSET(CRONOPLE!$F$15,$M26-$A$15,AT$13)))","v":1000000000000},{"$f":"IF(OR($D26<>\"Serviço\",AND(AUTOEVENTO=\"Manual\",$M26=$A$15)),0,\n         IF(OFFSET(CRONOPLE!$F$15,$M26-$A$15,AU$13)=0,10^12,OFFSET(CRONOPLE!$F$15,$M26-$A$15,AU$13)))","v":1000000000000},{"$f":"IF(OR($D26<>\"Serviço\",AND(AUTOEVENTO=\"Manual\",$M26=$A$15)),0,\n         IF(OFFSET(CRONOPLE!$F$15,$M26-$A$15,AV$13)=0,10^12,OFFSET(CRONOPLE!$F$15,$M26-$A$15,AV$13)))","v":1000000000000},null,{"$f":"IF(OR($D26<>\"Serviço\",AND(AUTOEVENTO=\"Manual\",$M26=$A$15),$M26>(ROW(PLE.lastrow)-ROW(PLE.firstrow))),0,\n           IF(OFFSET(PLE!$G$15,$M26-$A$15,AX$13)=\"\",10^12,OFFSET(PLE!$G$15,$M26-$A$15,AX$13)))","v":1000000000000},{"$f":"IF(OR($D26<>\"Serviço\",AND(AUTOEVENTO=\"Manual\",$M26=$A$15),$M26>(ROW(PLE.lastrow)-ROW(PLE.firstrow))),0,\n           IF(OFFSET(PLE!$G$15,$M26-$A$15,AY$13)=\"\",10^12,OFFSET(PLE!$G$15,$M26-$A$15,AY$13)))","v":1000000000000},{"$f":"IF(OR($D26<>\"Serviço\",AND(AUTOEVENTO=\"Manual\",$M26=$A$15),$M26>(ROW(PLE.lastrow)-ROW(PLE.firstrow))),0,\n           IF(OFFSET(PLE!$G$15,$M26-$A$15,AZ$13)=\"\",10^12,OFFSET(PLE!$G$15,$M26-$A$15,AZ$13)))","v":1000000000000},{"$f":"IF(OR($D26<>\"Serviço\",AND(AUTOEVENTO=\"Manual\",$M26=$A$15),$M26>(ROW(PLE.lastrow)-ROW(PLE.firstrow))),0,\n           IF(OFFSET(PLE!$G$15,$M26-$A$15,BA$13)=\"\",10^12,OFFSET(PLE!$G$15,$M26-$A$15,BA$13)))","v":1000000000000},{"$f":"IF(OR($D26<>\"Serviço\",AND(AUTOEVENTO=\"Manual\",$M26=$A$15),$M26>(ROW(PLE.lastrow)-ROW(PLE.firstrow))),0,\n           IF(OFFSET(PLE!$G$15,$M26-$A$15,BB$13)=\"\",10^12,OFFSET(PLE!$G$15,$M26-$A$15,BB$13)))","v":1000000000000},{"$f":"IF(OR($D26<>\"Serviço\",AND(AUTOEVENTO=\"Manual\",$M26=$A$15),$M26>(ROW(PLE.lastrow)-ROW(PLE.firstrow))),0,\n           IF(OFFSET(PLE!$G$15,$M26-$A$15,BC$13)=\"\",10^12,OFFSET(PLE!$G$15,$M26-$A$15,BC$13)))","v":1000000000000},{"$f":"IF(OR($D26<>\"Serviço\",AND(AUTOEVENTO=\"Manual\",$M26=$A$15),$M26>(ROW(PLE.lastrow)-ROW(PLE.firstrow))),0,\n           IF(OFFSET(PLE!$G$15,$M26-$A$15,BD$13)=\"\",10^12,OFFSET(PLE!$G$15,$M26-$A$15,BD$13)))","v":1000000000000},{"$f":"IF(OR($D26<>\"Serviço\",AND(AUTOEVENTO=\"Manual\",$M26=$A$15),$M26>(ROW(PLE.lastrow)-ROW(PLE.firstrow))),0,\n           IF(OFFSET(PLE!$G$15,$M26-$A$15,BE$13)=\"\",10^12,OFFSET(PLE!$G$15,$M26-$A$15,BE$13)))","v":1000000000000},{"$f":"IF(OR($D26<>\"Serviço\",AND(AUTOEVENTO=\"Manual\",$M26=$A$15),$M26>(ROW(PLE.lastrow)-ROW(PLE.firstrow))),0,\n           IF(OFFSET(PLE!$G$15,$M26-$A$15,BF$13)=\"\",10^12,OFFSET(PLE!$G$15,$M26-$A$15,BF$13)))","v":1000000000000},{"$f":"IF(OR($D26<>\"Serviço\",AND(AUTOEVENTO=\"Manual\",$M26=$A$15),$M26>(ROW(PLE.lastrow)-ROW(PLE.firstrow))),0,\n           IF(OFFSET(PLE!$G$15,$M26-$A$15,BG$13)=\"\",10^12,OFFSET(PLE!$G$15,$M26-$A$15,BG$13)))","v":1000000000000}]
[null,{"$f":"OFFSET(ORÇAMENTO!C$15,ROW(B27)-ROW(B$15),0)","v":-1},{"$f":"OFFSET(ORÇAMENTO!L$15,ROW(C27)-ROW(C$15),0)","v":"F"},"LOTE",null,null,null,null,null,null,null,"."]
[]
[]
[]
[null,null,null,null,null,{"$f":"Import.Município","v":"SÃO VALENTIM/RS"}]
[null,null,null,null,null,"Local",null,null,"Responsável Técnico",null,null,null,null,null,null,null,null,null,null,"Responsável Técnico"]
[null,null,null,null,null,null,null,null,{"$f":"OFFSET(Import.RespOrçamento,0,-1) & \" \" & Import.RespOrçamento","v":"Nome: "},null,null,null,null,null,null,null,null,null,null,{"$f":"OFFSET(Import.RespOrçamento,0,-1) & \" \" & Import.RespOrçamento","v":"Nome: "}]
[null,null,null,null,null,{"$f":"DADOS!$C$25","v":"00:00:00"},null,null,"CREA/CAU: ",null,null,null,null,null,null,null,null,null,null,"CREA/CAU: "]
[null,null,null,null,null,"Data",null,null,"ART/RRT: ",null,null,null,null,null,null,null,null,null,null,"ART/RRT: "]

{"sheet":"CRONOPLE","index":7,"n_rows":32,"n_cols":31,"rows_kept":32,"cut":false,"hidden":false,"merged":[[23,25,23,26],[22,7,22,8],[22,9,22,10],[22,11,22,12],[22,13,22,14],[23,7,23,8],[23,15,23,16],[23,17,23,18],[23,19,23,20],[22,2,23,2],[24,7,24,8],[24,9,24,10],[22,23,22,24],[30,1,30,2],[23,21,23,22],[23,23,23,24],[24,11,24,12],[24,13,24,14],[22,15,22,16],[22,17,22,18],[22,21,22,22],[23,11,23,12],[22,19,22,20],[23,9,23,10],[23,13,23,14],[21,19,21,20],[21,21,21,22],[20,11,20,12],[20,13,20,14],[21,11,21,12],[21,13,21,14],[20,15,20,16],[20,17,20,18],[20,19,20,20],[19,7,19,8],[19,9,19,10],[19,11,19,12],[19,19,19,20],[7,1,7,2],[11,1,12,1],[11,2,12,2],[19,13,19,14],[19,15,19,16],[19,17,19,18],[21,27,21,28],[20,27,20,28],[20,29,20,30],[21,29,21,30],[21,25,21,26],[20,2,21,2],[20,7,20,8],[20,9,20,10],[21,7,21,8],[21,9,21,10],[19,29,19,30],[20,23,20,24],[20,25,20,26],[20,21,20,22],[19,27,19,28],[19,23,19,24],[19,25,19,26],[19,21,19,22],[24,27,24,28],[21,17,21,18],[21,23,21,24],[21,15,21,16],[22,29,22,30],[24,15,24,16],[23,29,23,30],[24,29,24,30],[24,17,24,18],[24,19,24,20],[24,21,24,22],[24,23,24,24],[24,25,24,26],[23,27,23,28],[22,25,22,26],[22,27,22,28],[1,28,1,30],[3,1,3,3],[3,6,3,8],[3,9,3,11],[4,1,4,3],[4,6,4,8],[4,9,4,11],[4,12,4,30]]}
[{"$f":"IF(AUTOEVENTO=\"Manual\",IF(EVENTOS!$F1>0,\"F\",\"\"),IF(AND(B1>0,B1<=MAX(CÁLCULO!$M$15:$M$27)),\"F\",\"\"))","v":{"$error":"#REF!"}},{"$f":"OFFSET(B1,-1,0)+1","v":{"$error":"#REF!"}},{"$f":"IF(AUTOEVENTO=\"Manual\",IF($B1>0,OFFSET(EVENTOS!$D$15,$B1-$B$15,0),0),IF(B1<=MAX(CÁLCULO!$M$15:$M$27),VLOOKUP($B1,CÁLCULO!$M$15:$N$27,2,FALSE),0))","v":{"$error":"#REF!"}},null,null,{"$f":"IF($C1=0,\"\",CONCATENATE($B1,\". \",$C1))","v":{"$error":"#REF!"}}]
[null,null,null,null,null,null,"CRONOGRAMA PREVISTO PLE",null,null,null,null,null,null,null,null,null,null,null,null,null,null,null,null,null,null,null,null,null,"Grau de Sigilo\n#PUBLICO"]
[]
[null,"PROPONENTE / TOMADOR",null,null,null,null,"Nº OPERAÇÃO",null,null,"Nº TransfereGOV",null,null,"APELIDO EMPREENDIMENTO"]
[null,{"$f":"Import.Proponente","v":"MUNICÍPIO DE SÃO VALENTIN"},null,null,null,null,{"$f":"Import.CR","v":0},null,null,{"$f":"Import.SICONV","v":0},null,null,{"$f":"Import.Apelido","v":"COBERTURA RUA PEDRO DASSOLER"}]
[null,{"$f":"IF(ACOMPANHAMENTO=\"BM\",\"NO ACOMPANHAMENTO POR BM, UTILIZE A ABA CRONO\",\n  IF(MAX($B$14:$B$18)<MAX(CÁLCULO!$M$15:$M$27),\"ERRO: NÚMERO DE EVENTOS INSUFICIENTE, CLIQUE EM ATUALIZAR LINHAS\",\n  IF(ROUND(OFFSET(CRONO!$AG$33,0,-1),2)<>CRONO!$R$24,\"ERRO: CRONOGRAMA NÃO FECHA 100%\",\"\")))","v":""}]
[null,{"$f":"IF(AdmLocal=\"Automática\",\"\",\"1. Selecione o Título do Evento da Administração Local:\")","v":"1. Selecione o Título do Evento da Administração Local:"}]
[{"$f":"MID(Import.EventoAdmLocal,1,SEARCH(\".\",Import.EventoAdmLocal)-1)","v":"2"},"2. ESTRUTURA E COBERTURA ",null,{"$f":"IF($B$7=\"\",\"\",IF(AND($B$15=0,$B$8=\"\"),\"◄ Não foi indicado o Evento de Administração Local\",IF(ISERROR(MATCH(Import.EventoAdmLocal,$F$15:$F$18,0)),\"◄ Selecione um Título de Evento válido para a Administração Local\",\"\")))","v":""}]
[]
[{"$f":"MATCH(VALUE(A8),CÁLCULO!$M$15:$M$27,0)-2","v":4},{"$f":"CONCATENATE(IF(AdmLocal=\"Automática\",1,2),\". Digite nas células em amarelo o número do período em que os eventos serão concluídos:\")","v":"2. Digite nas células em amarelo o número do período em que os eventos serão concluídos:"}]
["FILTRO",null,null,null,{"$f":"IF(E$12>CÁLCULO.FrentesPreenchidas,\"\",OFFSET(CÁLCULO!$P$12,0,E$12))","v":"PILARES PRÉ MOLDADO 20X25 CM"},null,{"$f":"IF(G$12>CÁLCULO.FrentesPreenchidas,\"\",OFFSET(CÁLCULO!$P$12,0,G$12))","v":"PILARES PRÉ MOLDADO 20X25 CM"},{"$f":"IF(H$12>CÁLCULO.FrentesPreenchidas,\"\",OFFSET(CÁLCULO!$P$12,0,H$12))","v":"ESTRUTURA E COBERTURA"},{"$f":"IF(I$12>CÁLCULO.FrentesPreenchidas,\"\",OFFSET(CÁLCULO!$P$12,0,I$12))","v":"ESTRUTURA E COBERTURA"},{"$f":"IF(J$12>CÁLCULO.FrentesPreenchidas,\"\",OFFSET(CÁLCULO!$P$12,0,J$12))","v":""},{"$f":"IF(K$12>CÁLCULO.FrentesPreenchidas,\"\",OFFSET(CÁLCULO!$P$12,0,K$12))","v":""},{"$f":"IF(L$12>CÁLCULO.FrentesPreenchidas,\"\",OFFSET(CÁLCULO!$P$12,0,L$12))","v":""},{"$f":"IF(M$12>CÁLCULO.FrentesPreenchidas,\"\",OFFSET(CÁLCULO!$P$12,0,M$12))","v":""},{"$f":"IF(N$12>CÁLCULO.FrentesPreenchidas,\"\",OFFSET(CÁLCULO!$P$12,0,N$12))","v":""},{"$f":"IF(O$12>CÁLCULO.FrentesPreenchidas,\"\",OFFSET(CÁLCULO!$P$12,0,O$12))","v":""},{"$f":"IF(P$12>CÁLCULO.FrentesPreenchidas,\"\",OFFSET(CÁLCULO!$P$12,0,P$12))","v":""},{"$f":"IF(Q$12>CÁLCULO.FrentesPreenchidas,\"\",OFFSET(CÁLCULO!$P$12,0,Q$12))","v":""},{"$f":"IF(R$12>CÁLCULO.FrentesPreenchidas,\"\",OFFSET(CÁLCULO!$P$12,0,R$12))","v":""},{"$f":"IF(S$12>CÁLCULO.FrentesPreenchidas,\"\",OFFSET(CÁLCULO!$P$12,0,S$12))","v":""},{"$f":"IF(T$12>CÁLCULO.FrentesPreenchidas,\"\",OFFSET(CÁLCULO!$P$12,0,T$12))","v":""},{"$f":"IF(U$12>CÁLCULO.FrentesPreenchidas,\"\",OFFSET(CÁLCULO!$P$12,0,U$12))","v":""},{"$f":"IF(V$12>CÁLCULO.FrentesPreenchidas,\"\",OFFSET(CÁLCULO!$P$12,0,V$12))","v":""},{"$f":"IF(W$12>CÁLCULO.FrentesPreenchidas,\"\",OFFSET(CÁLCULO!$P$12,0,W$12))","v":""},{"$f":"IF(X$12>CÁLCULO.FrentesPreenchidas,\"\",OFFSET(CÁLCULO!$P$12,0,X$12))","v":""},{"$f":"IF(Y$12>CÁLCULO.FrentesPreenchidas,\"\",OFFSET(CÁLCULO!$P$12,0,Y$12))","v":""},{"$f":"IF(Z$12>CÁLCULO.FrentesPreenchidas,\"\",OFFSET(CÁLCULO!$P$12,0,Z$12))","v":""},{"$f":"IF(AA$12>CÁLCULO.FrentesPreenchidas,\"\",OFFSET(CÁLCULO!$P$12,0,AA$12))","v":""},{"$f":"IF(AB$12>CÁLCULO.FrentesPreenchidas,\"\",OFFSET(CÁLCULO!$P$12,0,AB$12))","v":""},{"$f":"IF(AC$12>CÁLCULO.FrentesPreenchidas,\"\",OFFSET(CÁLCULO!$P$12,0,AC$12))","v":""},{"$f":"IF(AD$12>CÁLCULO.FrentesPreenchidas,\"\",OFFSET(CÁLCULO!$P$12,0,AD$12))","v":""},{"$f":"IF(AE$12>CÁLCULO.FrentesPreenchidas,\"\",OFFSET(CÁLCULO!$P$12,0,AE$12))","v":""}]
["↓","Nº do Evento","Título dos Eventos",null,{"$f":"OFFSET(E12,0,-1)+1","v":1},null,{"$f":"OFFSET(G12,0,-1)+1","v":1},{"$f":"OFFSET(H12,0,-1)+1","v":2},{"$f":"OFFSET(I12,0,-1)+1","v":3},4,5,6,7,8,9,10,11,12,13,14,15,16,17,18,19,20,21,22,23,24,25]
["FILTRO",null,null,null,null,null,null,null,null,null,null,null,{"$f":"IF(CRONOPLE.Erro=\"ERRO: CRONOGRAMA NÃO FECHA 100%\",\"Informe abaixo o NÚMERO DO PERÍODO em que os eventos serão concluídos\",\"\")","v":""}]
["F"]
[{"$f":"IF(AUTOEVENTO=\"Manual\",IF(EVENTOS!$F15>0,\"F\",\"\"),IF(AND(B15>0,B15<=MAX(CÁLCULO!$M$15:$M$27)),\"F\",\"\"))","v":""},{"$f":"EVENTOS!$C$15","v":0},{"$f":"EVENTOS!$D$15","v":""},null,null,{"$f":"IF($C15=\"\",\"\",CONCATENATE($B15,\". \",$C15))","v":""},{"$f":"IF(AUTOEVENTO=\"MANUAL\",\"A administração local será proporcional a execução dos demais eventos, independente de frentes de obra.\",\"Para aplicação de Adm. Local é necessário definir os eventos manualmente.\")","v":"Para aplicação de Adm. Local é necessário definir os eventos manualmente."}]
[{"$f":"IF(AUTOEVENTO=\"Manual\",IF(EVENTOS!$F16>0,\"F\",\"\"),IF(AND(B16>0,B16<=MAX(CÁLCULO!$M$15:$M$27)),\"F\",\"\"))","v":"F"},{"$f":"OFFSET(B16,-1,0)+1","v":1},{"$f":"IF(AUTOEVENTO=\"Manual\",IF($B16>0,OFFSET(EVENTOS!$D$15,$B16-$B$15,0),0),IF(B16<=MAX(CÁLCULO!$M$15:$M$27),VLOOKUP($B16,CÁLCULO!$M$15:$N$27,2,FALSE),0))","v":"PILARES PRÉ MOLDADO 20X25 CM"},null,null,{"$f":"IF($C16=0,\"\",CONCATENATE($B16,\". \",$C16))","v":"1. PILARES PRÉ MOLDADO 20X25 CM"},1,1]
[{"$f":"IF(AUTOEVENTO=\"Manual\",IF(EVENTOS!$F17>0,\"F\",\"\"),IF(AND(B17>0,B17<=MAX(CÁLCULO!$M$15:$M$27)),\"F\",\"\"))","v":"F"},2,{"$f":"IF(AUTOEVENTO=\"Manual\",IF($B17>0,OFFSET(EVENTOS!$D$15,$B17-$B$15,0),0),IF(B17<=MAX(CÁLCULO!$M$15:$M$27),VLOOKUP($B17,CÁLCULO!$M$15:$N$27,2,FALSE),0))","v":"ESTRUTURA E COBERTURA "},null,null,"2. ESTRUTURA E COBERTURA ",null,1,2]
["F"]
["F"]
["F",null,"Cronograma",null,null,null,null,{"$f":"(ROW($G20)-ROW($G$20))/8*12+1","v":1},null,{"$f":"H20+1","v":2},null,{"$f":"J20+1","v":3},null,{"$f":"L20+1","v":4},null,{"$f":"N20+1","v":5},null,{"$f":"P20+1","v":6},null,{"$f":"R20+1","v":7},null,{"$f":"T20+1","v":8},null,{"$f":"V20+1","v":9},null,{"$f":"X20+1","v":10},null,{"$f":"Z20+1","v":11},null,{"$f":"AB20+1","v":12}]
["F",null,"Parcela",null,null,null,"%",{"$f":"OFFSET(CRONO!$T$24,0,CRONOPLE!H20)","v":0.44255796186214624},null,{"$f":"OFFSET(CRONO!$T$24,0,CRONOPLE!J20)","v":0.55744203813785376},null,{"$f":"OFFSET(CRONO!$T$24,0,CRONOPLE!L20)","v":0},null,{"$f":"OFFSET(CRONO!$T$24,0,CRONOPLE!N20)","v":0},null,{"$f":"OFFSET(CRONO!$T$24,0,CRONOPLE!P20)","v":0},null,{"$f":"OFFSET(CRONO!$T$24,0,CRONOPLE!R20)","v":0},null,{"$f":"OFFSET(CRONO!$T$24,0,CRONOPLE!T20)","v":0},null,{"$f":"OFFSET(CRONO!$T$24,0,CRONOPLE!V20)","v":0},null,{"$f":"OFFSET(CRONO!$T$24,0,CRONOPLE!X20)","v":0},null,{"$f":"OFFSET(CRONO!$T$24,0,CRONOPLE!Z20)","v":0},null,{"$f":"OFFSET(CRONO!$T$24,0,CRONOPLE!AB20)","v":0},null,{"$f":"OFFSET(CRONO!$T$24,0,CRONOPLE!AD20)","v":0}]
["F",null,null,null,null,null,"R$",{"$f":"OFFSET(CRONO!$T$28,0,CRONOPLE!H20)","v":59595.28},null,{"$f":"OFFSET(CRONO!$T$28,0,CRONOPLE!J20)","v":75065.679999999993},null,{"$f":"OFFSET(CRONO!$T$28,0,CRONOPLE!L20)","v":0},null,{"$f":"OFFSET(CRONO!$T$28,0,CRONOPLE!N20)","v":0},null,{"$f":"OFFSET(CRONO!$T$28,0,CRONOPLE!P20)","v":0},null,{"$f":"OFFSET(CRONO!$T$28,0,CRONOPLE!R20)","v":0},null,{"$f":"OFFSET(CRONO!$T$28,0,CRONOPLE!T20)","v":0},null,{"$f":"OFFSET(CRONO!$T$28,0,CRONOPLE!V20)","v":0},null,{"$f":"OFFSET(CRONO!$T$28,0,CRONOPLE!X20)","v":0},null,{"$f":"OFFSET(CRONO!$T$28,0,CRONOPLE!Z20)","v":0},null,{"$f":"OFFSET(CRONO!$T$28,0,CRONOPLE!AB20)","v":0},null,{"$f":"OFFSET(CRONO!$T$28,0,CRONOPLE!AD20)","v":0}]
["F",null,"Acumulado",null,null,null,"%",{"$f":"OFFSET(CRONO!$T$29,0,CRONOPLE!H20)","v":0.44259999999999999},null,{"$f":"OFFSET(CRONO!$T$29,0,CRONOPLE!J20)","v":1},null,{"$f":"OFFSET(CRONO!$T$29,0,CRONOPLE!L20)","v":1},null,{"$f":"OFFSET(CRONO!$T$29,0,CRONOPLE!N20)","v":1},null,{"$f":"OFFSET(CRONO!$T$29,0,CRONOPLE!P20)","v":1},null,{"$f":"OFFSET(CRONO!$T$29,0,CRONOPLE!R20)","v":1},null,{"$f":"OFFSET(CRONO!$T$29,0,CRONOPLE!T20)","v":1},null,{"$f":"OFFSET(CRONO!$T$29,0,CRONOPLE!V20)","v":1},null,{"$f":"OFFSET(CRONO!$T$29,0,CRONOPLE!X20)","v":1},null,{"$f":"OFFSET(CRONO!$T$29,0,CRONOPLE!Z20)","v":1},null,{"$f":"OFFSET(CRONO!$T$29,0,CRONOPLE!AB20)","v":1},null,{"$f":"OFFSET(CRONO!$T$29,0,CRONOPLE!AD20)","v":1}]
["F",null,null,null,null,null,"R$",{"$f":"OFFSET(CRONO!$T$33,0,CRONOPLE!H20)","v":59595.28},null,{"$f":"OFFSET(CRONO!$T$33,0,CRONOPLE!J20)","v":134660.96},null,{"$f":"OFFSET(CRONO!$T$33,0,CRONOPLE!L20)","v":134660.96},null,{"$f":"OFFSET(CRONO!$T$33,0,CRONOPLE!N20)","v":134660.96},null,{"$f":"OFFSET(CRONO!$T$33,0,CRONOPLE!P20)","v":134660.96},null,{"$f":"OFFSET(CRONO!$T$33,0,CRONOPLE!R20)","v":134660.96},null,{"$f":"OFFSET(CRONO!$T$33,0,CRONOPLE!T20)","v":134660.96},null,{"$f":"OFFSET(CRONO!$T$33,0,CRONOPLE!V20)","v":134660.96},null,{"$f":"OFFSET(CRONO!$T$33,0,CRONOPLE!X20)","v":134660.96},null,{"$f":"OFFSET(CRONO!$T$33,0,CRONOPLE!Z20)","v":134660.96},null,{"$f":"OFFSET(CRONO!$T$33,0,CRONOPLE!AB20)","v":134660.96},null,{"$f":"OFFSET(CRONO!$T$33,0,CRONOPLE!AD20)","v":134660.96}]
["F",null,"Administração Local",null,null,null,"%",{"$f":"OFFSET(CRONO!$T$34,0,CRONOPLE!H20)","v":0.37559428844263076},null,{"$f":"OFFSET(CRONO!$T$34,0,CRONOPLE!J20)","v":1},null,{"$f":"OFFSET(CRONO!$T$34,0,CRONOPLE!L20)","v":1},null,{"$f":"OFFSET(CRONO!$T$34,0,CRONOPLE!N20)","v":1},null,{"$f":"OFFSET(CRONO!$T$34,0,CRONOPLE!P20)","v":1},null,{"$f":"OFFSET(CRONO!$T$34,0,CRONOPLE!R20)","v":1},null,{"$f":"OFFSET(CRONO!$T$34,0,CRONOPLE!T20)","v":1},null,{"$f":"OFFSET(CRONO!$T$34,0,CRONOPLE!V20)","v":1},null,{"$f":"OFFSET(CRONO!$T$34,0,CRONOPLE!X20)","v":1},null,{"$f":"OFFSET(CRONO!$T$34,0,CRONOPLE!Z20)","v":1},null,{"$f":"OFFSET(CRONO!$T$34,0,CRONOPLE!AB20)","v":1},null,{"$f":"OFFSET(CRONO!$T$34,0,CRONOPLE!AD20)","v":1}]
["F",null,null,null,null,null,{"$f":"IF(COUNTIF(H26:AF26,\"%Adm>%Global\")>0,\"Verificar proporcionalidade da Administração Local\",\"\")","v":""},{"$f":"IF(H25=\"\",\"\",IF(ROUND(H25,4)>ROUND(H23,4),\"%Adm>%Global\",\"\"))","v":""},null,{"$f":"IF(J25=\"\",\"\",IF(ROUND(J25,4)>ROUND(J23,4),\"%Adm>%Global\",\"\"))","v":""},null,{"$f":"IF(L25=\"\",\"\",IF(ROUND(L25,4)>ROUND(L23,4),\"%Adm>%Global\",\"\"))","v":""},null,{"$f":"IF(N25=\"\",\"\",IF(ROUND(N25,4)>ROUND(N23,4),\"%Adm>%Global\",\"\"))","v":""},null,{"$f":"IF(P25=\"\",\"\",IF(ROUND(P25,4)>ROUND(P23,4),\"%Adm>%Global\",\"\"))","v":""},null,{"$f":"IF(R25=\"\",\"\",IF(ROUND(R25,4)>ROUND(R23,4),\"%Adm>%Global\",\"\"))","v":""},null,{"$f":"IF(T25=\"\",\"\",IF(ROUND(T25,4)>ROUND(T23,4),\"%Adm>%Global\",\"\"))","v":""},null,{"$f":"IF(V25=\"\",\"\",IF(ROUND(V25,4)>ROUND(V23,4),\"%Adm>%Global\",\"\"))","v":""},null,{"$f":"IF(X25=\"\",\"\",IF(ROUND(X25,4)>ROUND(X23,4),\"%Adm>%Global\",\"\"))","v":""},null,{"$f":"IF(Z25=\"\",\"\",IF(ROUND(Z25,4)>ROUND(Z23,4),\"%Adm>%Global\",\"\"))","v":""},null,{"$f":"IF(AB25=\"\",\"\",IF(ROUND(AB25,4)>ROUND(AB23,4),\"%Adm>%Global\",\"\"))","v":""},null,{"$f":"IF(AD25=\"\",\"\",IF(ROUND(AD25,4)>ROUND(AD23,4),\"%Adm>%Global\",\"\"))","v":""}]
["F"]
["F",{"$f":"Import.Município","v":"SÃO VALENTIM/RS"}]
["F","Local",null,null,null,null,null,null,null,null,null,null,null,null,null,null,null,null,null,null,null,"Responsável Técnico"]
["F",null,null,null,null,null,null,null,null,null,null,null,null,null,null,null,null,null,null,null,null,{"$f":"OFFSET(Import.RespOrçamento,0,-1) & \" \" & Import.RespOrçamento","v":"Nome: "}]
["F",{"$f":"DADOS!$C$25","v":"00:00:00"},null,null,null,null,null,null,null,null,null,null,null,null,null,null,null,null,null,null,null,"CREA/CAU: "]
["F","Data",null,null,null,null,null,null,null,null,null,null,null,null,null,null,null,null,null,null,null,"ART/RRT: "]

{"sheet":"CRONO","index":8,"n_rows":40,"n_cols":33,"rows_kept":40,"cut":false,"hidden":false,"merged":[[11,19,12,19],[7,11,7,19],[7,20,7,24],[9,10,10,19],[23,8,24,10],[11,7,12,7],[11,8,12,8],[11,9,12,9],[38,8,38,10],[35,8,35,18],[33,7,33,9],[11,18,12,18],[7,6,10,6],[7,8,7,9],[6,7,8,7],[3,30,3,31],[4,30,4,31],[7,25,7,30]]}
[{"$f":"IF($M1>1,_xlfn.CONCAT($I1,\" \",$J1),\"\")","v":{"$error":"#REF!"}},{"$f":"OFFSET(B1,-3,0)+1","v":{"$error":"#REF!"}},{"$f":"IF($R1<>2,0,IF($S1=0,1,IF(F2>0,OFFSET(QCI!$M$13,SUBSTITUTE(F2,\".\",\"\"),0),OFFSET(ORÇAMENTO!$AA$15,CRONO!$F1,0))/$S1))","v":{"$error":"#REF!"}},{"$f":"IF($R1<>2,0,IF($S1=0,1,IF(F2>0,OFFSET(QCI!$N$13,SUBSTITUTE(F2,\".\",\"\"),0),OFFSET(ORÇAMENTO!$AB$15,CRONO!$F1,0))/$S1))","v":{"$error":"#REF!"}},{"$f":"IF(AND($R1=2,ACOMPANHAMENTO=\"BM\"),ROUND(E2,4),E3/$S1)","v":{"$error":"#REF!"}},{"$f":"IF(B1<=ORÇAMENTO.MáximoListaCrono,MATCH(B1,ORÇAMENTO.ListaCrono,0),NA())","v":{"$error":"#REF!"}},{"$f":"IF(AND($F2<>-1,$S1>0),\"F\",\"\")","v":{"$error":"#REF!"}},{"$f":"IF(OR(S1=0,S1=\"\"),\"Linha\",IF(AND(OR(ACOMPANHAMENTO=\"PLE\",$R1<>2),$F2=0),\"Linha\",ROUND(1-SUM(U1:AG1),4)))","v":{"$error":"#REF!"}},{"$f":"IF($F2=0,OFFSET(ORÇAMENTO!O$15,$F1,0),IF($F2<>-1,OFFSET(QCI!$D$13,$F2,0),\"\"))","v":{"$error":"#REF!"}},{"$f":"IF($F2=0,OFFSET(ORÇAMENTO!R$15,$F1,0),IF($F2<>-1,OFFSET(QCI!$G$13,$F2,0),\"\"))","v":{"$error":"#REF!"}},null,null,{"$f":"IF($F2=0,OFFSET(ORÇAMENTO!C$15,$F1,0),1)","v":{"$error":"#REF!"}},{"$f":"IF($F2=-1,0,IF(N$13<=$M1,IF(ISERROR(MATCH(N$13,OFFSET($M1,1,0,ROW($M$23)-ROW($M1)-1),0)),ROW($M$23)-ROW($M1)-1,MATCH(N$13,OFFSET($M1,1,0,ROW($M$23)-ROW($M1)-1),0)-1),0))","v":{"$error":"#REF!"}},{"$f":"IF($F2=-1,0,IF(O$13<=$M1,IF(ISERROR(MATCH(O$13,OFFSET($M1,1,0,ROW($M$23)-ROW($M1)-1),0)),ROW($M$23)-ROW($M1)-1,MATCH(O$13,OFFSET($M1,1,0,ROW($M$23)-ROW($M1)-1),0)-1),0))","v":{"$error":"#REF!"}},{"$f":"IF($F2=-1,0,IF(P$13<=$M1,IF(ISERROR(MATCH(P$13,OFFSET($M1,1,0,ROW($M$23)-ROW($M1)-1),0)),ROW($M$23)-ROW($M1)-1,MATCH(P$13,OFFSET($M1,1,0,ROW($M$23)-ROW($M1)-1),0)-1),0))","v":{"$error":"#REF!"}},{"$f":"IF($F2=-1,0,IF(Q$13<=$M1,IF(ISERROR(MATCH(Q$13,OFFSET($M1,1,0,ROW($M$23)-ROW($M1)-1),0)),ROW($M$23)-ROW($M1)-1,MATCH(Q$13,OFFSET($M1,1,0,ROW($M$23)-ROW($M1)-1),0)-1),0))","v":{"$error":"#REF!"}},{"$f":"MIN(OFFSET(M1,0,1,,M1))","v":{"$error":"#REF!"}},{"$f":"IF($F2=0,OFFSET(ORÇAMENTO!X$15,$F1,0),IF($F2<>-1,OFFSET(QCI!$O$13,$F2,0),\"\"))","v":{"$error":"#REF!"}},"% Período:",{"$f":"IF(AND($R1=2,ACOMPANHAMENTO=\"BM\"),ROUND(U2,4),U3/$S1)","v":{"$error":"#REF!"}},{"$f":"IF(AND($R1=2,ACOMPANHAMENTO=\"BM\"),ROUND(V2,4),V3/$S1)","v":{"$error":"#REF!"}},{"$f":"IF(AND($R1=2,ACOMPANHAMENTO=\"BM\"),ROUND(W2,4),W3/$S1)","v":{"$error":"#REF!"}},{"$f":"IF(AND($R1=2,ACOMPANHAMENTO=\"BM\"),ROUND(X2,4),X3/$S1)","v":{"$error":"#REF!"}},{"$f":"IF(AND($R1=2,ACOMPANHAMENTO=\"BM\"),ROUND(Y2,4),Y3/$S1)","v":{"$error":"#REF!"}},{"$f":"IF(AND($R1=2,ACOMPANHAMENTO=\"BM\"),ROUND(Z2,4),Z3/$S1)","v":{"$error":"#REF!"}},{"$f":"IF(AND($R1=2,ACOMPANHAMENTO=\"BM\"),ROUND(AA2,4),AA3/$S1)","v":{"$error":"#REF!"}},{"$f":"IF(AND($R1=2,ACOMPANHAMENTO=\"BM\"),ROUND(AB2,4),AB3/$S1)","v":{"$error":"#REF!"}},{"$f":"IF(AND($R1=2,ACOMPANHAMENTO=\"BM\"),ROUND(AC2,4),AC3/$S1)","v":{"$error":"#REF!"}},{"$f":"IF(AND($R1=2,ACOMPANHAMENTO=\"BM\"),ROUND(AD2,4),AD3/$S1)","v":{"$error":"#REF!"}},{"$f":"IF(AND($R1=2,ACOMPANHAMENTO=\"BM\"),ROUND(AE2,4),AE3/$S1)","v":{"$error":"#REF!"}},{"$f":"IF(AND($R1=2,ACOMPANHAMENTO=\"BM\"),ROUND(AF2,4),AF3/$S1)","v":{"$error":"#REF!"}}]
[null,null,null,null,null,{"$f":"IF(ISERROR(F1),IF(1+COUNTIF($M$13:OFFSET(M1,-1,0),1)<=MAX(QCI!$D$13:$D$24),1+COUNTIF($M$13:OFFSET(M1,-1,0),1),-1),0)","v":{"$error":"#REF!"}},{"$f":"IF(ACOMPANHAMENTO=\"BM\",OFFSET(G2,-1,0),\"\")","v":""},{"$f":"IF(OR(S1=0,S1=\"\"),\"vazia\",IF(AND(OR(ACOMPANHAMENTO=\"PLE\",$R1<>2),$F2=0),\"calculada\",\"-->\"))","v":{"$error":"#REF!"}},null,{"$f":"IF(AND(H1<>0,ISNUMBER(H1)),\"PREENCHA ESTA LINHA -->\",\"\")","v":{"$error":"#REF!"}}]
[null,null,null,null,{"$f":"IF($R1=2,\n         IF(AND(ACOMPANHAMENTO=\"PLE\",ISNUMBER($F1)),\n                SUMIF((OFFSET(CÁLCULO!$AM$15:$AW$15,$F1,0,OFFSET(ORÇAMENTO!$D$15,CRONO!$F1,0))),CRONO!E$12,OFFSET(CÁLCULO!$AB$15:$AL$15,$F1,0,OFFSET(ORÇAMENTO!$D$15,CRONO!$F1,0)))\n                +IF(AND($F3<>\"\",$F3<>0),\n                        SUMIF(CÁLCULO!$AM$15:$AW$27,CRONO!E$12,CÁLCULO!$AB$15:$AL$27)/(ORÇAMENTO!$X$15-_xlfn.SINGLE(CÁLCULO.TotalAdmLocal))*CRONO!$F3,\n                        0),\n                 E2*$S1),\n          SUMIF(OFFSET($S3,1,0,$R1-2),($M1+1)&\"$\",OFFSET(E3,1,0,$R1-2)))","v":{"$error":"#REF!"}},{"$f":"IF(OR($R1<>2,AUTOEVENTO<>\"manual\",$F2>0),\"\",\n        IF(Import.TipoArredondamento=\"Tradicional\",\n              SUMIF(OFFSET(CÁLCULO!$M$15,CRONO!$F1,0,OFFSET(ORÇAMENTO!$D$15,CRONO!$F1,0)),1,OFFSET(ORÇAMENTO!$X$15,CRONO!$F1,0,OFFSET(ORÇAMENTO!$D$15,CRONO!$F1,0))),\n              0))","v":{"$error":"#REF!"}},null,null,null,null,null,null,null,null,null,null,null,null,{"$f":"M1&\"$\"","v":{"$error":"#REF!"}},null,{"$f":"IF($R1=2,\n         IF(AND(ACOMPANHAMENTO=\"PLE\",ISNUMBER($F1)),\n                SUMIF((OFFSET(CÁLCULO!$AM$15:$AW$15,$F1,0,OFFSET(ORÇAMENTO!$D$15,CRONO!$F1,0))),CRONO!U$12,OFFSET(CÁLCULO!$AB$15:$AL$15,$F1,0,OFFSET(ORÇAMENTO!$D$15,CRONO!$F1,0)))\n                +IF(AND($F3<>\"\",$F3<>0),\n                        SUMIF(CÁLCULO!$AM$15:$AW$27,CRONO!U$12,CÁLCULO!$AB$15:$AL$27)/(ORÇAMENTO!$X$15-_xlfn.SINGLE(CÁLCULO.TotalAdmLocal))*CRONO!$F3,\n                        0),\n                 U2*$S1),\n          SUMIF(OFFSET($S3,1,0,$R1-2),($M1+1)&\"$\",OFFSET(U3,1,0,$R1-2)))","v":{"$error":"#REF!"}},{"$f":"IF($R1=2,\n         IF(AND(ACOMPANHAMENTO=\"PLE\",ISNUMBER($F1)),\n                SUMIF((OFFSET(CÁLCULO!$AM$15:$AW$15,$F1,0,OFFSET(ORÇAMENTO!$D$15,CRONO!$F1,0))),CRONO!V$12,OFFSET(CÁLCULO!$AB$15:$AL$15,$F1,0,OFFSET(ORÇAMENTO!$D$15,CRONO!$F1,0)))\n                +IF(AND($F3<>\"\",$F3<>0),\n                        SUMIF(CÁLCULO!$AM$15:$AW$27,CRONO!V$12,CÁLCULO!$AB$15:$AL$27)/(ORÇAMENTO!$X$15-_xlfn.SINGLE(CÁLCULO.TotalAdmLocal))*CRONO!$F3,\n                        0),\n                 V2*$S1),\n          SUMIF(OFFSET($S3,1,0,$R1-2),($M1+1)&\"$\",OFFSET(V3,1,0,$R1-2)))","v":{"$error":"#REF!"}},{"$f":"IF($R1=2,\n         IF(AND(ACOMPANHAMENTO=\"PLE\",ISNUMBER($F1)),\n                SUMIF((OFFSET(CÁLCULO!$AM$15:$AW$15,$F1,0,OFFSET(ORÇAMENTO!$D$15,CRONO!$F1,0))),CRONO!W$12,OFFSET(CÁLCULO!$AB$15:$AL$15,$F1,0,OFFSET(ORÇAMENTO!$D$15,CRONO!$F1,0)))\n                +IF(AND($F3<>\"\",$F3<>0),\n                        SUMIF(CÁLCULO!$AM$15:$AW$27,CRONO!W$12,CÁLCULO!$AB$15:$AL$27)/(ORÇAMENTO!$X$15-_xlfn.SINGLE(CÁLCULO.TotalAdmLocal))*CRONO!$F3,\n                        0),\n                 W2*$S1),\n          SUMIF(OFFSET($S3,1,0,$R1-2),($M1+1)&\"$\",OFFSET(W3,1,0,$R1-2)))","v":{"$error":"#REF!"}},{"$f":"IF($R1=2,\n         IF(AND(ACOMPANHAMENTO=\"PLE\",ISNUMBER($F1)),\n                SUMIF((OFFSET(CÁLCULO!$AM$15:$AW$15,$F1,0,OFFSET(ORÇAMENTO!$D$15,CRONO!$F1,0))),CRONO!X$12,OFFSET(CÁLCULO!$AB$15:$AL$15,$F1,0,OFFSET(ORÇAMENTO!$D$15,CRONO!$F1,0)))\n                +IF(AND($F3<>\"\",$F3<>0),\n                        SUMIF(CÁLCULO!$AM$15:$AW$27,CRONO!X$12,CÁLCULO!$AB$15:$AL$27)/(ORÇAMENTO!$X$15-_xlfn.SINGLE(CÁLCULO.TotalAdmLocal))*CRONO!$F3,\n                        0),\n                 X2*$S1),\n          SUMIF(OFFSET($S3,1,0,$R1-2),($M1+1)&\"$\",OFFSET(X3,1,0,$R1-2)))","v":{"$error":"#REF!"}},{"$f":"IF($R1=2,\n         IF(AND(ACOMPANHAMENTO=\"PLE\",ISNUMBER($F1)),\n                SUMIF((OFFSET(CÁLCULO!$AM$15:$AW$15,$F1,0,OFFSET(ORÇAMENTO!$D$15,CRONO!$F1,0))),CRONO!Y$12,OFFSET(CÁLCULO!$AB$15:$AL$15,$F1,0,OFFSET(ORÇAMENTO!$D$15,CRONO!$F1,0)))\n                +IF(AND($F3<>\"\",$F3<>0),\n                        SUMIF(CÁLCULO!$AM$15:$AW$27,CRONO!Y$12,CÁLCULO!$AB$15:$AL$27)/(ORÇAMENTO!$X$15-_xlfn.SINGLE(CÁLCULO.TotalAdmLocal))*CRONO!$F3,\n                        0),\n                 Y2*$S1),\n          SUMIF(OFFSET($S3,1,0,$R1-2),($M1+1)&\"$\",OFFSET(Y3,1,0,$R1-2)))","v":{"$error":"#REF!"}},{"$f":"IF($R1=2,\n         IF(AND(ACOMPANHAMENTO=\"PLE\",ISNUMBER($F1)),\n                SUMIF((OFFSET(CÁLCULO!$AM$15:$AW$15,$F1,0,OFFSET(ORÇAMENTO!$D$15,CRONO!$F1,0))),CRONO!Z$12,OFFSET(CÁLCULO!$AB$15:$AL$15,$F1,0,OFFSET(ORÇAMENTO!$D$15,CRONO!$F1,0)))\n                +IF(AND($F3<>\"\",$F3<>0),\n                        SUMIF(CÁLCULO!$AM$15:$AW$27,CRONO!Z$12,CÁLCULO!$AB$15:$AL$27)/(ORÇAMENTO!$X$15-_xlfn.SINGLE(CÁLCULO.TotalAdmLocal))*CRONO!$F3,\n                        0),\n                 Z2*$S1),\n          SUMIF(OFFSET($S3,1,0,$R1-2),($M1+1)&\"$\",OFFSET(Z3,1,0,$R1-2)))","v":{"$error":"#REF!"}},{"$f":"IF($R1=2,\n         IF(AND(ACOMPANHAMENTO=\"PLE\",ISNUMBER($F1)),\n                SUMIF((OFFSET(CÁLCULO!$AM$15:$AW$15,$F1,0,OFFSET(ORÇAMENTO!$D$15,CRONO!$F1,0))),CRONO!AA$12,OFFSET(CÁLCULO!$AB$15:$AL$15,$F1,0,OFFSET(ORÇAMENTO!$D$15,CRONO!$F1,0)))\n                +IF(AND($F3<>\"\",$F3<>0),\n                        SUMIF(CÁLCULO!$AM$15:$AW$27,CRONO!AA$12,CÁLCULO!$AB$15:$AL$27)/(ORÇAMENTO!$X$15-_xlfn.SINGLE(CÁLCULO.TotalAdmLocal))*CRONO!$F3,\n                        0),\n                 AA2*$S1),\n          SUMIF(OFFSET($S3,1,0,$R1-2),($M1+1)&\"$\",OFFSET(AA3,1,0,$R1-2)))","v":{"$error":"#REF!"}},{"$f":"IF($R1=2,\n         IF(AND(ACOMPANHAMENTO=\"PLE\",ISNUMBER($F1)),\n                SUMIF((OFFSET(CÁLCULO!$AM$15:$AW$15,$F1,0,OFFSET(ORÇAMENTO!$D$15,CRONO!$F1,0))),CRONO!AB$12,OFFSET(CÁLCULO!$AB$15:$AL$15,$F1,0,OFFSET(ORÇAMENTO!$D$15,CRONO!$F1,0)))\n                +IF(AND($F3<>\"\",$F3<>0),\n                        SUMIF(CÁLCULO!$AM$15:$AW$27,CRONO!AB$12,CÁLCULO!$AB$15:$AL$27)/(ORÇAMENTO!$X$15-_xlfn.SINGLE(CÁLCULO.TotalAdmLocal))*CRONO!$F3,\n                        0),\n                 AB2*$S1),\n          SUMIF(OFFSET($S3,1,0,$R1-2),($M1+1)&\"$\",OFFSET(AB3,1,0,$R1-2)))","v":{"$error":"#REF!"}},{"$f":"IF($R1=2,\n         IF(AND(ACOMPANHAMENTO=\"PLE\",ISNUMBER($F1)),\n                SUMIF((OFFSET(CÁLCULO!$AM$15:$AW$15,$F1,0,OFFSET(ORÇAMENTO!$D$15,CRONO!$F1,0))),CRONO!AC$12,OFFSET(CÁLCULO!$AB$15:$AL$15,$F1,0,OFFSET(ORÇAMENTO!$D$15,CRONO!$F1,0)))\n                +IF(AND($F3<>\"\",$F3<>0),\n                        SUMIF(CÁLCULO!$AM$15:$AW$27,CRONO!AC$12,CÁLCULO!$AB$15:$AL$27)/(ORÇAMENTO!$X$15-_xlfn.SINGLE(CÁLCULO.TotalAdmLocal))*CRONO!$F3,\n                        0),\n                 AC2*$S1),\n          SUMIF(OFFSET($S3,1,0,$R1-2),($M1+1)&\"$\",OFFSET(AC3,1,0,$R1-2)))","v":{"$error":"#REF!"}},{"$f":"IF($R1=2,\n         IF(AND(ACOMPANHAMENTO=\"PLE\",ISNUMBER($F1)),\n                SUMIF((OFFSET(CÁLCULO!$AM$15:$AW$15,$F1,0,OFFSET(ORÇAMENTO!$D$15,CRONO!$F1,0))),CRONO!AD$12,OFFSET(CÁLCULO!$AB$15:$AL$15,$F1,0,OFFSET(ORÇAMENTO!$D$15,CRONO!$F1,0)))\n                +IF(AND($F3<>\"\",$F3<>0),\n                        SUMIF(CÁLCULO!$AM$15:$AW$27,CRONO!AD$12,CÁLCULO!$AB$15:$AL$27)/(ORÇAMENTO!$X$15-_xlfn.SINGLE(CÁLCULO.TotalAdmLocal))*CRONO!$F3,\n                        0),\n                 AD2*$S1),\n          SUMIF(OFFSET($S3,1,0,$R1-2),($M1+1)&\"$\",OFFSET(AD3,1,0,$R1-2)))","v":{"$error":"#REF!"}},{"$f":"IF($R1=2,\n         IF(AND(ACOMPANHAMENTO=\"PLE\",ISNUMBER($F1)),\n                SUMIF((OFFSET(CÁLCULO!$AM$15:$AW$15,$F1,0,OFFSET(ORÇAMENTO!$D$15,CRONO!$F1,0))),CRONO!AE$12,OFFSET(CÁLCULO!$AB$15:$AL$15,$F1,0,OFFSET(ORÇAMENTO!$D$15,CRONO!$F1,0)))\n                +IF(AND($F3<>\"\",$F3<>0),\n                        SUMIF(CÁLCULO!$AM$15:$AW$27,CRONO!AE$12,CÁLCULO!$AB$15:$AL$27)/(ORÇAMENTO!$X$15-_xlfn.SINGLE(CÁLCULO.TotalAdmLocal))*CRONO!$F3,\n                        0),\n                 AE2*$S1),\n          SUMIF(OFFSET($S3,1,0,$R1-2),($M1+1)&\"$\",OFFSET(AE3,1,0,$R1-2)))","v":{"$error":"#REF!"}},{"$f":"IF($R1=2,\n         IF(AND(ACOMPANHAMENTO=\"PLE\",ISNUMBER($F1)),\n                SUMIF((OFFSET(CÁLCULO!$AM$15:$AW$15,$F1,0,OFFSET(ORÇAMENTO!$D$15,CRONO!$F1,0))),CRONO!AF$12,OFFSET(CÁLCULO!$AB$15:$AL$15,$F1,0,OFFSET(ORÇAMENTO!$D$15,CRONO!$F1,0)))\n                +IF(AND($F3<>\"\",$F3<>0),\n                        SUMIF(CÁLCULO!$AM$15:$AW$27,CRONO!AF$12,CÁLCULO!$AB$15:$AL$27)/(ORÇAMENTO!$X$15-_xlfn.SINGLE(CÁLCULO.TotalAdmLocal))*CRONO!$F3,\n                        0),\n                 AF2*$S1),\n          SUMIF(OFFSET($S3,1,0,$R1-2),($M1+1)&\"$\",OFFSET(AF3,1,0,$R1-2)))","v":{"$error":"#REF!"}}]
[null,null,null,null,null,null,null,null,null,null,null,null,null,null,null,null,null,null,{"$f":"IF(TIPOORCAMENTO=\"licitado\",\"CFF - CRONOGRAMA FÍSICO-FINANCEIRO LICITADO\",\"CFF - CRONOGRAMA FÍSICO-FINANCEIRO\")","v":"CFF - CRONOGRAMA FÍSICO-FINANCEIRO"},null,null,null,null,null,null,null,null,null,null,null,"Grau de Sigilo"]
[null,null,null,null,null,null,null,null,null,null,null,null,null,null,null,null,null,null,{"$f":"import.recurso","v":"OGU"},null,null,null,null,null,null,null,null,null,null,null,"#PUBLICO"]
[]
[null,null,null,null,null,null,null,"Níveis a Exibir no Cronograma:","Nº OPERAÇÃO",null,"Nº TGOV","PROPONENTE TOMADOR",null,null,null,null,null,null,null,null,"APELIDO EMPREENDIMENTO",null,null,null,null,{"$f":"IF(TIPOORCAMENTO=\"Licitado\",\"NOME DA EMPRESA\",\"DESCRIÇÃO DO LOTE\")","v":"DESCRIÇÃO DO LOTE"},null,null,null,null,null,{"$f":"IF(TIPOORCAMENTO=\"Licitado\",\"Nº CTEF\",\"\")","v":""}]
["Lista Níveis a Exibir",null,null,null,null,null,"FILTRO",null,{"$f":"Import.CR","v":0},null,{"$f":"Import.TransfereGOV","v":0},{"$f":"Import.Proponente","v":"MUNICÍPIO DE SÃO VALENTIN"},null,null,null,null,null,null,null,null,{"$f":"Import.Apelido","v":"COBERTURA RUA PEDRO DASSOLER"},null,null,null,null,{"$f":"IF(TIPOORCAMENTO=\"Licitado\",Import.empresa,Import.DescLote)","v":0},null,null,null,null,null,{"$f":"IF(TIPOORCAMENTO=\"Licitado\",Import.CTEF,\"\")","v":""}]
[2]
[3,null,null,null,null,{"$f":"CRONO.LinhasNecessarias","v":3},null,2,null,null,{"$f":"IF(MAX($B$13:$B$23)<CRONO.LinhasNecessarias,\"ERRO: NÚMERO DE LINHAS DO CRONOGRAMA INSUFICIENTE. CLIQUE EM ATUALIZAR LINHAS.\",IF(AND(ACOMPANHAMENTO=\"PLE\",ROUND(OFFSET($AG$33,0,-1),2)=0),\"CRONOGRAMA DEVE SER PREENCHIDO POR EVENTOS\",IF(ROUND(OFFSET($AG$33,0,-1),2)<>$R$24,\"ERRO: CRONOGRAMA NÃO FECHA 100%\",\"\")))","v":""}]
[4,null,null,null,null,{"$f":"CRONO.ParcelaFinal","v":2}]
["Lista Macrosserviços",null,null,null,{"$f":"OFFSET(E12,0,-1)+1","v":1},null,"↓","Falta distribuir:","Item","Descrição",null,null,null,null,null,null,null,null,"Valor (R$)","Parcelas:",1,{"$f":"OFFSET(V12,0,-1)+1","v":2},{"$f":"OFFSET(W12,0,-1)+1","v":3},4,5,6,7,8,9,10,11,12]
[null,"Item CRONO","CP","OU",{"$f":"OFFSET(E13,0,-1)+41-DAY(OFFSET(E13,0,-1)+40)","v":{"$error":"#VALUE!"}},"Linha PO\nLinha QCI\nTotal Adm Local",null,null,null,null,null,null,"Nível",1,2,3,4,"Linhas a somar",null,null,"2026-06-01",{"$f":"OFFSET(V13,0,-1)+41-DAY(OFFSET(V13,0,-1)+40)","v":"2026-07-01"},{"$f":"OFFSET(W13,0,-1)+41-DAY(OFFSET(W13,0,-1)+40)","v":"2026-08-01"},{"$f":"OFFSET(X13,0,-1)+41-DAY(OFFSET(X13,0,-1)+40)","v":"2026-09-01"},"2026-10-01","2026-11-01","2026-12-01","2027-01-01","2027-02-01","2027-03-01","2027-04-01","2027-05-01"]
[{"$f":"IF($M14>1,_xlfn.CONCAT($I14,\" \",$J14),\"\")","v":""},{"$f":"OFFSET(B14,-3,0)+1","v":1},{"$f":"IF($R14<>2,0,IF($S14=0,1,IF(F15>0,OFFSET(QCI!$M$13,SUBSTITUTE(F15,\".\",\"\"),0),OFFSET(ORÇAMENTO!$AA$15,CRONO!$F14,0))/$S14))","v":0},{"$f":"IF($R14<>2,0,IF($S14=0,1,IF(F15>0,OFFSET(QCI!$N$13,SUBSTITUTE(F15,\".\",\"\"),0),OFFSET(ORÇAMENTO!$AB$15,CRONO!$F14,0))/$S14))","v":0},{"$f":"IF(AND($R14=2,ACOMPANHAMENTO=\"BM\"),ROUND(E15,4),E16/$S14)","v":0.44255796186214624},{"$f":"IF(B14<=ORÇAMENTO.MáximoListaCrono,MATCH(B14,ORÇAMENTO.ListaCrono,0),NA())","v":1},{"$f":"IF(AND($F15<>-1,$S14>0),\"F\",\"\")","v":"F"},{"$f":"IF(OR(S14=0,S14=\"\"),\"Linha\",IF(AND(OR(ACOMPANHAMENTO=\"PLE\",$R14<>2),$F15=0),\"Linha\",ROUND(1-SUM(U14:AG14),4)))","v":"Linha"},{"$f":"IF($F15=0,OFFSET(ORÇAMENTO!O$15,$F14,0),IF($F15<>-1,OFFSET(QCI!$D$13,$F15,0),\"\"))","v":"1."},{"$f":"IF($F15=0,OFFSET(ORÇAMENTO!R$15,$F14,0),IF($F15<>-1,OFFSET(QCI!$G$13,$F15,0),\"\"))","v":"COBERTURA RUA PEDRO DASSOLER "},null,null,{"$f":"IF($F15=0,OFFSET(ORÇAMENTO!C$15,$F14,0),1)","v":1},{"$f":"IF($F15=-1,0,IF(N$13<=$M14,IF(ISERROR(MATCH(N$13,OFFSET($M14,1,0,ROW($M$23)-ROW($M14)-1),0)),ROW($M$23)-ROW($M14)-1,MATCH(N$13,OFFSET($M14,1,0,ROW($M$23)-ROW($M14)-1),0)-1),0))","v":8},{"$f":"IF($F15=-1,0,IF(O$13<=$M14,IF(ISERROR(MATCH(O$13,OFFSET($M14,1,0,ROW($M$23)-ROW($M14)-1),0)),ROW($M$23)-ROW($M14)-1,MATCH(O$13,OFFSET($M14,1,0,ROW($M$23)-ROW($M14)-1),0)-1),0))","v":0},{"$f":"IF($F15=-1,0,IF(P$13<=$M14,IF(ISERROR(MATCH(P$13,OFFSET($M14,1,0,ROW($M$23)-ROW($M14)-1),0)),ROW($M$23)-ROW($M14)-1,MATCH(P$13,OFFSET($M14,1,0,ROW($M$23)-ROW($M14)-1),0)-1),0))","v":0},{"$f":"IF($F15=-1,0,IF(Q$13<=$M14,IF(ISERROR(MATCH(Q$13,OFFSET($M14,1,0,ROW($M$23)-ROW($M14)-1),0)),ROW($M$23)-ROW($M14)-1,MATCH(Q$13,OFFSET($M14,1,0,ROW($M$23)-ROW($M14)-1),0)-1),0))","v":0},{"$f":"MIN(OFFSET(M14,0,1,,M14))","v":8},{"$f":"IF($F15=0,OFFSET(ORÇAMENTO!X$15,$F14,0),IF($F15<>-1,OFFSET(QCI!$O$13,$F15,0),\"\"))","v":134660.96},"% Período:",{"$f":"IF(AND($R14=2,ACOMPANHAMENTO=\"BM\"),ROUND(U15,4),U16/$S14)","v":0.44255796186214624},{"$f":"IF(AND($R14=2,ACOMPANHAMENTO=\"BM\"),ROUND(V15,4),V16/$S14)","v":0.55744203813785376},{"$f":"IF(AND($R14=2,ACOMPANHAMENTO=\"BM\"),ROUND(W15,4),W16/$S14)","v":0},{"$f":"IF(AND($R14=2,ACOMPANHAMENTO=\"BM\"),ROUND(X15,4),X16/$S14)","v":0},{"$f":"IF(AND($R14=2,ACOMPANHAMENTO=\"BM\"),ROUND(Y15,4),Y16/$S14)","v":0},{"$f":"IF(AND($R14=2,ACOMPANHAMENTO=\"BM\"),ROUND(Z15,4),Z16/$S14)","v":0},{"$f":"IF(AND($R14=2,ACOMPANHAMENTO=\"BM\"),ROUND(AA15,4),AA16/$S14)","v":0},{"$f":"IF(AND($R14=2,ACOMPANHAMENTO=\"BM\"),ROUND(AB15,4),AB16/$S14)","v":0},{"$f":"IF(AND($R14=2,ACOMPANHAMENTO=\"BM\"),ROUND(AC15,4),AC16/$S14)","v":0},{"$f":"IF(AND($R14=2,ACOMPANHAMENTO=\"BM\"),ROUND(AD15,4),AD16/$S14)","v":0},{"$f":"IF(AND($R14=2,ACOMPANHAMENTO=\"BM\"),ROUND(AE15,4),AE16/$S14)","v":0},{"$f":"IF(AND($R14=2,ACOMPANHAMENTO=\"BM\"),ROUND(AF15,4),AF16/$S14)","v":0}]
[null,null,null,null,null,{"$f":"IF(ISERROR(F14),IF(1+COUNTIF($M$13:OFFSET(M14,-1,0),1)<=MAX(QCI!$D$13:$D$24),1+COUNTIF($M$13:OFFSET(M14,-1,0),1),-1),0)","v":0},{"$f":"IF(ACOMPANHAMENTO=\"BM\",OFFSET(G15,-1,0),\"\")","v":""},{"$f":"IF(OR(S14=0,S14=\"\"),\"vazia\",IF(AND(OR(ACOMPANHAMENTO=\"PLE\",$R14<>2),$F15=0),\"calculada\",\"-->\"))","v":"calculada"},null,{"$f":"IF(AND(H14<>0,ISNUMBER(H14)),\"PREENCHA ESTA LINHA -->\",\"\")","v":""}]
[null,null,null,null,{"$f":"IF($R14=2,\n         IF(AND(ACOMPANHAMENTO=\"PLE\",ISNUMBER($F14)),\n                SUMIF((OFFSET(CÁLCULO!$AM$15:$AW$15,$F14,0,OFFSET(ORÇAMENTO!$D$15,CRONO!$F14,0))),CRONO!E$12,OFFSET(CÁLCULO!$AB$15:$AL$15,$F14,0,OFFSET(ORÇAMENTO!$D$15,CRONO!$F14,0)))\n                +IF(AND($F16<>\"\",$F16<>0),\n                        SUMIF(CÁLCULO!$AM$15:$AW$27,CRONO!E$12,CÁLCULO!$AB$15:$AL$27)/(ORÇAMENTO!$X$15-_xlfn.SINGLE(CÁLCULO.TotalAdmLocal))*CRONO!$F16,\n                        0),\n                 E15*$S14),\n          SUMIF(OFFSET($S16,1,0,$R14-2),($M14+1)&\"$\",OFFSET(E16,1,0,$R14-2)))","v":59595.28},{"$f":"IF(OR($R14<>2,AUTOEVENTO<>\"manual\",$F15>0),\"\",\n        IF(Import.TipoArredondamento=\"Tradicional\",\n              SUMIF(OFFSET(CÁLCULO!$M$15,CRONO!$F14,0,OFFSET(ORÇAMENTO!$D$15,CRONO!$F14,0)),1,OFFSET(ORÇAMENTO!$X$15,CRONO!$F14,0,OFFSET(ORÇAMENTO!$D$15,CRONO!$F14,0))),\n              0))","v":""},null,null,null,null,null,null,null,null,null,null,null,null,{"$f":"M14&\"$\"","v":"1$"},null,{"$f":"IF($R14=2,\n         IF(AND(ACOMPANHAMENTO=\"PLE\",ISNUMBER($F14)),\n                SUMIF((OFFSET(CÁLCULO!$AM$15:$AW$15,$F14,0,OFFSET(ORÇAMENTO!$D$15,CRONO!$F14,0))),CRONO!U$12,OFFSET(CÁLCULO!$AB$15:$AL$15,$F14,0,OFFSET(ORÇAMENTO!$D$15,CRONO!$F14,0)))\n                +IF(AND($F16<>\"\",$F16<>0),\n                        SUMIF(CÁLCULO!$AM$15:$AW$27,CRONO!U$12,CÁLCULO!$AB$15:$AL$27)/(ORÇAMENTO!$X$15-_xlfn.SINGLE(CÁLCULO.TotalAdmLocal))*CRONO!$F16,\n                        0),\n                 U15*$S14),\n          SUMIF(OFFSET($S16,1,0,$R14-2),($M14+1)&\"$\",OFFSET(U16,1,0,$R14-2)))","v":59595.28},{"$f":"IF($R14=2,\n         IF(AND(ACOMPANHAMENTO=\"PLE\",ISNUMBER($F14)),\n                SUMIF((OFFSET(CÁLCULO!$AM$15:$AW$15,$F14,0,OFFSET(ORÇAMENTO!$D$15,CRONO!$F14,0))),CRONO!V$12,OFFSET(CÁLCULO!$AB$15:$AL$15,$F14,0,OFFSET(ORÇAMENTO!$D$15,CRONO!$F14,0)))\n                +IF(AND($F16<>\"\",$F16<>0),\n                        SUMIF(CÁLCULO!$AM$15:$AW$27,CRONO!V$12,CÁLCULO!$AB$15:$AL$27)/(ORÇAMENTO!$X$15-_xlfn.SINGLE(CÁLCULO.TotalAdmLocal))*CRONO!$F16,\n                        0),\n                 V15*$S14),\n          SUMIF(OFFSET($S16,1,0,$R14-2),($M14+1)&\"$\",OFFSET(V16,1,0,$R14-2)))","v":75065.679999999993},{"$f":"IF($R14=2,\n         IF(AND(ACOMPANHAMENTO=\"PLE\",ISNUMBER($F14)),\n                SUMIF((OFFSET(CÁLCULO!$AM$15:$AW$15,$F14,0,OFFSET(ORÇAMENTO!$D$15,CRONO!$F14,0))),CRONO!W$12,OFFSET(CÁLCULO!$AB$15:$AL$15,$F14,0,OFFSET(ORÇAMENTO!$D$15,CRONO!$F14,0)))\n                +IF(AND($F16<>\"\",$F16<>0),\n                        SUMIF(CÁLCULO!$AM$15:$AW$27,CRONO!W$12,CÁLCULO!$AB$15:$AL$27)/(ORÇAMENTO!$X$15-_xlfn.SINGLE(CÁLCULO.TotalAdmLocal))*CRONO!$F16,\n                        0),\n                 W15*$S14),\n          SUMIF(OFFSET($S16,1,0,$R14-2),($M14+1)&\"$\",OFFSET(W16,1,0,$R14-2)))","v":0},{"$f":"IF($R14=2,\n         IF(AND(ACOMPANHAMENTO=\"PLE\",ISNUMBER($F14)),\n                SUMIF((OFFSET(CÁLCULO!$AM$15:$AW$15,$F14,0,OFFSET(ORÇAMENTO!$D$15,CRONO!$F14,0))),CRONO!X$12,OFFSET(CÁLCULO!$AB$15:$AL$15,$F14,0,OFFSET(ORÇAMENTO!$D$15,CRONO!$F14,0)))\n                +IF(AND($F16<>\"\",$F16<>0),\n                        SUMIF(CÁLCULO!$AM$15:$AW$27,CRONO!X$12,CÁLCULO!$AB$15:$AL$27)/(ORÇAMENTO!$X$15-_xlfn.SINGLE(CÁLCULO.TotalAdmLocal))*CRONO!$F16,\n                        0),\n                 X15*$S14),\n          SUMIF(OFFSET($S16,1,0,$R14-2),($M14+1)&\"$\",OFFSET(X16,1,0,$R14-2)))","v":0},{"$f":"IF($R14=2,\n         IF(AND(ACOMPANHAMENTO=\"PLE\",ISNUMBER($F14)),\n                SUMIF((OFFSET(CÁLCULO!$AM$15:$AW$15,$F14,0,OFFSET(ORÇAMENTO!$D$15,CRONO!$F14,0))),CRONO!Y$12,OFFSET(CÁLCULO!$AB$15:$AL$15,$F14,0,OFFSET(ORÇAMENTO!$D$15,CRONO!$F14,0)))\n                +IF(AND($F16<>\"\",$F16<>0),\n                        SUMIF(CÁLCULO!$AM$15:$AW$27,CRONO!Y$12,CÁLCULO!$AB$15:$AL$27)/(ORÇAMENTO!$X$15-_xlfn.SINGLE(CÁLCULO.TotalAdmLocal))*CRONO!$F16,\n                        0),\n                 Y15*$S14),\n          SUMIF(OFFSET($S16,1,0,$R14-2),($M14+1)&\"$\",OFFSET(Y16,1,0,$R14-2)))","v":0},{"$f":"IF($R14=2,\n         IF(AND(ACOMPANHAMENTO=\"PLE\",ISNUMBER($F14)),\n                SUMIF((OFFSET(CÁLCULO!$AM$15:$AW$15,$F14,0,OFFSET(ORÇAMENTO!$D$15,CRONO!$F14,0))),CRONO!Z$12,OFFSET(CÁLCULO!$AB$15:$AL$15,$F14,0,OFFSET(ORÇAMENTO!$D$15,CRONO!$F14,0)))\n                +IF(AND($F16<>\"\",$F16<>0),\n                        SUMIF(CÁLCULO!$AM$15:$AW$27,CRONO!Z$12,CÁLCULO!$AB$15:$AL$27)/(ORÇAMENTO!$X$15-_xlfn.SINGLE(CÁLCULO.TotalAdmLocal))*CRONO!$F16,\n                        0),\n                 Z15*$S14),\n          SUMIF(OFFSET($S16,1,0,$R14-2),($M14+1)&\"$\",OFFSET(Z16,1,0,$R14-2)))","v":0},{"$f":"IF($R14=2,\n         IF(AND(ACOMPANHAMENTO=\"PLE\",ISNUMBER($F14)),\n                SUMIF((OFFSET(CÁLCULO!$AM$15:$AW$15,$F14,0,OFFSET(ORÇAMENTO!$D$15,CRONO!$F14,0))),CRONO!AA$12,OFFSET(CÁLCULO!$AB$15:$AL$15,$F14,0,OFFSET(ORÇAMENTO!$D$15,CRONO!$F14,0)))\n                +IF(AND($F16<>\"\",$F16<>0),\n                        SUMIF(CÁLCULO!$AM$15:$AW$27,CRONO!AA$12,CÁLCULO!$AB$15:$AL$27)/(ORÇAMENTO!$X$15-_xlfn.SINGLE(CÁLCULO.TotalAdmLocal))*CRONO!$F16,\n                        0),\n                 AA15*$S14),\n          SUMIF(OFFSET($S16,1,0,$R14-2),($M14+1)&\"$\",OFFSET(AA16,1,0,$R14-2)))","v":0},{"$f":"IF($R14=2,\n         IF(AND(ACOMPANHAMENTO=\"PLE\",ISNUMBER($F14)),\n                SUMIF((OFFSET(CÁLCULO!$AM$15:$AW$15,$F14,0,OFFSET(ORÇAMENTO!$D$15,CRONO!$F14,0))),CRONO!AB$12,OFFSET(CÁLCULO!$AB$15:$AL$15,$F14,0,OFFSET(ORÇAMENTO!$D$15,CRONO!$F14,0)))\n                +IF(AND($F16<>\"\",$F16<>0),\n                        SUMIF(CÁLCULO!$AM$15:$AW$27,CRONO!AB$12,CÁLCULO!$AB$15:$AL$27)/(ORÇAMENTO!$X$15-_xlfn.SINGLE(CÁLCULO.TotalAdmLocal))*CRONO!$F16,\n                        0),\n                 AB15*$S14),\n          SUMIF(OFFSET($S16,1,0,$R14-2),($M14+1)&\"$\",OFFSET(AB16,1,0,$R14-2)))","v":0},{"$f":"IF($R14=2,\n         IF(AND(ACOMPANHAMENTO=\"PLE\",ISNUMBER($F14)),\n                SUMIF((OFFSET(CÁLCULO!$AM$15:$AW$15,$F14,0,OFFSET(ORÇAMENTO!$D$15,CRONO!$F14,0))),CRONO!AC$12,OFFSET(CÁLCULO!$AB$15:$AL$15,$F14,0,OFFSET(ORÇAMENTO!$D$15,CRONO!$F14,0)))\n                +IF(AND($F16<>\"\",$F16<>0),\n                        SUMIF(CÁLCULO!$AM$15:$AW$27,CRONO!AC$12,CÁLCULO!$AB$15:$AL$27)/(ORÇAMENTO!$X$15-_xlfn.SINGLE(CÁLCULO.TotalAdmLocal))*CRONO!$F16,\n                        0),\n                 AC15*$S14),\n          SUMIF(OFFSET($S16,1,0,$R14-2),($M14+1)&\"$\",OFFSET(AC16,1,0,$R14-2)))","v":0},{"$f":"IF($R14=2,\n         IF(AND(ACOMPANHAMENTO=\"PLE\",ISNUMBER($F14)),\n                SUMIF((OFFSET(CÁLCULO!$AM$15:$AW$15,$F14,0,OFFSET(ORÇAMENTO!$D$15,CRONO!$F14,0))),CRONO!AD$12,OFFSET(CÁLCULO!$AB$15:$AL$15,$F14,0,OFFSET(ORÇAMENTO!$D$15,CRONO!$F14,0)))\n                +IF(AND($F16<>\"\",$F16<>0),\n                        SUMIF(CÁLCULO!$AM$15:$AW$27,CRONO!AD$12,CÁLCULO!$AB$15:$AL$27)/(ORÇAMENTO!$X$15-_xlfn.SINGLE(CÁLCULO.TotalAdmLocal))*CRONO!$F16,\n                        0),\n                 AD15*$S14),\n          SUMIF(OFFSET($S16,1,0,$R14-2),($M14+1)&\"$\",OFFSET(AD16,1,0,$R14-2)))","v":0},{"$f":"IF($R14=2,\n         IF(AND(ACOMPANHAMENTO=\"PLE\",ISNUMBER($F14)),\n                SUMIF((OFFSET(CÁLCULO!$AM$15:$AW$15,$F14,0,OFFSET(ORÇAMENTO!$D$15,CRONO!$F14,0))),CRONO!AE$12,OFFSET(CÁLCULO!$AB$15:$AL$15,$F14,0,OFFSET(ORÇAMENTO!$D$15,CRONO!$F14,0)))\n                +IF(AND($F16<>\"\",$F16<>0),\n                        SUMIF(CÁLCULO!$AM$15:$AW$27,CRONO!AE$12,CÁLCULO!$AB$15:$AL$27)/(ORÇAMENTO!$X$15-_xlfn.SINGLE(CÁLCULO.TotalAdmLocal))*CRONO!$F16,\n                        0),\n                 AE15*$S14),\n          SUMIF(OFFSET($S16,1,0,$R14-2),($M14+1)&\"$\",OFFSET(AE16,1,0,$R14-2)))","v":0},{"$f":"IF($R14=2,\n         IF(AND(ACOMPANHAMENTO=\"PLE\",ISNUMBER($F14)),\n                SUMIF((OFFSET(CÁLCULO!$AM$15:$AW$15,$F14,0,OFFSET(ORÇAMENTO!$D$15,CRONO!$F14,0))),CRONO!AF$12,OFFSET(CÁLCULO!$AB$15:$AL$15,$F14,0,OFFSET(ORÇAMENTO!$D$15,CRONO!$F14,0)))\n                +IF(AND($F16<>\"\",$F16<>0),\n                        SUMIF(CÁLCULO!$AM$15:$AW$27,CRONO!AF$12,CÁLCULO!$AB$15:$AL$27)/(ORÇAMENTO!$X$15-_xlfn.SINGLE(CÁLCULO.TotalAdmLocal))*CRONO!$F16,\n                        0),\n                 AF15*$S14),\n          SUMIF(OFFSET($S16,1,0,$R14-2),($M14+1)&\"$\",OFFSET(AF16,1,0,$R14-2)))","v":0}]
[{"$f":"IF($M17>1,_xlfn.CONCAT($I17,\" \",$J17),\"\")","v":"1.1. PILARES PRÉ MOLDADO 20X25 CM"},{"$f":"OFFSET(B17,-3,0)+1","v":2},{"$f":"IF($R17<>2,0,IF($S17=0,1,IF(F18>0,OFFSET(QCI!$M$13,SUBSTITUTE(F18,\".\",\"\"),0),OFFSET(ORÇAMENTO!$AA$15,CRONO!$F17,0))/$S17))","v":1},{"$f":"IF($R17<>2,0,IF($S17=0,1,IF(F18>0,OFFSET(QCI!$N$13,SUBSTITUTE(F18,\".\",\"\"),0),OFFSET(ORÇAMENTO!$AB$15,CRONO!$F17,0))/$S17))","v":0},{"$f":"IF(AND($R17=2,ACOMPANHAMENTO=\"BM\"),ROUND(E18,4),E19/$S17)","v":1},{"$f":"IF(B17<=ORÇAMENTO.MáximoListaCrono,MATCH(B17,ORÇAMENTO.ListaCrono,0),NA())","v":2},{"$f":"IF(AND($F18<>-1,$S17>0),\"F\",\"\")","v":"F"},{"$f":"IF(OR(S17=0,S17=\"\"),\"Linha\",IF(AND(OR(ACOMPANHAMENTO=\"PLE\",$R17<>2),$F18=0),\"Linha\",ROUND(1-SUM(U17:AG17),4)))","v":"Linha"},{"$f":"IF($F18=0,OFFSET(ORÇAMENTO!O$15,$F17,0),IF($F18<>-1,OFFSET(QCI!$D$13,$F18,0),\"\"))","v":"1.1."},{"$f":"IF($F18=0,OFFSET(ORÇAMENTO!R$15,$F17,0),IF($F18<>-1,OFFSET(QCI!$G$13,$F18,0),\"\"))","v":"PILARES PRÉ MOLDADO 20X25 CM"},null,null,{"$f":"IF($F18=0,OFFSET(ORÇAMENTO!C$15,$F17,0),1)","v":2},{"$f":"IF($F18=-1,0,IF(N$13<=$M17,IF(ISERROR(MATCH(N$13,OFFSET($M17,1,0,ROW($M$23)-ROW($M17)-1),0)),ROW($M$23)-ROW($M17)-1,MATCH(N$13,OFFSET($M17,1,0,ROW($M$23)-ROW($M17)-1),0)-1),0))","v":5},{"$f":"IF($F18=-1,0,IF(O$13<=$M17,IF(ISERROR(MATCH(O$13,OFFSET($M17,1,0,ROW($M$23)-ROW($M17)-1),0)),ROW($M$23)-ROW($M17)-1,MATCH(O$13,OFFSET($M17,1,0,ROW($M$23)-ROW($M17)-1),0)-1),0))","v":2},{"$f":"IF($F18=-1,0,IF(P$13<=$M17,IF(ISERROR(MATCH(P$13,OFFSET($M17,1,0,ROW($M$23)-ROW($M17)-1),0)),ROW($M$23)-ROW($M17)-1,MATCH(P$13,OFFSET($M17,1,0,ROW($M$23)-ROW($M17)-1),0)-1),0))","v":0},{"$f":"IF($F18=-1,0,IF(Q$13<=$M17,IF(ISERROR(MATCH(Q$13,OFFSET($M17,1,0,ROW($M$23)-ROW($M17)-1),0)),ROW($M$23)-ROW($M17)-1,MATCH(Q$13,OFFSET($M17,1,0,ROW($M$23)-ROW($M17)-1),0)-1),0))","v":0},{"$f":"MIN(OFFSET(M17,0,1,,M17))","v":2},{"$f":"IF($F18=0,OFFSET(ORÇAMENTO!X$15,$F17,0),IF($F18<>-1,OFFSET(QCI!$O$13,$F18,0),\"\"))","v":14441.56},"% Período:",{"$f":"IF(AND($R17=2,ACOMPANHAMENTO=\"BM\"),ROUND(U18,4),U19/$S17)","v":1},{"$f":"IF(AND($R17=2,ACOMPANHAMENTO=\"BM\"),ROUND(V18,4),V19/$S17)","v":0},{"$f":"IF(AND($R17=2,ACOMPANHAMENTO=\"BM\"),ROUND(W18,4),W19/$S17)","v":0},{"$f":"IF(AND($R17=2,ACOMPANHAMENTO=\"BM\"),ROUND(X18,4),X19/$S17)","v":0},{"$f":"IF(AND($R17=2,ACOMPANHAMENTO=\"BM\"),ROUND(Y18,4),Y19/$S17)","v":0},{"$f":"IF(AND($R17=2,ACOMPANHAMENTO=\"BM\"),ROUND(Z18,4),Z19/$S17)","v":0},{"$f":"IF(AND($R17=2,ACOMPANHAMENTO=\"BM\"),ROUND(AA18,4),AA19/$S17)","v":0},{"$f":"IF(AND($R17=2,ACOMPANHAMENTO=\"BM\"),ROUND(AB18,4),AB19/$S17)","v":0},{"$f":"IF(AND($R17=2,ACOMPANHAMENTO=\"BM\"),ROUND(AC18,4),AC19/$S17)","v":0},{"$f":"IF(AND($R17=2,ACOMPANHAMENTO=\"BM\"),ROUND(AD18,4),AD19/$S17)","v":0},{"$f":"IF(AND($R17=2,ACOMPANHAMENTO=\"BM\"),ROUND(AE18,4),AE19/$S17)","v":0},{"$f":"IF(AND($R17=2,ACOMPANHAMENTO=\"BM\"),ROUND(AF18,4),AF19/$S17)","v":0}]
[null,null,null,null,null,{"$f":"IF(ISERROR(F17),IF(1+COUNTIF($M$13:OFFSET(M17,-1,0),1)<=MAX(QCI!$D$13:$D$24),1+COUNTIF($M$13:OFFSET(M17,-1,0),1),-1),0)","v":0},{"$f":"IF(ACOMPANHAMENTO=\"BM\",OFFSET(G18,-1,0),\"\")","v":""},{"$f":"IF(OR(S17=0,S17=\"\"),\"vazia\",IF(AND(OR(ACOMPANHAMENTO=\"PLE\",$R17<>2),$F18=0),\"calculada\",\"-->\"))","v":"calculada"},null,{"$f":"IF(AND(H17<>0,ISNUMBER(H17)),\"PREENCHA ESTA LINHA -->\",\"\")","v":""}]
[null,null,null,null,{"$f":"IF($R17=2,\n         IF(AND(ACOMPANHAMENTO=\"PLE\",ISNUMBER($F17)),\n                SUMIF((OFFSET(CÁLCULO!$AM$15:$AW$15,$F17,0,OFFSET(ORÇAMENTO!$D$15,CRONO!$F17,0))),CRONO!E$12,OFFSET(CÁLCULO!$AB$15:$AL$15,$F17,0,OFFSET(ORÇAMENTO!$D$15,CRONO!$F17,0)))\n                +IF(AND($F19<>\"\",$F19<>0),\n                        SUMIF(CÁLCULO!$AM$15:$AW$27,CRONO!E$12,CÁLCULO!$AB$15:$AL$27)/(ORÇAMENTO!$X$15-_xlfn.SINGLE(CÁLCULO.TotalAdmLocal))*CRONO!$F19,\n                        0),\n                 E18*$S17),\n          SUMIF(OFFSET($S19,1,0,$R17-2),($M17+1)&\"$\",OFFSET(E19,1,0,$R17-2)))","v":14441.56},{"$f":"IF(OR($R17<>2,AUTOEVENTO<>\"manual\",$F18>0),\"\",\n        IF(Import.TipoArredondamento=\"Tradicional\",\n              SUMIF(OFFSET(CÁLCULO!$M$15,CRONO!$F17,0,OFFSET(ORÇAMENTO!$D$15,CRONO!$F17,0)),1,OFFSET(ORÇAMENTO!$X$15,CRONO!$F17,0,OFFSET(ORÇAMENTO!$D$15,CRONO!$F17,0))),\n              0))","v":""},null,null,null,null,null,null,null,null,null,null,null,null,{"$f":"M17&\"$\"","v":"2$"},null,{"$f":"IF($R17=2,\n         IF(AND(ACOMPANHAMENTO=\"PLE\",ISNUMBER($F17)),\n                SUMIF((OFFSET(CÁLCULO!$AM$15:$AW$15,$F17,0,OFFSET(ORÇAMENTO!$D$15,CRONO!$F17,0))),CRONO!U$12,OFFSET(CÁLCULO!$AB$15:$AL$15,$F17,0,OFFSET(ORÇAMENTO!$D$15,CRONO!$F17,0)))\n                +IF(AND($F19<>\"\",$F19<>0),\n                        SUMIF(CÁLCULO!$AM$15:$AW$27,CRONO!U$12,CÁLCULO!$AB$15:$AL$27)/(ORÇAMENTO!$X$15-_xlfn.SINGLE(CÁLCULO.TotalAdmLocal))*CRONO!$F19,\n                        0),\n                 U18*$S17),\n          SUMIF(OFFSET($S19,1,0,$R17-2),($M17+1)&\"$\",OFFSET(U19,1,0,$R17-2)))","v":14441.56},{"$f":"IF($R17=2,\n         IF(AND(ACOMPANHAMENTO=\"PLE\",ISNUMBER($F17)),\n                SUMIF((OFFSET(CÁLCULO!$AM$15:$AW$15,$F17,0,OFFSET(ORÇAMENTO!$D$15,CRONO!$F17,0))),CRONO!V$12,OFFSET(CÁLCULO!$AB$15:$AL$15,$F17,0,OFFSET(ORÇAMENTO!$D$15,CRONO!$F17,0)))\n                +IF(AND($F19<>\"\",$F19<>0),\n                        SUMIF(CÁLCULO!$AM$15:$AW$27,CRONO!V$12,CÁLCULO!$AB$15:$AL$27)/(ORÇAMENTO!$X$15-_xlfn.SINGLE(CÁLCULO.TotalAdmLocal))*CRONO!$F19,\n                        0),\n                 V18*$S17),\n          SUMIF(OFFSET($S19,1,0,$R17-2),($M17+1)&\"$\",OFFSET(V19,1,0,$R17-2)))","v":0},{"$f":"IF($R17=2,\n         IF(AND(ACOMPANHAMENTO=\"PLE\",ISNUMBER($F17)),\n                SUMIF((OFFSET(CÁLCULO!$AM$15:$AW$15,$F17,0,OFFSET(ORÇAMENTO!$D$15,CRONO!$F17,0))),CRONO!W$12,OFFSET(CÁLCULO!$AB$15:$AL$15,$F17,0,OFFSET(ORÇAMENTO!$D$15,CRONO!$F17,0)))\n                +IF(AND($F19<>\"\",$F19<>0),\n                        SUMIF(CÁLCULO!$AM$15:$AW$27,CRONO!W$12,CÁLCULO!$AB$15:$AL$27)/(ORÇAMENTO!$X$15-_xlfn.SINGLE(CÁLCULO.TotalAdmLocal))*CRONO!$F19,\n                        0),\n                 W18*$S17),\n          SUMIF(OFFSET($S19,1,0,$R17-2),($M17+1)&\"$\",OFFSET(W19,1,0,$R17-2)))","v":0},{"$f":"IF($R17=2,\n         IF(AND(ACOMPANHAMENTO=\"PLE\",ISNUMBER($F17)),\n                SUMIF((OFFSET(CÁLCULO!$AM$15:$AW$15,$F17,0,OFFSET(ORÇAMENTO!$D$15,CRONO!$F17,0))),CRONO!X$12,OFFSET(CÁLCULO!$AB$15:$AL$15,$F17,0,OFFSET(ORÇAMENTO!$D$15,CRONO!$F17,0)))\n                +IF(AND($F19<>\"\",$F19<>0),\n                        SUMIF(CÁLCULO!$AM$15:$AW$27,CRONO!X$12,CÁLCULO!$AB$15:$AL$27)/(ORÇAMENTO!$X$15-_xlfn.SINGLE(CÁLCULO.TotalAdmLocal))*CRONO!$F19,\n                        0),\n                 X18*$S17),\n          SUMIF(OFFSET($S19,1,0,$R17-2),($M17+1)&\"$\",OFFSET(X19,1,0,$R17-2)))","v":0},{"$f":"IF($R17=2,\n         IF(AND(ACOMPANHAMENTO=\"PLE\",ISNUMBER($F17)),\n                SUMIF((OFFSET(CÁLCULO!$AM$15:$AW$15,$F17,0,OFFSET(ORÇAMENTO!$D$15,CRONO!$F17,0))),CRONO!Y$12,OFFSET(CÁLCULO!$AB$15:$AL$15,$F17,0,OFFSET(ORÇAMENTO!$D$15,CRONO!$F17,0)))\n                +IF(AND($F19<>\"\",$F19<>0),\n                        SUMIF(CÁLCULO!$AM$15:$AW$27,CRONO!Y$12,CÁLCULO!$AB$15:$AL$27)/(ORÇAMENTO!$X$15-_xlfn.SINGLE(CÁLCULO.TotalAdmLocal))*CRONO!$F19,\n                        0),\n                 Y18*$S17),\n          SUMIF(OFFSET($S19,1,0,$R17-2),($M17+1)&\"$\",OFFSET(Y19,1,0,$R17-2)))","v":0},{"$f":"IF($R17=2,\n         IF(AND(ACOMPANHAMENTO=\"PLE\",ISNUMBER($F17)),\n                SUMIF((OFFSET(CÁLCULO!$AM$15:$AW$15,$F17,0,OFFSET(ORÇAMENTO!$D$15,CRONO!$F17,0))),CRONO!Z$12,OFFSET(CÁLCULO!$AB$15:$AL$15,$F17,0,OFFSET(ORÇAMENTO!$D$15,CRONO!$F17,0)))\n                +IF(AND($F19<>\"\",$F19<>0),\n                        SUMIF(CÁLCULO!$AM$15:$AW$27,CRONO!Z$12,CÁLCULO!$AB$15:$AL$27)/(ORÇAMENTO!$X$15-_xlfn.SINGLE(CÁLCULO.TotalAdmLocal))*CRONO!$F19,\n                        0),\n                 Z18*$S17),\n          SUMIF(OFFSET($S19,1,0,$R17-2),($M17+1)&\"$\",OFFSET(Z19,1,0,$R17-2)))","v":0},{"$f":"IF($R17=2,\n         IF(AND(ACOMPANHAMENTO=\"PLE\",ISNUMBER($F17)),\n                SUMIF((OFFSET(CÁLCULO!$AM$15:$AW$15,$F17,0,OFFSET(ORÇAMENTO!$D$15,CRONO!$F17,0))),CRONO!AA$12,OFFSET(CÁLCULO!$AB$15:$AL$15,$F17,0,OFFSET(ORÇAMENTO!$D$15,CRONO!$F17,0)))\n                +IF(AND($F19<>\"\",$F19<>0),\n                        SUMIF(CÁLCULO!$AM$15:$AW$27,CRONO!AA$12,CÁLCULO!$AB$15:$AL$27)/(ORÇAMENTO!$X$15-_xlfn.SINGLE(CÁLCULO.TotalAdmLocal))*CRONO!$F19,\n                        0),\n                 AA18*$S17),\n          SUMIF(OFFSET($S19,1,0,$R17-2),($M17+1)&\"$\",OFFSET(AA19,1,0,$R17-2)))","v":0},{"$f":"IF($R17=2,\n         IF(AND(ACOMPANHAMENTO=\"PLE\",ISNUMBER($F17)),\n                SUMIF((OFFSET(CÁLCULO!$AM$15:$AW$15,$F17,0,OFFSET(ORÇAMENTO!$D$15,CRONO!$F17,0))),CRONO!AB$12,OFFSET(CÁLCULO!$AB$15:$AL$15,$F17,0,OFFSET(ORÇAMENTO!$D$15,CRONO!$F17,0)))\n                +IF(AND($F19<>\"\",$F19<>0),\n                        SUMIF(CÁLCULO!$AM$15:$AW$27,CRONO!AB$12,CÁLCULO!$AB$15:$AL$27)/(ORÇAMENTO!$X$15-_xlfn.SINGLE(CÁLCULO.TotalAdmLocal))*CRONO!$F19,\n                        0),\n                 AB18*$S17),\n          SUMIF(OFFSET($S19,1,0,$R17-2),($M17+1)&\"$\",OFFSET(AB19,1,0,$R17-2)))","v":0},{"$f":"IF($R17=2,\n         IF(AND(ACOMPANHAMENTO=\"PLE\",ISNUMBER($F17)),\n                SUMIF((OFFSET(CÁLCULO!$AM$15:$AW$15,$F17,0,OFFSET(ORÇAMENTO!$D$15,CRONO!$F17,0))),CRONO!AC$12,OFFSET(CÁLCULO!$AB$15:$AL$15,$F17,0,OFFSET(ORÇAMENTO!$D$15,CRONO!$F17,0)))\n                +IF(AND($F19<>\"\",$F19<>0),\n                        SUMIF(CÁLCULO!$AM$15:$AW$27,CRONO!AC$12,CÁLCULO!$AB$15:$AL$27)/(ORÇAMENTO!$X$15-_xlfn.SINGLE(CÁLCULO.TotalAdmLocal))*CRONO!$F19,\n                        0),\n                 AC18*$S17),\n          SUMIF(OFFSET($S19,1,0,$R17-2),($M17+1)&\"$\",OFFSET(AC19,1,0,$R17-2)))","v":0},{"$f":"IF($R17=2,\n         IF(AND(ACOMPANHAMENTO=\"PLE\",ISNUMBER($F17)),\n                SUMIF((OFFSET(CÁLCULO!$AM$15:$AW$15,$F17,0,OFFSET(ORÇAMENTO!$D$15,CRONO!$F17,0))),CRONO!AD$12,OFFSET(CÁLCULO!$AB$15:$AL$15,$F17,0,OFFSET(ORÇAMENTO!$D$15,CRONO!$F17,0)))\n                +IF(AND($F19<>\"\",$F19<>0),\n                        SUMIF(CÁLCULO!$AM$15:$AW$27,CRONO!AD$12,CÁLCULO!$AB$15:$AL$27)/(ORÇAMENTO!$X$15-_xlfn.SINGLE(CÁLCULO.TotalAdmLocal))*CRONO!$F19,\n                        0),\n                 AD18*$S17),\n          SUMIF(OFFSET($S19,1,0,$R17-2),($M17+1)&\"$\",OFFSET(AD19,1,0,$R17-2)))","v":0},{"$f":"IF($R17=2,\n         IF(AND(ACOMPANHAMENTO=\"PLE\",ISNUMBER($F17)),\n                SUMIF((OFFSET(CÁLCULO!$AM$15:$AW$15,$F17,0,OFFSET(ORÇAMENTO!$D$15,CRONO!$F17,0))),CRONO!AE$12,OFFSET(CÁLCULO!$AB$15:$AL$15,$F17,0,OFFSET(ORÇAMENTO!$D$15,CRONO!$F17,0)))\n                +IF(AND($F19<>\"\",$F19<>0),\n                        SUMIF(CÁLCULO!$AM$15:$AW$27,CRONO!AE$12,CÁLCULO!$AB$15:$AL$27)/(ORÇAMENTO!$X$15-_xlfn.SINGLE(CÁLCULO.TotalAdmLocal))*CRONO!$F19,\n                        0),\n                 AE18*$S17),\n          SUMIF(OFFSET($S19,1,0,$R17-2),($M17+1)&\"$\",OFFSET(AE19,1,0,$R17-2)))","v":0},{"$f":"IF($R17=2,\n         IF(AND(ACOMPANHAMENTO=\"PLE\",ISNUMBER($F17)),\n                SUMIF((OFFSET(CÁLCULO!$AM$15:$AW$15,$F17,0,OFFSET(ORÇAMENTO!$D$15,CRONO!$F17,0))),CRONO!AF$12,OFFSET(CÁLCULO!$AB$15:$AL$15,$F17,0,OFFSET(ORÇAMENTO!$D$15,CRONO!$F17,0)))\n                +IF(AND($F19<>\"\",$F19<>0),\n                        SUMIF(CÁLCULO!$AM$15:$AW$27,CRONO!AF$12,CÁLCULO!$AB$15:$AL$27)/(ORÇAMENTO!$X$15-_xlfn.SINGLE(CÁLCULO.TotalAdmLocal))*CRONO!$F19,\n                        0),\n                 AF18*$S17),\n          SUMIF(OFFSET($S19,1,0,$R17-2),($M17+1)&\"$\",OFFSET(AF19,1,0,$R17-2)))","v":0}]
[{"$f":"IF($M20>1,_xlfn.CONCAT($I20,\" \",$J20),\"\")","v":"1.2. ESTRUTURA E COBERTURA "},{"$f":"OFFSET(B20,-3,0)+1","v":3},{"$f":"IF($R20<>2,0,IF($S20=0,1,IF(F21>0,OFFSET(QCI!$M$13,SUBSTITUTE(F21,\".\",\"\"),0),OFFSET(ORÇAMENTO!$AA$15,CRONO!$F20,0))/$S20))","v":1},{"$f":"IF($R20<>2,0,IF($S20=0,1,IF(F21>0,OFFSET(QCI!$N$13,SUBSTITUTE(F21,\".\",\"\"),0),OFFSET(ORÇAMENTO!$AB$15,CRONO!$F20,0))/$S20))","v":0},{"$f":"IF(AND($R20=2,ACOMPANHAMENTO=\"BM\"),ROUND(E21,4),E22/$S20)","v":0.37559428844263076},{"$f":"IF(B20<=ORÇAMENTO.MáximoListaCrono,MATCH(B20,ORÇAMENTO.ListaCrono,0),NA())","v":4},{"$f":"IF(AND($F21<>-1,$S20>0),\"F\",\"\")","v":"F"},{"$f":"IF(OR(S20=0,S20=\"\"),\"Linha\",IF(AND(OR(ACOMPANHAMENTO=\"PLE\",$R20<>2),$F21=0),\"Linha\",ROUND(1-SUM(U20:AG20),4)))","v":"Linha"},{"$f":"IF($F21=0,OFFSET(ORÇAMENTO!O$15,$F20,0),IF($F21<>-1,OFFSET(QCI!$D$13,$F21,0),\"\"))","v":"1.2."},{"$f":"IF($F21=0,OFFSET(ORÇAMENTO!R$15,$F20,0),IF($F21<>-1,OFFSET(QCI!$G$13,$F21,0),\"\"))","v":"ESTRUTURA E COBERTURA "},null,null,{"$f":"IF($F21=0,OFFSET(ORÇAMENTO!C$15,$F20,0),1)","v":2},{"$f":"IF($F21=-1,0,IF(N$13<=$M20,IF(ISERROR(MATCH(N$13,OFFSET($M20,1,0,ROW($M$23)-ROW($M20)-1),0)),ROW($M$23)-ROW($M20)-1,MATCH(N$13,OFFSET($M20,1,0,ROW($M$23)-ROW($M20)-1),0)-1),0))","v":2},{"$f":"IF($F21=-1,0,IF(O$13<=$M20,IF(ISERROR(MATCH(O$13,OFFSET($M20,1,0,ROW($M$23)-ROW($M20)-1),0)),ROW($M$23)-ROW($M20)-1,MATCH(O$13,OFFSET($M20,1,0,ROW($M$23)-ROW($M20)-1),0)-1),0))","v":2},{"$f":"IF($F21=-1,0,IF(P$13<=$M20,IF(ISERROR(MATCH(P$13,OFFSET($M20,1,0,ROW($M$23)-ROW($M20)-1),0)),ROW($M$23)-ROW($M20)-1,MATCH(P$13,OFFSET($M20,1,0,ROW($M$23)-ROW($M20)-1),0)-1),0))","v":0},{"$f":"IF($F21=-1,0,IF(Q$13<=$M20,IF(ISERROR(MATCH(Q$13,OFFSET($M20,1,0,ROW($M$23)-ROW($M20)-1),0)),ROW($M$23)-ROW($M20)-1,MATCH(Q$13,OFFSET($M20,1,0,ROW($M$23)-ROW($M20)-1),0)-1),0))","v":0},{"$f":"MIN(OFFSET(M20,0,1,,M20))","v":2},{"$f":"IF($F21=0,OFFSET(ORÇAMENTO!X$15,$F20,0),IF($F21<>-1,OFFSET(QCI!$O$13,$F21,0),\"\"))","v":120219.4},"% Período:",{"$f":"IF(AND($R20=2,ACOMPANHAMENTO=\"BM\"),ROUND(U21,4),U22/$S20)","v":0.37559428844263076},{"$f":"IF(AND($R20=2,ACOMPANHAMENTO=\"BM\"),ROUND(V21,4),V22/$S20)","v":0.62440571155736924},{"$f":"IF(AND($R20=2,ACOMPANHAMENTO=\"BM\"),ROUND(W21,4),W22/$S20)","v":0},{"$f":"IF(AND($R20=2,ACOMPANHAMENTO=\"BM\"),ROUND(X21,4),X22/$S20)","v":0},{"$f":"IF(AND($R20=2,ACOMPANHAMENTO=\"BM\"),ROUND(Y21,4),Y22/$S20)","v":0},{"$f":"IF(AND($R20=2,ACOMPANHAMENTO=\"BM\"),ROUND(Z21,4),Z22/$S20)","v":0},{"$f":"IF(AND($R20=2,ACOMPANHAMENTO=\"BM\"),ROUND(AA21,4),AA22/$S20)","v":0},{"$f":"IF(AND($R20=2,ACOMPANHAMENTO=\"BM\"),ROUND(AB21,4),AB22/$S20)","v":0},{"$f":"IF(AND($R20=2,ACOMPANHAMENTO=\"BM\"),ROUND(AC21,4),AC22/$S20)","v":0},{"$f":"IF(AND($R20=2,ACOMPANHAMENTO=\"BM\"),ROUND(AD21,4),AD22/$S20)","v":0},{"$f":"IF(AND($R20=2,ACOMPANHAMENTO=\"BM\"),ROUND(AE21,4),AE22/$S20)","v":0},{"$f":"IF(AND($R20=2,ACOMPANHAMENTO=\"BM\"),ROUND(AF21,4),AF22/$S20)","v":0}]
[null,null,null,null,null,{"$f":"IF(ISERROR(F20),IF(1+COUNTIF($M$13:OFFSET(M20,-1,0),1)<=MAX(QCI!$D$13:$D$24),1+COUNTIF($M$13:OFFSET(M20,-1,0),1),-1),0)","v":0},{"$f":"IF(ACOMPANHAMENTO=\"BM\",OFFSET(G21,-1,0),\"\")","v":""},{"$f":"IF(OR(S20=0,S20=\"\"),\"vazia\",IF(AND(OR(ACOMPANHAMENTO=\"PLE\",$R20<>2),$F21=0),\"calculada\",\"-->\"))","v":"calculada"},null,{"$f":"IF(AND(H20<>0,ISNUMBER(H20)),\"PREENCHA ESTA LINHA -->\",\"\")","v":""}]
[null,null,null,null,{"$f":"IF($R20=2,\n         IF(AND(ACOMPANHAMENTO=\"PLE\",ISNUMBER($F20)),\n                SUMIF((OFFSET(CÁLCULO!$AM$15:$AW$15,$F20,0,OFFSET(ORÇAMENTO!$D$15,CRONO!$F20,0))),CRONO!E$12,OFFSET(CÁLCULO!$AB$15:$AL$15,$F20,0,OFFSET(ORÇAMENTO!$D$15,CRONO!$F20,0)))\n                +IF(AND($F22<>\"\",$F22<>0),\n                        SUMIF(CÁLCULO!$AM$15:$AW$27,CRONO!E$12,CÁLCULO!$AB$15:$AL$27)/(ORÇAMENTO!$X$15-_xlfn.SINGLE(CÁLCULO.TotalAdmLocal))*CRONO!$F22,\n                        0),\n                 E21*$S20),\n          SUMIF(OFFSET($S22,1,0,$R20-2),($M20+1)&\"$\",OFFSET(E22,1,0,$R20-2)))","v":45153.72},{"$f":"IF(OR($R20<>2,AUTOEVENTO<>\"manual\",$F21>0),\"\",\n        IF(Import.TipoArredondamento=\"Tradicional\",\n              SUMIF(OFFSET(CÁLCULO!$M$15,CRONO!$F20,0,OFFSET(ORÇAMENTO!$D$15,CRONO!$F20,0)),1,OFFSET(ORÇAMENTO!$X$15,CRONO!$F20,0,OFFSET(ORÇAMENTO!$D$15,CRONO!$F20,0))),\n              0))","v":""},null,null,null,null,null,null,null,null,null,null,null,null,{"$f":"M20&\"$\"","v":"2$"},null,{"$f":"IF($R20=2,\n         IF(AND(ACOMPANHAMENTO=\"PLE\",ISNUMBER($F20)),\n                SUMIF((OFFSET(CÁLCULO!$AM$15:$AW$15,$F20,0,OFFSET(ORÇAMENTO!$D$15,CRONO!$F20,0))),CRONO!U$12,OFFSET(CÁLCULO!$AB$15:$AL$15,$F20,0,OFFSET(ORÇAMENTO!$D$15,CRONO!$F20,0)))\n                +IF(AND($F22<>\"\",$F22<>0),\n                        SUMIF(CÁLCULO!$AM$15:$AW$27,CRONO!U$12,CÁLCULO!$AB$15:$AL$27)/(ORÇAMENTO!$X$15-_xlfn.SINGLE(CÁLCULO.TotalAdmLocal))*CRONO!$F22,\n                        0),\n                 U21*$S20),\n          SUMIF(OFFSET($S22,1,0,$R20-2),($M20+1)&\"$\",OFFSET(U22,1,0,$R20-2)))","v":45153.72},{"$f":"IF($R20=2,\n         IF(AND(ACOMPANHAMENTO=\"PLE\",ISNUMBER($F20)),\n                SUMIF((OFFSET(CÁLCULO!$AM$15:$AW$15,$F20,0,OFFSET(ORÇAMENTO!$D$15,CRONO!$F20,0))),CRONO!V$12,OFFSET(CÁLCULO!$AB$15:$AL$15,$F20,0,OFFSET(ORÇAMENTO!$D$15,CRONO!$F20,0)))\n                +IF(AND($F22<>\"\",$F22<>0),\n                        SUMIF(CÁLCULO!$AM$15:$AW$27,CRONO!V$12,CÁLCULO!$AB$15:$AL$27)/(ORÇAMENTO!$X$15-_xlfn.SINGLE(CÁLCULO.TotalAdmLocal))*CRONO!$F22,\n                        0),\n                 V21*$S20),\n          SUMIF(OFFSET($S22,1,0,$R20-2),($M20+1)&\"$\",OFFSET(V22,1,0,$R20-2)))","v":75065.679999999993},{"$f":"IF($R20=2,\n         IF(AND(ACOMPANHAMENTO=\"PLE\",ISNUMBER($F20)),\n                SUMIF((OFFSET(CÁLCULO!$AM$15:$AW$15,$F20,0,OFFSET(ORÇAMENTO!$D$15,CRONO!$F20,0))),CRONO!W$12,OFFSET(CÁLCULO!$AB$15:$AL$15,$F20,0,OFFSET(ORÇAMENTO!$D$15,CRONO!$F20,0)))\n                +IF(AND($F22<>\"\",$F22<>0),\n                        SUMIF(CÁLCULO!$AM$15:$AW$27,CRONO!W$12,CÁLCULO!$AB$15:$AL$27)/(ORÇAMENTO!$X$15-_xlfn.SINGLE(CÁLCULO.TotalAdmLocal))*CRONO!$F22,\n                        0),\n                 W21*$S20),\n          SUMIF(OFFSET($S22,1,0,$R20-2),($M20+1)&\"$\",OFFSET(W22,1,0,$R20-2)))","v":0},{"$f":"IF($R20=2,\n         IF(AND(ACOMPANHAMENTO=\"PLE\",ISNUMBER($F20)),\n                SUMIF((OFFSET(CÁLCULO!$AM$15:$AW$15,$F20,0,OFFSET(ORÇAMENTO!$D$15,CRONO!$F20,0))),CRONO!X$12,OFFSET(CÁLCULO!$AB$15:$AL$15,$F20,0,OFFSET(ORÇAMENTO!$D$15,CRONO!$F20,0)))\n                +IF(AND($F22<>\"\",$F22<>0),\n                        SUMIF(CÁLCULO!$AM$15:$AW$27,CRONO!X$12,CÁLCULO!$AB$15:$AL$27)/(ORÇAMENTO!$X$15-_xlfn.SINGLE(CÁLCULO.TotalAdmLocal))*CRONO!$F22,\n                        0),\n                 X21*$S20),\n          SUMIF(OFFSET($S22,1,0,$R20-2),($M20+1)&\"$\",OFFSET(X22,1,0,$R20-2)))","v":0},{"$f":"IF($R20=2,\n         IF(AND(ACOMPANHAMENTO=\"PLE\",ISNUMBER($F20)),\n                SUMIF((OFFSET(CÁLCULO!$AM$15:$AW$15,$F20,0,OFFSET(ORÇAMENTO!$D$15,CRONO!$F20,0))),CRONO!Y$12,OFFSET(CÁLCULO!$AB$15:$AL$15,$F20,0,OFFSET(ORÇAMENTO!$D$15,CRONO!$F20,0)))\n                +IF(AND($F22<>\"\",$F22<>0),\n                        SUMIF(CÁLCULO!$AM$15:$AW$27,CRONO!Y$12,CÁLCULO!$AB$15:$AL$27)/(ORÇAMENTO!$X$15-_xlfn.SINGLE(CÁLCULO.TotalAdmLocal))*CRONO!$F22,\n                        0),\n                 Y21*$S20),\n          SUMIF(OFFSET($S22,1,0,$R20-2),($M20+1)&\"$\",OFFSET(Y22,1,0,$R20-2)))","v":0},{"$f":"IF($R20=2,\n         IF(AND(ACOMPANHAMENTO=\"PLE\",ISNUMBER($F20)),\n                SUMIF((OFFSET(CÁLCULO!$AM$15:$AW$15,$F20,0,OFFSET(ORÇAMENTO!$D$15,CRONO!$F20,0))),CRONO!Z$12,OFFSET(CÁLCULO!$AB$15:$AL$15,$F20,0,OFFSET(ORÇAMENTO!$D$15,CRONO!$F20,0)))\n                +IF(AND($F22<>\"\",$F22<>0),\n                        SUMIF(CÁLCULO!$AM$15:$AW$27,CRONO!Z$12,CÁLCULO!$AB$15:$AL$27)/(ORÇAMENTO!$X$15-_xlfn.SINGLE(CÁLCULO.TotalAdmLocal))*CRONO!$F22,\n                        0),\n                 Z21*$S20),\n          SUMIF(OFFSET($S22,1,0,$R20-2),($M20+1)&\"$\",OFFSET(Z22,1,0,$R20-2)))","v":0},{"$f":"IF($R20=2,\n         IF(AND(ACOMPANHAMENTO=\"PLE\",ISNUMBER($F20)),\n                SUMIF((OFFSET(CÁLCULO!$AM$15:$AW$15,$F20,0,OFFSET(ORÇAMENTO!$D$15,CRONO!$F20,0))),CRONO!AA$12,OFFSET(CÁLCULO!$AB$15:$AL$15,$F20,0,OFFSET(ORÇAMENTO!$D$15,CRONO!$F20,0)))\n                +IF(AND($F22<>\"\",$F22<>0),\n                        SUMIF(CÁLCULO!$AM$15:$AW$27,CRONO!AA$12,CÁLCULO!$AB$15:$AL$27)/(ORÇAMENTO!$X$15-_xlfn.SINGLE(CÁLCULO.TotalAdmLocal))*CRONO!$F22,\n                        0),\n                 AA21*$S20),\n          SUMIF(OFFSET($S22,1,0,$R20-2),($M20+1)&\"$\",OFFSET(AA22,1,0,$R20-2)))","v":0},{"$f":"IF($R20=2,\n         IF(AND(ACOMPANHAMENTO=\"PLE\",ISNUMBER($F20)),\n                SUMIF((OFFSET(CÁLCULO!$AM$15:$AW$15,$F20,0,OFFSET(ORÇAMENTO!$D$15,CRONO!$F20,0))),CRONO!AB$12,OFFSET(CÁLCULO!$AB$15:$AL$15,$F20,0,OFFSET(ORÇAMENTO!$D$15,CRONO!$F20,0)))\n                +IF(AND($F22<>\"\",$F22<>0),\n                        SUMIF(CÁLCULO!$AM$15:$AW$27,CRONO!AB$12,CÁLCULO!$AB$15:$AL$27)/(ORÇAMENTO!$X$15-_xlfn.SINGLE(CÁLCULO.TotalAdmLocal))*CRONO!$F22,\n                        0),\n                 AB21*$S20),\n          SUMIF(OFFSET($S22,1,0,$R20-2),($M20+1)&\"$\",OFFSET(AB22,1,0,$R20-2)))","v":0},{"$f":"IF($R20=2,\n         IF(AND(ACOMPANHAMENTO=\"PLE\",ISNUMBER($F20)),\n                SUMIF((OFFSET(CÁLCULO!$AM$15:$AW$15,$F20,0,OFFSET(ORÇAMENTO!$D$15,CRONO!$F20,0))),CRONO!AC$12,OFFSET(CÁLCULO!$AB$15:$AL$15,$F20,0,OFFSET(ORÇAMENTO!$D$15,CRONO!$F20,0)))\n                +IF(AND($F22<>\"\",$F22<>0),\n                        SUMIF(CÁLCULO!$AM$15:$AW$27,CRONO!AC$12,CÁLCULO!$AB$15:$AL$27)/(ORÇAMENTO!$X$15-_xlfn.SINGLE(CÁLCULO.TotalAdmLocal))*CRONO!$F22,\n                        0),\n                 AC21*$S20),\n          SUMIF(OFFSET($S22,1,0,$R20-2),($M20+1)&\"$\",OFFSET(AC22,1,0,$R20-2)))","v":0},{"$f":"IF($R20=2,\n         IF(AND(ACOMPANHAMENTO=\"PLE\",ISNUMBER($F20)),\n                SUMIF((OFFSET(CÁLCULO!$AM$15:$AW$15,$F20,0,OFFSET(ORÇAMENTO!$D$15,CRONO!$F20,0))),CRONO!AD$12,OFFSET(CÁLCULO!$AB$15:$AL$15,$F20,0,OFFSET(ORÇAMENTO!$D$15,CRONO!$F20,0)))\n                +IF(AND($F22<>\"\",$F22<>0),\n                        SUMIF(CÁLCULO!$AM$15:$AW$27,CRONO!AD$12,CÁLCULO!$AB$15:$AL$27)/(ORÇAMENTO!$X$15-_xlfn.SINGLE(CÁLCULO.TotalAdmLocal))*CRONO!$F22,\n                        0),\n                 AD21*$S20),\n          SUMIF(OFFSET($S22,1,0,$R20-2),($M20+1)&\"$\",OFFSET(AD22,1,0,$R20-2)))","v":0},{"$f":"IF($R20=2,\n         IF(AND(ACOMPANHAMENTO=\"PLE\",ISNUMBER($F20)),\n                SUMIF((OFFSET(CÁLCULO!$AM$15:$AW$15,$F20,0,OFFSET(ORÇAMENTO!$D$15,CRONO!$F20,0))),CRONO!AE$12,OFFSET(CÁLCULO!$AB$15:$AL$15,$F20,0,OFFSET(ORÇAMENTO!$D$15,CRONO!$F20,0)))\n                +IF(AND($F22<>\"\",$F22<>0),\n                        SUMIF(CÁLCULO!$AM$15:$AW$27,CRONO!AE$12,CÁLCULO!$AB$15:$AL$27)/(ORÇAMENTO!$X$15-_xlfn.SINGLE(CÁLCULO.TotalAdmLocal))*CRONO!$F22,\n                        0),\n                 AE21*$S20),\n          SUMIF(OFFSET($S22,1,0,$R20-2),($M20+1)&\"$\",OFFSET(AE22,1,0,$R20-2)))","v":0},{"$f":"IF($R20=2,\n         IF(AND(ACOMPANHAMENTO=\"PLE\",ISNUMBER($F20)),\n                SUMIF((OFFSET(CÁLCULO!$AM$15:$AW$15,$F20,0,OFFSET(ORÇAMENTO!$D$15,CRONO!$F20,0))),CRONO!AF$12,OFFSET(CÁLCULO!$AB$15:$AL$15,$F20,0,OFFSET(ORÇAMENTO!$D$15,CRONO!$F20,0)))\n                +IF(AND($F22<>\"\",$F22<>0),\n                        SUMIF(CÁLCULO!$AM$15:$AW$27,CRONO!AF$12,CÁLCULO!$AB$15:$AL$27)/(ORÇAMENTO!$X$15-_xlfn.SINGLE(CÁLCULO.TotalAdmLocal))*CRONO!$F22,\n                        0),\n                 AF21*$S20),\n          SUMIF(OFFSET($S22,1,0,$R20-2),($M20+1)&\"$\",OFFSET(AF22,1,0,$R20-2)))","v":0}]
[null,null,null,null,null,null,"F",null,null,null,null,null,"#"]
[null,null,null,null,{"$f":"E28/$R$24","v":0.44255796186214624},null,"F",null,{"$f":"\"Total:    R$ \"&TEXT(R24,\"#.##0,00\")","v":"Total:    R$ 134.660,96"},null,null,null,null,null,null,null,null,{"$f":"SUMIF(M12:M23,1,S12:S23)","v":134660.96},null,"%:",{"$f":"ROUND(U28,2)/$R$24","v":0.44255796186214624},0.55744203813785376,0,0,0,0,0,0,0,0,0,0]
[null,null,null,null,{"$f":"IF(E$12=1,ROUND(E30,2),ROUND(E30,2)-ROUND(D30,2))","v":0},null,"F",null,null,null,null,null,null,null,null,null,null,null,null,{"$f":"IF(import.recurso=\"FGTS\",\"Financiamento:\",\"Repasse:\")","v":"Repasse:"},{"$f":"IF(U$12=1,ROUND(U30,2),ROUND(U30,2)-ROUND(T30,2))","v":0},0,0,0,0,0,0,0,0,0,0,0]
[null,null,null,null,{"$f":"IF(E$12=1,ROUND(E31,2),ROUND(E31,2)-ROUND(D31,2))","v":59595.28},null,"F",null,null,null,null,"Período:",null,null,null,null,null,null,null,"Contrapartida:",{"$f":"IF(U$12=1,ROUND(U31,2),ROUND(U31,2)-ROUND(T31,2))","v":59595.28},75065.679999999993,0,0,0,0,0,0,0,0,0,0]
[null,null,null,null,{"$f":"IF(E$12=1,ROUND(E32,2),ROUND(E32,2)-ROUND(D32,2))","v":0},null,"F",null,null,null,null,null,null,null,null,null,null,null,null,"Outros:",{"$f":"IF(U$12=1,ROUND(U32,2),ROUND(U32,2)-ROUND(T32,2))","v":0},0,0,0,0,0,0,0,0,0,0,0]
[null,null,null,null,{"$f":"IF(E$12=1,ROUND(E33,2),ROUND(E33,2)-ROUND(D33,2))","v":59595.28},null,"F",null,null,null,null,null,null,null,null,null,null,null,null,"Investimento:",{"$f":"IF(U$12=1,ROUND(U33,2),ROUND(U33,2)-ROUND(T33,2))","v":59595.28},75065.679999999993,0,0,0,0,0,0,0,0,0,0]
[null,null,null,null,{"$f":"ROUND(ROUND(E33,2)/$R$24,4)","v":0.44259999999999999},null,"F",null,null,null,null,null,null,null,null,null,null,null,null,"%:",{"$f":"ROUND(ROUND(U33,2)/$R$24,4)","v":0.44259999999999999},1,1,1,1,1,1,1,1,1,1,1]
[null,null,null,null,{"$f":"ROUND(E33-E32-E31,2)","v":0},null,"F",null,null,null,null,null,null,null,null,null,null,null,null,{"$f":"IF(import.recurso=\"FGTS\",\"Financiamento:\",\"Repasse:\")","v":"Repasse:"},{"$f":"ROUND(U33-U32-U31,2)","v":0},0,0,0,0,0,0,0,0,0,0,0]
[null,null,null,null,{"$f":"IF(E$12=1,0,OFFSET(E31,0,-1))+SUM((OFFSET($C$13,1,0):OFFSET($C$23,-3,0))*IF(ISNUMBER(OFFSET(E$11,5,0):OFFSET(E$23,-1,0)),OFFSET(E$11,5,0):OFFSET(E$23,-1,0),0))","v":59595.28},null,"F",null,null,null,null,"Acumulado:",null,null,null,null,null,null,null,"Contrapartida:",{"$f":"IF(U$12=1,0,OFFSET(U31,0,-1))+SUM((OFFSET($C$13,1,0):OFFSET($C$23,-3,0))*IF(ISNUMBER(OFFSET(U$11,5,0):OFFSET(U$23,-1,0)),OFFSET(U$11,5,0):OFFSET(U$23,-1,0),0))","v":59595.28},{"$f":"IF(V$12=1,0,OFFSET(V31,0,-1))+SUM((OFFSET($C$13,1,0):OFFSET($C$23,-3,0))*IF(ISNUMBER(OFFSET(V$11,5,0):OFFSET(V$23,-1,0)),OFFSET(V$11,5,0):OFFSET(V$23,-1,0),0))","v":134660.96},{"$f":"IF(W$12=1,0,OFFSET(W31,0,-1))+SUM((OFFSET($C$13,1,0):OFFSET($C$23,-3,0))*IF(ISNUMBER(OFFSET(W$11,5,0):OFFSET(W$23,-1,0)),OFFSET(W$11,5,0):OFFSET(W$23,-1,0),0))","v":134660.96},{"$f":"IF(X$12=1,0,OFFSET(X31,0,-1))+SUM((OFFSET($C$13,1,0):OFFSET($C$23,-3,0))*IF(ISNUMBER(OFFSET(X$11,5,0):OFFSET(X$23,-1,0)),OFFSET(X$11,5,0):OFFSET(X$23,-1,0),0))","v":134660.96},{"$f":"IF(Y$12=1,0,OFFSET(Y31,0,-1))+SUM((OFFSET($C$13,1,0):OFFSET($C$23,-3,0))*IF(ISNUMBER(OFFSET(Y$11,5,0):OFFSET(Y$23,-1,0)),OFFSET(Y$11,5,0):OFFSET(Y$23,-1,0),0))","v":134660.96},{"$f":"IF(Z$12=1,0,OFFSET(Z31,0,-1))+SUM((OFFSET($C$13,1,0):OFFSET($C$23,-3,0))*IF(ISNUMBER(OFFSET(Z$11,5,0):OFFSET(Z$23,-1,0)),OFFSET(Z$11,5,0):OFFSET(Z$23,-1,0),0))","v":134660.96},{"$f":"IF(AA$12=1,0,OFFSET(AA31,0,-1))+SUM((OFFSET($C$13,1,0):OFFSET($C$23,-3,0))*IF(ISNUMBER(OFFSET(AA$11,5,0):OFFSET(AA$23,-1,0)),OFFSET(AA$11,5,0):OFFSET(AA$23,-1,0),0))","v":134660.96},{"$f":"IF(AB$12=1,0,OFFSET(AB31,0,-1))+SUM((OFFSET($C$13,1,0):OFFSET($C$23,-3,0))*IF(ISNUMBER(OFFSET(AB$11,5,0):OFFSET(AB$23,-1,0)),OFFSET(AB$11,5,0):OFFSET(AB$23,-1,0),0))","v":134660.96},{"$f":"IF(AC$12=1,0,OFFSET(AC31,0,-1))+SUM((OFFSET($C$13,1,0):OFFSET($C$23,-3,0))*IF(ISNUMBER(OFFSET(AC$11,5,0):OFFSET(AC$23,-1,0)),OFFSET(AC$11,5,0):OFFSET(AC$23,-1,0),0))","v":134660.96},{"$f":"IF(AD$12=1,0,OFFSET(AD31,0,-1))+SUM((OFFSET($C$13,1,0):OFFSET($C$23,-3,0))*IF(ISNUMBER(OFFSET(AD$11,5,0):OFFSET(AD$23,-1,0)),OFFSET(AD$11,5,0):OFFSET(AD$23,-1,0),0))","v":134660.96},{"$f":"IF(AE$12=1,0,OFFSET(AE31,0,-1))+SUM((OFFSET($C$13,1,0):OFFSET($C$23,-3,0))*IF(ISNUMBER(OFFSET(AE$11,5,0):OFFSET(AE$23,-1,0)),OFFSET(AE$11,5,0):OFFSET(AE$23,-1,0),0))","v":134660.96},{"$f":"IF(AF$12=1,0,OFFSET(AF31,0,-1))+SUM((OFFSET($C$13,1,0):OFFSET($C$23,-3,0))*IF(ISNUMBER(OFFSET(AF$11,5,0):OFFSET(AF$23,-1,0)),OFFSET(AF$11,5,0):OFFSET(AF$23,-1,0),0))","v":134660.96}]
[null,null,null,null,{"$f":"IF(E$12=1,0,OFFSET(E32,0,-1))+SUM((OFFSET($D$13,1,0):OFFSET($D$23,-3,0))*IF(ISNUMBER(OFFSET(E$11,5,0):OFFSET(E$23,-1,0)),OFFSET(E$11,5,0):OFFSET(E$23,-1,0),0))","v":0},null,"F",null,null,null,null,null,null,null,null,null,null,null,null,"Outros:",{"$f":"IF(U$12=1,0,OFFSET(U32,0,-1))+SUM((OFFSET($D$13,1,0):OFFSET($D$23,-3,0))*IF(ISNUMBER(OFFSET(U$11,5,0):OFFSET(U$23,-1,0)),OFFSET(U$11,5,0):OFFSET(U$23,-1,0),0))","v":0},{"$f":"IF(V$12=1,0,OFFSET(V32,0,-1))+SUM((OFFSET($D$13,1,0):OFFSET($D$23,-3,0))*IF(ISNUMBER(OFFSET(V$11,5,0):OFFSET(V$23,-1,0)),OFFSET(V$11,5,0):OFFSET(V$23,-1,0),0))","v":0},{"$f":"IF(W$12=1,0,OFFSET(W32,0,-1))+SUM((OFFSET($D$13,1,0):OFFSET($D$23,-3,0))*IF(ISNUMBER(OFFSET(W$11,5,0):OFFSET(W$23,-1,0)),OFFSET(W$11,5,0):OFFSET(W$23,-1,0),0))","v":0},{"$f":"IF(X$12=1,0,OFFSET(X32,0,-1))+SUM((OFFSET($D$13,1,0):OFFSET($D$23,-3,0))*IF(ISNUMBER(OFFSET(X$11,5,0):OFFSET(X$23,-1,0)),OFFSET(X$11,5,0):OFFSET(X$23,-1,0),0))","v":0},{"$f":"IF(Y$12=1,0,OFFSET(Y32,0,-1))+SUM((OFFSET($D$13,1,0):OFFSET($D$23,-3,0))*IF(ISNUMBER(OFFSET(Y$11,5,0):OFFSET(Y$23,-1,0)),OFFSET(Y$11,5,0):OFFSET(Y$23,-1,0),0))","v":0},{"$f":"IF(Z$12=1,0,OFFSET(Z32,0,-1))+SUM((OFFSET($D$13,1,0):OFFSET($D$23,-3,0))*IF(ISNUMBER(OFFSET(Z$11,5,0):OFFSET(Z$23,-1,0)),OFFSET(Z$11,5,0):OFFSET(Z$23,-1,0),0))","v":0},{"$f":"IF(AA$12=1,0,OFFSET(AA32,0,-1))+SUM((OFFSET($D$13,1,0):OFFSET($D$23,-3,0))*IF(ISNUMBER(OFFSET(AA$11,5,0):OFFSET(AA$23,-1,0)),OFFSET(AA$11,5,0):OFFSET(AA$23,-1,0),0))","v":0},{"$f":"IF(AB$12=1,0,OFFSET(AB32,0,-1))+SUM((OFFSET($D$13,1,0):OFFSET($D$23,-3,0))*IF(ISNUMBER(OFFSET(AB$11,5,0):OFFSET(AB$23,-1,0)),OFFSET(AB$11,5,0):OFFSET(AB$23,-1,0),0))","v":0},{"$f":"IF(AC$12=1,0,OFFSET(AC32,0,-1))+SUM((OFFSET($D$13,1,0):OFFSET($D$23,-3,0))*IF(ISNUMBER(OFFSET(AC$11,5,0):OFFSET(AC$23,-1,0)),OFFSET(AC$11,5,0):OFFSET(AC$23,-1,0),0))","v":0},{"$f":"IF(AD$12=1,0,OFFSET(AD32,0,-1))+SUM((OFFSET($D$13,1,0):OFFSET($D$23,-3,0))*IF(ISNUMBER(OFFSET(AD$11,5,0):OFFSET(AD$23,-1,0)),OFFSET(AD$11,5,0):OFFSET(AD$23,-1,0),0))","v":0},{"$f":"IF(AE$12=1,0,OFFSET(AE32,0,-1))+SUM((OFFSET($D$13,1,0):OFFSET($D$23,-3,0))*IF(ISNUMBER(OFFSET(AE$11,5,0):OFFSET(AE$23,-1,0)),OFFSET(AE$11,5,0):OFFSET(AE$23,-1,0),0))","v":0},{"$f":"IF(AF$12=1,0,OFFSET(AF32,0,-1))+SUM((OFFSET($D$13,1,0):OFFSET($D$23,-3,0))*IF(ISNUMBER(OFFSET(AF$11,5,0):OFFSET(AF$23,-1,0)),OFFSET(AF$11,5,0):OFFSET(AF$23,-1,0),0))","v":0}]
[null,null,null,null,{"$f":"SUMIF($S$12:$S$23,\"1$\",E12:E23)+IF(E$12>1,OFFSET(E33,0,-1),0)","v":59595.28},null,"F",{"$f":"IF(ACOMPANHAMENTO=\"BM\",\"Selecione o Macrosserviço da Administração Local:\",\"\")","v":""},null,null,null,null,null,null,null,null,null,null,null,"Investimento:",{"$f":"SUMIF($S$12:$S$23,\"1$\",U12:U23)+IF(U$12>1,OFFSET(U33,0,-1),0)","v":59595.28},134660.96,134660.96,134660.96,134660.96,134660.96,134660.96,134660.96,134660.96,134660.96,134660.96,134660.96]
[null,null,null,null,{"$f":"IF($F$34=\"\",\"\",\n  IF(ACOMPANHAMENTO=\"PLE\",\n     IF(AUTOEVENTO=\"Manual\",\n         IF(AdmLocal=\"Automática\",\n              E29,\n              SUMIF(OFFSET(CRONOPLE!$F$14,CRONOPLE!$A$8+1,1,1,OFFSET(CRONOPLE!$AF$12,0,-1)),\"<=\"&E$12,OFFSET(EVENTOS!$G$14,CRONOPLE!$A$8+1,1,1,OFFSET(CRONOPLE!$AF$12,0,-1)))/OFFSET(EVENTOS!$G$14,CRONOPLE!$A$8+1,-1)),\n         SUMIFS(OFFSET(CÁLCULO!$AA$15,$F$34,1,OFFSET(ORÇAMENTO!$D$15,$F$34,0),CÁLCULO.FrentesPreenchidas),OFFSET(CÁLCULO!$AL$15,$F$34,1,OFFSET(ORÇAMENTO!$D$15,$F$34,0),CÁLCULO.FrentesPreenchidas),\"<=\"&E$12)/OFFSET(ORÇAMENTO!$X$15,$F$34,0)),\n     IF(ACOMPANHAMENTO=\"BM\",SUM(OFFSET($T$13,$F$34+2,1,1,E$12))/OFFSET($S$13,$F$34,0),\"\")))","v":0.37559428844263076},{"$f":"IF(ACOMPANHAMENTO=\"PLE\",\n    IF(AUTOEVENTO=\"Manual\",\n        IF(AdmLocal=\"Automática\",1,IF(CRONOPLE!$D$8<>\"\",\"\",MATCH(Import.EventoAdmLocal,EVENTOS!$B$15:$B$18,0))),\n        IF(CRONOPLE!$D$8<>\"\",\"\",CRONOPLE!$A$10)),\n    IF($H$35<>\"\",\"\",MATCH(Import.MacrosserviçoAdmLocal,$A$13:$A$23,0)-1))","v":4},"F",null,null,null,null,null,null,null,null,null,null,null,null,"Administração Local:",{"$f":"IF($F$34=\"\",\"\",\n  IF(ACOMPANHAMENTO=\"PLE\",\n     IF(AUTOEVENTO=\"Manual\",\n         IF(AdmLocal=\"Automática\",\n              U29,\n              SUMIF(OFFSET(CRONOPLE!$F$14,CRONOPLE!$A$8+1,1,1,OFFSET(CRONOPLE!$AF$12,0,-1)),\"<=\"&U$12,OFFSET(EVENTOS!$G$14,CRONOPLE!$A$8+1,1,1,OFFSET(CRONOPLE!$AF$12,0,-1)))/OFFSET(EVENTOS!$G$14,CRONOPLE!$A$8+1,-1)),\n         SUMIFS(OFFSET(CÁLCULO!$AA$15,$F$34,1,OFFSET(ORÇAMENTO!$D$15,$F$34,0),CÁLCULO.FrentesPreenchidas),OFFSET(CÁLCULO!$AL$15,$F$34,1,OFFSET(ORÇAMENTO!$D$15,$F$34,0),CÁLCULO.FrentesPreenchidas),\"<=\"&U$12)/OFFSET(ORÇAMENTO!$X$15,$F$34,0)),\n     IF(ACOMPANHAMENTO=\"BM\",SUM(OFFSET($T$13,$F$34+2,1,1,U$12))/OFFSET($S$13,$F$34,0),\"\")))","v":0.37559428844263076},{"$f":"IF($F$34=\"\",\"\",\n  IF(ACOMPANHAMENTO=\"PLE\",\n     IF(AUTOEVENTO=\"Manual\",\n         IF(AdmLocal=\"Automática\",\n              V29,\n              SUMIF(OFFSET(CRONOPLE!$F$14,CRONOPLE!$A$8+1,1,1,OFFSET(CRONOPLE!$AF$12,0,-1)),\"<=\"&V$12,OFFSET(EVENTOS!$G$14,CRONOPLE!$A$8+1,1,1,OFFSET(CRONOPLE!$AF$12,0,-1)))/OFFSET(EVENTOS!$G$14,CRONOPLE!$A$8+1,-1)),\n         SUMIFS(OFFSET(CÁLCULO!$AA$15,$F$34,1,OFFSET(ORÇAMENTO!$D$15,$F$34,0),CÁLCULO.FrentesPreenchidas),OFFSET(CÁLCULO!$AL$15,$F$34,1,OFFSET(ORÇAMENTO!$D$15,$F$34,0),CÁLCULO.FrentesPreenchidas),\"<=\"&V$12)/OFFSET(ORÇAMENTO!$X$15,$F$34,0)),\n     IF(ACOMPANHAMENTO=\"BM\",SUM(OFFSET($T$13,$F$34+2,1,1,V$12))/OFFSET($S$13,$F$34,0),\"\")))","v":1},{"$f":"IF($F$34=\"\",\"\",\n  IF(ACOMPANHAMENTO=\"PLE\",\n     IF(AUTOEVENTO=\"Manual\",\n         IF(AdmLocal=\"Automática\",\n              W29,\n              SUMIF(OFFSET(CRONOPLE!$F$14,CRONOPLE!$A$8+1,1,1,OFFSET(CRONOPLE!$AF$12,0,-1)),\"<=\"&W$12,OFFSET(EVENTOS!$G$14,CRONOPLE!$A$8+1,1,1,OFFSET(CRONOPLE!$AF$12,0,-1)))/OFFSET(EVENTOS!$G$14,CRONOPLE!$A$8+1,-1)),\n         SUMIFS(OFFSET(CÁLCULO!$AA$15,$F$34,1,OFFSET(ORÇAMENTO!$D$15,$F$34,0),CÁLCULO.FrentesPreenchidas),OFFSET(CÁLCULO!$AL$15,$F$34,1,OFFSET(ORÇAMENTO!$D$15,$F$34,0),CÁLCULO.FrentesPreenchidas),\"<=\"&W$12)/OFFSET(ORÇAMENTO!$X$15,$F$34,0)),\n     IF(ACOMPANHAMENTO=\"BM\",SUM(OFFSET($T$13,$F$34+2,1,1,W$12))/OFFSET($S$13,$F$34,0),\"\")))","v":1},{"$f":"IF($F$34=\"\",\"\",\n  IF(ACOMPANHAMENTO=\"PLE\",\n     IF(AUTOEVENTO=\"Manual\",\n         IF(AdmLocal=\"Automática\",\n              X29,\n              SUMIF(OFFSET(CRONOPLE!$F$14,CRONOPLE!$A$8+1,1,1,OFFSET(CRONOPLE!$AF$12,0,-1)),\"<=\"&X$12,OFFSET(EVENTOS!$G$14,CRONOPLE!$A$8+1,1,1,OFFSET(CRONOPLE!$AF$12,0,-1)))/OFFSET(EVENTOS!$G$14,CRONOPLE!$A$8+1,-1)),\n         SUMIFS(OFFSET(CÁLCULO!$AA$15,$F$34,1,OFFSET(ORÇAMENTO!$D$15,$F$34,0),CÁLCULO.FrentesPreenchidas),OFFSET(CÁLCULO!$AL$15,$F$34,1,OFFSET(ORÇAMENTO!$D$15,$F$34,0),CÁLCULO.FrentesPreenchidas),\"<=\"&X$12)/OFFSET(ORÇAMENTO!$X$15,$F$34,0)),\n     IF(ACOMPANHAMENTO=\"BM\",SUM(OFFSET($T$13,$F$34+2,1,1,X$12))/OFFSET($S$13,$F$34,0),\"\")))","v":1},{"$f":"IF($F$34=\"\",\"\",\n  IF(ACOMPANHAMENTO=\"PLE\",\n     IF(AUTOEVENTO=\"Manual\",\n         IF(AdmLocal=\"Automática\",\n              Y29,\n              SUMIF(OFFSET(CRONOPLE!$F$14,CRONOPLE!$A$8+1,1,1,OFFSET(CRONOPLE!$AF$12,0,-1)),\"<=\"&Y$12,OFFSET(EVENTOS!$G$14,CRONOPLE!$A$8+1,1,1,OFFSET(CRONOPLE!$AF$12,0,-1)))/OFFSET(EVENTOS!$G$14,CRONOPLE!$A$8+1,-1)),\n         SUMIFS(OFFSET(CÁLCULO!$AA$15,$F$34,1,OFFSET(ORÇAMENTO!$D$15,$F$34,0),CÁLCULO.FrentesPreenchidas),OFFSET(CÁLCULO!$AL$15,$F$34,1,OFFSET(ORÇAMENTO!$D$15,$F$34,0),CÁLCULO.FrentesPreenchidas),\"<=\"&Y$12)/OFFSET(ORÇAMENTO!$X$15,$F$34,0)),\n     IF(ACOMPANHAMENTO=\"BM\",SUM(OFFSET($T$13,$F$34+2,1,1,Y$12))/OFFSET($S$13,$F$34,0),\"\")))","v":1},{"$f":"IF($F$34=\"\",\"\",\n  IF(ACOMPANHAMENTO=\"PLE\",\n     IF(AUTOEVENTO=\"Manual\",\n         IF(AdmLocal=\"Automática\",\n              Z29,\n              SUMIF(OFFSET(CRONOPLE!$F$14,CRONOPLE!$A$8+1,1,1,OFFSET(CRONOPLE!$AF$12,0,-1)),\"<=\"&Z$12,OFFSET(EVENTOS!$G$14,CRONOPLE!$A$8+1,1,1,OFFSET(CRONOPLE!$AF$12,0,-1)))/OFFSET(EVENTOS!$G$14,CRONOPLE!$A$8+1,-1)),\n         SUMIFS(OFFSET(CÁLCULO!$AA$15,$F$34,1,OFFSET(ORÇAMENTO!$D$15,$F$34,0),CÁLCULO.FrentesPreenchidas),OFFSET(CÁLCULO!$AL$15,$F$34,1,OFFSET(ORÇAMENTO!$D$15,$F$34,0),CÁLCULO.FrentesPreenchidas),\"<=\"&Z$12)/OFFSET(ORÇAMENTO!$X$15,$F$34,0)),\n     IF(ACOMPANHAMENTO=\"BM\",SUM(OFFSET($T$13,$F$34+2,1,1,Z$12))/OFFSET($S$13,$F$34,0),\"\")))","v":1},{"$f":"IF($F$34=\"\",\"\",\n  IF(ACOMPANHAMENTO=\"PLE\",\n     IF(AUTOEVENTO=\"Manual\",\n         IF(AdmLocal=\"Automática\",\n              AA29,\n              SUMIF(OFFSET(CRONOPLE!$F$14,CRONOPLE!$A$8+1,1,1,OFFSET(CRONOPLE!$AF$12,0,-1)),\"<=\"&AA$12,OFFSET(EVENTOS!$G$14,CRONOPLE!$A$8+1,1,1,OFFSET(CRONOPLE!$AF$12,0,-1)))/OFFSET(EVENTOS!$G$14,CRONOPLE!$A$8+1,-1)),\n         SUMIFS(OFFSET(CÁLCULO!$AA$15,$F$34,1,OFFSET(ORÇAMENTO!$D$15,$F$34,0),CÁLCULO.FrentesPreenchidas),OFFSET(CÁLCULO!$AL$15,$F$34,1,OFFSET(ORÇAMENTO!$D$15,$F$34,0),CÁLCULO.FrentesPreenchidas),\"<=\"&AA$12)/OFFSET(ORÇAMENTO!$X$15,$F$34,0)),\n     IF(ACOMPANHAMENTO=\"BM\",SUM(OFFSET($T$13,$F$34+2,1,1,AA$12))/OFFSET($S$13,$F$34,0),\"\")))","v":1},{"$f":"IF($F$34=\"\",\"\",\n  IF(ACOMPANHAMENTO=\"PLE\",\n     IF(AUTOEVENTO=\"Manual\",\n         IF(AdmLocal=\"Automática\",\n              AB29,\n              SUMIF(OFFSET(CRONOPLE!$F$14,CRONOPLE!$A$8+1,1,1,OFFSET(CRONOPLE!$AF$12,0,-1)),\"<=\"&AB$12,OFFSET(EVENTOS!$G$14,CRONOPLE!$A$8+1,1,1,OFFSET(CRONOPLE!$AF$12,0,-1)))/OFFSET(EVENTOS!$G$14,CRONOPLE!$A$8+1,-1)),\n         SUMIFS(OFFSET(CÁLCULO!$AA$15,$F$34,1,OFFSET(ORÇAMENTO!$D$15,$F$34,0),CÁLCULO.FrentesPreenchidas),OFFSET(CÁLCULO!$AL$15,$F$34,1,OFFSET(ORÇAMENTO!$D$15,$F$34,0),CÁLCULO.FrentesPreenchidas),\"<=\"&AB$12)/OFFSET(ORÇAMENTO!$X$15,$F$34,0)),\n     IF(ACOMPANHAMENTO=\"BM\",SUM(OFFSET($T$13,$F$34+2,1,1,AB$12))/OFFSET($S$13,$F$34,0),\"\")))","v":1},{"$f":"IF($F$34=\"\",\"\",\n  IF(ACOMPANHAMENTO=\"PLE\",\n     IF(AUTOEVENTO=\"Manual\",\n         IF(AdmLocal=\"Automática\",\n              AC29,\n              SUMIF(OFFSET(CRONOPLE!$F$14,CRONOPLE!$A$8+1,1,1,OFFSET(CRONOPLE!$AF$12,0,-1)),\"<=\"&AC$12,OFFSET(EVENTOS!$G$14,CRONOPLE!$A$8+1,1,1,OFFSET(CRONOPLE!$AF$12,0,-1)))/OFFSET(EVENTOS!$G$14,CRONOPLE!$A$8+1,-1)),\n         SUMIFS(OFFSET(CÁLCULO!$AA$15,$F$34,1,OFFSET(ORÇAMENTO!$D$15,$F$34,0),CÁLCULO.FrentesPreenchidas),OFFSET(CÁLCULO!$AL$15,$F$34,1,OFFSET(ORÇAMENTO!$D$15,$F$34,0),CÁLCULO.FrentesPreenchidas),\"<=\"&AC$12)/OFFSET(ORÇAMENTO!$X$15,$F$34,0)),\n     IF(ACOMPANHAMENTO=\"BM\",SUM(OFFSET($T$13,$F$34+2,1,1,AC$12))/OFFSET($S$13,$F$34,0),\"\")))","v":1},{"$f":"IF($F$34=\"\",\"\",\n  IF(ACOMPANHAMENTO=\"PLE\",\n     IF(AUTOEVENTO=\"Manual\",\n         IF(AdmLocal=\"Automática\",\n              AD29,\n              SUMIF(OFFSET(CRONOPLE!$F$14,CRONOPLE!$A$8+1,1,1,OFFSET(CRONOPLE!$AF$12,0,-1)),\"<=\"&AD$12,OFFSET(EVENTOS!$G$14,CRONOPLE!$A$8+1,1,1,OFFSET(CRONOPLE!$AF$12,0,-1)))/OFFSET(EVENTOS!$G$14,CRONOPLE!$A$8+1,-1)),\n         SUMIFS(OFFSET(CÁLCULO!$AA$15,$F$34,1,OFFSET(ORÇAMENTO!$D$15,$F$34,0),CÁLCULO.FrentesPreenchidas),OFFSET(CÁLCULO!$AL$15,$F$34,1,OFFSET(ORÇAMENTO!$D$15,$F$34,0),CÁLCULO.FrentesPreenchidas),\"<=\"&AD$12)/OFFSET(ORÇAMENTO!$X$15,$F$34,0)),\n     IF(ACOMPANHAMENTO=\"BM\",SUM(OFFSET($T$13,$F$34+2,1,1,AD$12))/OFFSET($S$13,$F$34,0),\"\")))","v":1},{"$f":"IF($F$34=\"\",\"\",\n  IF(ACOMPANHAMENTO=\"PLE\",\n     IF(AUTOEVENTO=\"Manual\",\n         IF(AdmLocal=\"Automática\",\n              AE29,\n              SUMIF(OFFSET(CRONOPLE!$F$14,CRONOPLE!$A$8+1,1,1,OFFSET(CRONOPLE!$AF$12,0,-1)),\"<=\"&AE$12,OFFSET(EVENTOS!$G$14,CRONOPLE!$A$8+1,1,1,OFFSET(CRONOPLE!$AF$12,0,-1)))/OFFSET(EVENTOS!$G$14,CRONOPLE!$A$8+1,-1)),\n         SUMIFS(OFFSET(CÁLCULO!$AA$15,$F$34,1,OFFSET(ORÇAMENTO!$D$15,$F$34,0),CÁLCULO.FrentesPreenchidas),OFFSET(CÁLCULO!$AL$15,$F$34,1,OFFSET(ORÇAMENTO!$D$15,$F$34,0),CÁLCULO.FrentesPreenchidas),\"<=\"&AE$12)/OFFSET(ORÇAMENTO!$X$15,$F$34,0)),\n     IF(ACOMPANHAMENTO=\"BM\",SUM(OFFSET($T$13,$F$34+2,1,1,AE$12))/OFFSET($S$13,$F$34,0),\"\")))","v":1},{"$f":"IF($F$34=\"\",\"\",\n  IF(ACOMPANHAMENTO=\"PLE\",\n     IF(AUTOEVENTO=\"Manual\",\n         IF(AdmLocal=\"Automática\",\n              AF29,\n              SUMIF(OFFSET(CRONOPLE!$F$14,CRONOPLE!$A$8+1,1,1,OFFSET(CRONOPLE!$AF$12,0,-1)),\"<=\"&AF$12,OFFSET(EVENTOS!$G$14,CRONOPLE!$A$8+1,1,1,OFFSET(CRONOPLE!$AF$12,0,-1)))/OFFSET(EVENTOS!$G$14,CRONOPLE!$A$8+1,-1)),\n         SUMIFS(OFFSET(CÁLCULO!$AA$15,$F$34,1,OFFSET(ORÇAMENTO!$D$15,$F$34,0),CÁLCULO.FrentesPreenchidas),OFFSET(CÁLCULO!$AL$15,$F$34,1,OFFSET(ORÇAMENTO!$D$15,$F$34,0),CÁLCULO.FrentesPreenchidas),\"<=\"&AF$12)/OFFSET(ORÇAMENTO!$X$15,$F$34,0)),\n     IF(ACOMPANHAMENTO=\"BM\",SUM(OFFSET($T$13,$F$34+2,1,1,AF$12))/OFFSET($S$13,$F$34,0),\"\")))","v":1}]
[null,null,null,null,null,null,"F",{"$f":"IF(AND(ACOMPANHAMENTO=\"BM\",$H$34=\"\"),\"↑ Não foi indicado o Macrosserviço de Administração Local\",\"\")","v":""},null,null,null,null,null,null,null,null,null,null,null,{"$f":"IF(COUNTIF(U35:AG35,\"%Adm>%Global\")>0,\"Verificar proporcionalidade da Administração Local\",\"\")","v":""},{"$f":"IF(U34=\"\",\"\",IF(ROUND(U34,4)>ROUND(U29,4),\"%Adm>%Global\",\"\"))","v":""},{"$f":"IF(V34=\"\",\"\",IF(ROUND(V34,4)>ROUND(V29,4),\"%Adm>%Global\",\"\"))","v":""},"","","","","","","","","","",""]
[null,null,null,null,null,null,"F",null,{"$f":"Import.Município","v":"SÃO VALENTIM/RS"}]
[null,null,null,null,null,null,"F",null,"Local",null,null,null,null,null,null,null,null,null,null,null,null,null,null,null,null,null,"Responsável Técnico"]
[null,null,null,null,null,null,"F",null,null,null,null,null,null,null,null,null,null,null,null,null,null,null,null,null,null,null,{"$f":"OFFSET(Import.RespOrçamento,0,-1) & \" \" & Import.RespOrçamento","v":"Nome: "}]
[null,null,null,null,null,null,"F",null,{"$f":"DADOS!$C$25","v":"00:00:00"},null,null,null,null,null,null,null,null,null,null,null,null,null,null,null,null,null,"CREA/CAU: "]
[null,null,null,null,null,null,"F",null,"Data",null,null,null,null,null,null,null,null,null,null,null,null,null,null,null,null,null,"ART/RRT: "]

{"sheet":"QCI","index":9,"n_rows":37,"n_cols":31,"rows_kept":37,"cut":false,"hidden":false,"merged":[[5,3,5,10],[9,0,10,0],[9,25,9,27],[35,3,35,5],[27,3,29,14],[32,3,32,5],[9,29,9,30],[23,10,24,10],[6,2,10,2],[8,10,9,10],[8,29,8,30],[6,3,6,10],[8,6,9,7],[2,3,2,4],[2,6,2,8],[2,9,2,11],[2,12,3,14],[3,3,3,4],[3,6,3,8],[3,9,3,11]]}
["Lista Situação",null,null,null,null,"QCI - Quadro de Composição do Investimento",null,null,null,null,null,null,null,null,"Grau de Sigilo\n#PUBLICO"]
["Sem Projeto",null,null,null,null,null,null,null,null,null,null,null,null,null,null,null,null,null,null,null,null,null,null,null,null,"% Maior:","% Rateio CP Fin:"]
["Em Análise",null,null,"Nº OPERAÇÃO",null,"Nº TransfereGOV","PROPONENTE / TOMADOR",null,null,"MUNICÍPIO / UF",null,null,"VALORES CONTRATADOS (R$):",null,null,null,null,null,null,null,null,null,null,null,null,{"$f":"MAX(Z7:AB7)","v":1},{"$f":"IF(OR($O$24=ORÇAMENTO.SumINVMANUAL+QCI.SumINVMANUAL,$O$24=0),0,MIN(MAX(0,($Z$3*$O$24-ORÇAMENTO.SumCPMANUAL-QCI.SumCPMANUAL)/($O$24-ORÇAMENTO.SumINVMANUAL-QCI.SumINVMANUAL)),1))","v":1}]
["Análise Concluída / A Licitar",null,null,{"$f":"Import.CR","v":0},null,{"$f":"Import.TransfereGOV","v":0},{"$f":"Import.Proponente","v":"MUNICÍPIO DE SÃO VALENTIN"},null,null,{"$f":"Import.Município","v":"SÃO VALENTIM/RS"}]
["Licitado / Em Execução"]
["Concluído",null,null,"APELIDO DO EMPREENDIMENTO",null,null,null,null,null,null,null,"RECURSO",{"$f":"IF(import.recurso=\"FGTS\",\"FINANCIAMENTO\",\"REPASSE\")","v":"REPASSE"},"CONTRAPARTIDA","INVESTIMENTO",null,null,null,null,null,null,null,null,null,null,"% CP Min Prog:","% CP Absoluta:","% CP Max Rep:"]
["Divisão Investimento",null,"FILTRO",{"$f":"Import.Apelido","v":"COBERTURA RUA PEDRO DASSOLER"},null,null,null,null,null,null,null,{"$f":"import.recurso","v":"OGU"},{"$f":"Import.Repasse","v":0},{"$f":"Import.Contrapartida","v":0},{"$f":"M7+N7","v":0},null,null,null,null,null,null,null,null,null,null,{"$f":"ROUND(Import.CPMinPerc,4)","v":0},{"$f":"IF($O$24=0,0,Import.CPMinAbsoluta/$O$24)","v":0},{"$f":"IF($O$24=0,0,($O$24-$AB$24-Import.Repasse)/($O$24))","v":1}]
["Proporcional"]
["Calculado",null,null,null,null,null,{"$f":"IF($T$11<>\"\",\"PREENCHIMENTO INCOMPLETO DA TABELA AUXILIAR DO QCI\",\n  IF($G$11<>\"\",\"PREENCHIMENTO INCOMPLETO DA TABELA PRINCIPAL DO QCI\",\n  IF(AND($O$24>0,$M$25>Import.CPMaxPerc,Import.CPMaxPerc>0),\"ERRO: CONTRAPARTIDA MAIOR QUE A MÁXIMA\",\n  IF(OR(AND($O$24>0,$M$25<QCI!$Z$7),$M$24<ROUND(Import.CPMinAbsoluta,2)),\"ERRO: CONTRAPARTIDA MENOR QUE A MÍNIMA\",\n  IF(OR($L$10<0,$M$10<0),\"ERRO: SALDO NEGATIVO\",\n  IF(COUNTIF($L$13:$L$24,\"<0\")>0,\"ERRO: VALORES DE REPASSE NEGATIVOS\",\n  IF(OFFSET($A$24,-1,0)<OFFSET(ORÇAMENTO!$E$27,-1,0),\"ERRO: NÚMERO DE LINHAS DO QCI INSUFICIENTE. CLIQUE NO BOTÃO ADICIONAR LINHAS\",\n  \"\")))))))","v":"PREENCHIMENTO INCOMPLETO DA TABELA PRINCIPAL DO QCI"},null,null,null,"Saldo a Reprogramar",{"$f":"$L$13","v":"Repasse (R$)"},"Contrapartida (R$)"]
["Ordem Meta",null,null,null,null,null,null,null,null,null,null,{"$f":"Import.Repasse-L24","v":0},{"$f":"Import.Contrapartida-M24","v":-134660.96},null,null,null,null,null,null,null,null,null,null,null,null,"Valores não Arredondados",null,null,null,"Arred"]
[null,null,null,null,null,null,{"$f":"IF(COUNTIF($P$13:$P$24,\"ITEM\")>0,\"Falta definir o ITEM de Investimento da Meta \"&INDEX($D$13:$D$24,MATCH(\"ITEM\",$P$13:$P$24,0)),\n  IF(COUNTIF($P$13:$P$24,\"SUBITEM\")>0,\"Falta definir o SUBITEM de Investimento da Meta \"&INDEX($D$13:$D$24,MATCH(\"SUBITEM\",$P$13:$P$24,0)),\n  IF(COUNTIF($P$13:$P$24,\"SITUAÇÃO\")>0,\"Falta definir a SITUAÇÃO do Investimento da Meta \"&INDEX($D$13:$D$24,MATCH(\"SITUAÇÃO\",$P$13:$P$24,0)),\n  IF(COUNTIF($P$13:$P$24,\"QUANT.\")>0,\"Falta preencher a QUANTIDADE da Meta \"&INDEX($D$13:$D$24,MATCH(\"QUANT.\",$P$13:$P$24,0)),\n  \"\"))))","v":"Falta definir o ITEM de Investimento da Meta 1"},null,null,null,null,null,null,null,null,null,null,null,null,{"$f":"IF(COUNTIF($S$13:$S$24,\"► LOTE\")>0,\"Falta preencher o LOTE/CTEF da Meta \"&INDEX($D$13:$D$24,MATCH(\"► LOTE\",$S$13:$S$24,0)),\n  IF(COUNTIF($S$13:$S$24,\"► INVEST\")>0,\"Falta preencher o valor do INVESTIMENTO da Meta \"&INDEX($D$13:$D$24,MATCH(\"► INVEST\",$S$13:$S$24,0)),\n  IF(COUNTIF($S$13:$S$24,\"► DIV\")>0,\"Falta definir a DIVISÃO do Investimento da Meta \"&INDEX($D$13:$D$24,MATCH(\"► DIV\",$S$13:$S$24,0)),\n  IF(COUNTIF($S$13:$S$24,\"► CP\")>0,\"Falta preencher o valor da CONTRAPARTIDA da Meta \"&INDEX($D$13:$D$24,MATCH(\"► CP\",$S$13:$S$24,0)),\n  IF(COUNTIF($S$13:$S$24,\"► OU\")>0,\"Falta preencher o valor de OUTROS recursos da Meta \"&INDEX($D$13:$D$24,MATCH(\"► OU\",$S$13:$S$24,0)),\n  \"\")))))","v":""},null,null,null,null,null,"Repasse (R$)","Contrapartida (R$)","Outros (R$)"]
[{"$f":"IF(NOT(ISBLANK(QCI.DescManual)),OFFSET(A12,-1,0),D12)","v":-1},{"$f":"IF(NOT(ISBLANK(QCI.DescManual)),IF(QCI.Divisao=\"Calculado\",\"Manual\",\"SemiAuto\"),IF(ISERROR(MATCH($A12,ORÇAMENTO!$E$15:$E$27,0)),\"Branco\",\"Automático\"))","v":"Branco"},{"$f":"IF(O12>0,\"F\",\"\")","v":""},{"$f":"ROW()-ROW($D$13)","v":-1},null,null,{"$f":"IF(OR($B12=\"Manual\",$B12=\"SemiAuto\"),QCI.DescManual,IF($B12=\"Automático\",INDEX(ORÇAMENTO!$R$15:$R$27,MATCH($A12,ORÇAMENTO!$E$15:$E$27,0)),\"\"))","v":""},null,null,{"$f":"IF(AND(ISBLANK(E12),ISBLANK(F12)),\"\",VLOOKUP($F12,OFFSET(DADOS!$A$2,1,MATCH(QCI!$E12,DADOS!$2:$2,0)-1,100,50),2,FALSE))","v":""},{"$f":"IF(OR($B12=\"Manual\",$B12=\"SemiAuto\"),QCI.LoteManual,IF($B12=\"Automático\",IF(TIPOORCAMENTO=\"Licitado\",Import.CTEF,\"LOTE 1\"),\"\"))","v":""},{"$f":"ROUND($O12,2)-ROUND($M12,2)-ROUND($N12,2)","v":0},{"$f":"ROUND($AA12,2)-ROUND($AE12,2)","v":0},{"$f":"ROUND($AB12,2)","v":0},{"$f":"IF($B12=\"Branco\",0,IF(OR($B12=\"Manual\",$B12=\"SemiAuto\"),QCI.InvManual,INDEX(ORÇAMENTO!X$15:X$27,MATCH($A12,ORÇAMENTO!$E$15:$E$27,0))))","v":0},{"$f":"IF(O12=0,\"\",\n  IF(E12=\"\",\"ITEM\",\n  IF(F12=\"\",\"SUBITEM\",\n  IF(H12=\"\",\"SITUAÇÃO\",\n  IF(I12=0,\"QUANT.\",\"\")))))","v":""},null,null,{"$f":"IF(R12=\"\",\"\",\n  IF(T12=0,\"► LOTE\",\n  IF(U12=0,\"► INVEST\",\n  IF(V12=0,\"► DIV\",\n  IF(AND(V12=\"Calculado\",W12=\"\"),\"► CP\",\n  IF(AND(V12=\"Calculado\",X12=\"\"),\"► OU\",\"\"))))))","v":""},null,null,"Proporcional",null,null,null,{"$f":"$O12-$AA12-$AB12","v":0},{"$f":"IF($B12=\"Branco\",0,IF($B12=\"Manual\",QCI.CPManual,IF($B12=\"SemiAuto\",ROUND(QCI!$AA$3*QCI.InvManual,2),INDEX(ORÇAMENTO!$AA$15:$AA$27,MATCH($A12,ORÇAMENTO!$E$15:$E$27,0)))))","v":0},{"$f":"IF($B12=\"Branco\",0,IF($B12=\"Manual\",QCI.OutrosManual,IF($B12=\"SemiAuto\",0,INDEX(ORÇAMENTO!$AB$15:$AB$27,MATCH($A12,ORÇAMENTO!$E$15:$E$27,0)))))","v":0},null,{"$f":"AND($AA$3>0,$AA$3<1,$O12>0,OR($B12=\"Automático\",$B12=\"SemiAuto\"),OR(QCI!$Z$3=QCI!$Z$7,QCI!$Z$3=QCI!$AA$7,QCI!$Z$3=QCI!$AB$7))","v":false},{"$f":"IF(AND($AD12,$O12>0,COUNTIF(OFFSET($AD12,1,0):$AD$24,TRUE)=0),CHOOSE(1+LOG(1+2*(QCI!$Z$3=QCI!$Z$7)+4*(QCI!$Z$3=QCI!$AA$7)+8*(QCI!$Z$3=QCI!$AB$7),2),0,$AA$24-ROUND(Import.CPMinPerc*$O$24,2),$AA$24-Import.CPMinAbsoluta,Import.Repasse-$Z$24),0)","v":0}]
[0,"Busca","↓","Meta","Item de Investimento","Subitem de Investimento","Descrição da Meta","Situação","Quantidade","Unid.","Lote de Licitação / nº do CTEF",{"$f":"IF(import.recurso=\"FGTS\",\"Financiamento (R$)\",\"Repasse (R$)\")","v":"Repasse (R$)"},"Contrapartida Financeira (R$)","Outros (R$)","Investimento (R$)",null,null,"Descrição da Meta",null,"Lote de Licitação / nº do CTEF","Investimento (R$)","Divisão do Investimento","Contrapartida Financeira (R$)","Outros (R$)"]
[{"$f":"IF(NOT(ISBLANK(QCI.DescManual)),OFFSET(A14,-1,0),D14)","v":1},{"$f":"IF(NOT(ISBLANK(QCI.DescManual)),IF(QCI.Divisao=\"Calculado\",\"Manual\",\"SemiAuto\"),IF(ISERROR(MATCH($A14,ORÇAMENTO!$E$15:$E$27,0)),\"Branco\",\"Automático\"))","v":"Automático"},{"$f":"IF(O14>0,\"F\",\"\")","v":"F"},{"$f":"ROW()-ROW($D$13)","v":1},null,null,{"$f":"IF(OR($B14=\"Manual\",$B14=\"SemiAuto\"),QCI.DescManual,IF($B14=\"Automático\",INDEX(ORÇAMENTO!$R$15:$R$27,MATCH($A14,ORÇAMENTO!$E$15:$E$27,0)),\"\"))","v":"COBERTURA RUA PEDRO DASSOLER "},null,null,{"$f":"IF(AND(ISBLANK(E14),ISBLANK(F14)),\"\",VLOOKUP($F14,OFFSET(DADOS!$A$2,1,MATCH(QCI!$E14,DADOS!$2:$2,0)-1,100,50),2,FALSE))","v":""},{"$f":"IF(OR($B14=\"Manual\",$B14=\"SemiAuto\"),QCI.LoteManual,IF($B14=\"Automático\",IF(TIPOORCAMENTO=\"Licitado\",Import.CTEF,\"LOTE 1\"),\"\"))","v":"LOTE 1"},{"$f":"ROUND($O14,2)-ROUND($M14,2)-ROUND($N14,2)","v":0},{"$f":"ROUND($AA14,2)-ROUND($AE14,2)","v":134660.96},{"$f":"ROUND($AB14,2)","v":0},{"$f":"IF($B14=\"Branco\",0,IF(OR($B14=\"Manual\",$B14=\"SemiAuto\"),QCI.InvManual,INDEX(ORÇAMENTO!X$15:X$27,MATCH($A14,ORÇAMENTO!$E$15:$E$27,0))))","v":134660.96},{"$f":"IF(O14=0,\"\",\n  IF(E14=\"\",\"ITEM\",\n  IF(F14=\"\",\"SUBITEM\",\n  IF(H14=\"\",\"SITUAÇÃO\",\n  IF(I14=0,\"QUANT.\",\"\")))))","v":"ITEM"},null,null,{"$f":"IF(R14=\"\",\"\",\n  IF(T14=0,\"► LOTE\",\n  IF(U14=0,\"► INVEST\",\n  IF(V14=0,\"► DIV\",\n  IF(AND(V14=\"Calculado\",W14=\"\"),\"► CP\",\n  IF(AND(V14=\"Calculado\",X14=\"\"),\"► OU\",\"\"))))))","v":""},null,null,"Proporcional",null,null,null,{"$f":"$O14-$AA14-$AB14","v":0},{"$f":"IF($B14=\"Branco\",0,IF($B14=\"Manual\",QCI.CPManual,IF($B14=\"SemiAuto\",ROUND(QCI!$AA$3*QCI.InvManual,2),INDEX(ORÇAMENTO!$AA$15:$AA$27,MATCH($A14,ORÇAMENTO!$E$15:$E$27,0)))))","v":134660.96},{"$f":"IF($B14=\"Branco\",0,IF($B14=\"Manual\",QCI.OutrosManual,IF($B14=\"SemiAuto\",0,INDEX(ORÇAMENTO!$AB$15:$AB$27,MATCH($A14,ORÇAMENTO!$E$15:$E$27,0)))))","v":0},null,{"$f":"AND($AA$3>0,$AA$3<1,$O14>0,OR($B14=\"Automático\",$B14=\"SemiAuto\"),OR(QCI!$Z$3=QCI!$Z$7,QCI!$Z$3=QCI!$AA$7,QCI!$Z$3=QCI!$AB$7))","v":false},{"$f":"IF(AND($AD14,$O14>0,COUNTIF(OFFSET($AD14,1,0):$AD$24,TRUE)=0),CHOOSE(1+LOG(1+2*(QCI!$Z$3=QCI!$Z$7)+4*(QCI!$Z$3=QCI!$AA$7)+8*(QCI!$Z$3=QCI!$AB$7),2),0,$AA$24-ROUND(Import.CPMinPerc*$O$24,2),$AA$24-Import.CPMinAbsoluta,Import.Repasse-$Z$24),0)","v":0}]
[2,{"$f":"IF(NOT(ISBLANK(QCI.DescManual)),IF(QCI.Divisao=\"Calculado\",\"Manual\",\"SemiAuto\"),IF(ISERROR(MATCH($A15,ORÇAMENTO!$E$15:$E$27,0)),\"Branco\",\"Automático\"))","v":"Branco"},"",2,null,null,{"$f":"IF(OR($B15=\"Manual\",$B15=\"SemiAuto\"),QCI.DescManual,IF($B15=\"Automático\",INDEX(ORÇAMENTO!$R$15:$R$27,MATCH($A15,ORÇAMENTO!$E$15:$E$27,0)),\"\"))","v":""},null,null,{"$f":"IF(AND(ISBLANK(E15),ISBLANK(F15)),\"\",VLOOKUP($F15,OFFSET(DADOS!$A$2,1,MATCH(QCI!$E15,DADOS!$2:$2,0)-1,100,50),2,FALSE))","v":""},{"$f":"IF(OR($B15=\"Manual\",$B15=\"SemiAuto\"),QCI.LoteManual,IF($B15=\"Automático\",IF(TIPOORCAMENTO=\"Licitado\",Import.CTEF,\"LOTE 1\"),\"\"))","v":""},0,0,0,{"$f":"IF($B15=\"Branco\",0,IF(OR($B15=\"Manual\",$B15=\"SemiAuto\"),QCI.InvManual,INDEX(ORÇAMENTO!X$15:X$27,MATCH($A15,ORÇAMENTO!$E$15:$E$27,0))))","v":0},"",null,null,"",null,null,"Proporcional",null,null,null,0,{"$f":"IF($B15=\"Branco\",0,IF($B15=\"Manual\",QCI.CPManual,IF($B15=\"SemiAuto\",ROUND(QCI!$AA$3*QCI.InvManual,2),INDEX(ORÇAMENTO!$AA$15:$AA$27,MATCH($A15,ORÇAMENTO!$E$15:$E$27,0)))))","v":0},{"$f":"IF($B15=\"Branco\",0,IF($B15=\"Manual\",QCI.OutrosManual,IF($B15=\"SemiAuto\",0,INDEX(ORÇAMENTO!$AB$15:$AB$27,MATCH($A15,ORÇAMENTO!$E$15:$E$27,0)))))","v":0},null,{"$f":"AND($AA$3>0,$AA$3<1,$O15>0,OR($B15=\"Automático\",$B15=\"SemiAuto\"),OR(QCI!$Z$3=QCI!$Z$7,QCI!$Z$3=QCI!$AA$7,QCI!$Z$3=QCI!$AB$7))","v":false},{"$f":"IF(AND($AD15,$O15>0,COUNTIF(OFFSET($AD15,1,0):$AD$24,TRUE)=0),CHOOSE(1+LOG(1+2*(QCI!$Z$3=QCI!$Z$7)+4*(QCI!$Z$3=QCI!$AA$7)+8*(QCI!$Z$3=QCI!$AB$7),2),0,$AA$24-ROUND(Import.CPMinPerc*$O$24,2),$AA$24-Import.CPMinAbsoluta,Import.Repasse-$Z$24),0)","v":0}]
[3,{"$f":"IF(NOT(ISBLANK(QCI.DescManual)),IF(QCI.Divisao=\"Calculado\",\"Manual\",\"SemiAuto\"),IF(ISERROR(MATCH($A16,ORÇAMENTO!$E$15:$E$27,0)),\"Branco\",\"Automático\"))","v":"Branco"},"",3,null,null,{"$f":"IF(OR($B16=\"Manual\",$B16=\"SemiAuto\"),QCI.DescManual,IF($B16=\"Automático\",INDEX(ORÇAMENTO!$R$15:$R$27,MATCH($A16,ORÇAMENTO!$E$15:$E$27,0)),\"\"))","v":""},null,null,{"$f":"IF(AND(ISBLANK(E16),ISBLANK(F16)),\"\",VLOOKUP($F16,OFFSET(DADOS!$A$2,1,MATCH(QCI!$E16,DADOS!$2:$2,0)-1,100,50),2,FALSE))","v":""},{"$f":"IF(OR($B16=\"Manual\",$B16=\"SemiAuto\"),QCI.LoteManual,IF($B16=\"Automático\",IF(TIPOORCAMENTO=\"Licitado\",Import.CTEF,\"LOTE 1\"),\"\"))","v":""},0,0,0,{"$f":"IF($B16=\"Branco\",0,IF(OR($B16=\"Manual\",$B16=\"SemiAuto\"),QCI.InvManual,INDEX(ORÇAMENTO!X$15:X$27,MATCH($A16,ORÇAMENTO!$E$15:$E$27,0))))","v":0},"",null,null,"",null,null,"Proporcional",null,null,null,0,{"$f":"IF($B16=\"Branco\",0,IF($B16=\"Manual\",QCI.CPManual,IF($B16=\"SemiAuto\",ROUND(QCI!$AA$3*QCI.InvManual,2),INDEX(ORÇAMENTO!$AA$15:$AA$27,MATCH($A16,ORÇAMENTO!$E$15:$E$27,0)))))","v":0},{"$f":"IF($B16=\"Branco\",0,IF($B16=\"Manual\",QCI.OutrosManual,IF($B16=\"SemiAuto\",0,INDEX(ORÇAMENTO!$AB$15:$AB$27,MATCH($A16,ORÇAMENTO!$E$15:$E$27,0)))))","v":0},null,{"$f":"AND($AA$3>0,$AA$3<1,$O16>0,OR($B16=\"Automático\",$B16=\"SemiAuto\"),OR(QCI!$Z$3=QCI!$Z$7,QCI!$Z$3=QCI!$AA$7,QCI!$Z$3=QCI!$AB$7))","v":false},{"$f":"IF(AND($AD16,$O16>0,COUNTIF(OFFSET($AD16,1,0):$AD$24,TRUE)=0),CHOOSE(1+LOG(1+2*(QCI!$Z$3=QCI!$Z$7)+4*(QCI!$Z$3=QCI!$AA$7)+8*(QCI!$Z$3=QCI!$AB$7),2),0,$AA$24-ROUND(Import.CPMinPerc*$O$24,2),$AA$24-Import.CPMinAbsoluta,Import.Repasse-$Z$24),0)","v":0}]
[4,{"$f":"IF(NOT(ISBLANK(QCI.DescManual)),IF(QCI.Divisao=\"Calculado\",\"Manual\",\"SemiAuto\"),IF(ISERROR(MATCH($A17,ORÇAMENTO!$E$15:$E$27,0)),\"Branco\",\"Automático\"))","v":"Branco"},"",4,null,null,{"$f":"IF(OR($B17=\"Manual\",$B17=\"SemiAuto\"),QCI.DescManual,IF($B17=\"Automático\",INDEX(ORÇAMENTO!$R$15:$R$27,MATCH($A17,ORÇAMENTO!$E$15:$E$27,0)),\"\"))","v":""},null,null,{"$f":"IF(AND(ISBLANK(E17),ISBLANK(F17)),\"\",VLOOKUP($F17,OFFSET(DADOS!$A$2,1,MATCH(QCI!$E17,DADOS!$2:$2,0)-1,100,50),2,FALSE))","v":""},{"$f":"IF(OR($B17=\"Manual\",$B17=\"SemiAuto\"),QCI.LoteManual,IF($B17=\"Automático\",IF(TIPOORCAMENTO=\"Licitado\",Import.CTEF,\"LOTE 1\"),\"\"))","v":""},0,0,0,{"$f":"IF($B17=\"Branco\",0,IF(OR($B17=\"Manual\",$B17=\"SemiAuto\"),QCI.InvManual,INDEX(ORÇAMENTO!X$15:X$27,MATCH($A17,ORÇAMENTO!$E$15:$E$27,0))))","v":0},"",null,null,"",null,null,"Proporcional",null,null,null,0,{"$f":"IF($B17=\"Branco\",0,IF($B17=\"Manual\",QCI.CPManual,IF($B17=\"SemiAuto\",ROUND(QCI!$AA$3*QCI.InvManual,2),INDEX(ORÇAMENTO!$AA$15:$AA$27,MATCH($A17,ORÇAMENTO!$E$15:$E$27,0)))))","v":0},{"$f":"IF($B17=\"Branco\",0,IF($B17=\"Manual\",QCI.OutrosManual,IF($B17=\"SemiAuto\",0,INDEX(ORÇAMENTO!$AB$15:$AB$27,MATCH($A17,ORÇAMENTO!$E$15:$E$27,0)))))","v":0},null,{"$f":"AND($AA$3>0,$AA$3<1,$O17>0,OR($B17=\"Automático\",$B17=\"SemiAuto\"),OR(QCI!$Z$3=QCI!$Z$7,QCI!$Z$3=QCI!$AA$7,QCI!$Z$3=QCI!$AB$7))","v":false},{"$f":"IF(AND($AD17,$O17>0,COUNTIF(OFFSET($AD17,1,0):$AD$24,TRUE)=0),CHOOSE(1+LOG(1+2*(QCI!$Z$3=QCI!$Z$7)+4*(QCI!$Z$3=QCI!$AA$7)+8*(QCI!$Z$3=QCI!$AB$7),2),0,$AA$24-ROUND(Import.CPMinPerc*$O$24,2),$AA$24-Import.CPMinAbsoluta,Import.Repasse-$Z$24),0)","v":0}]
[5,{"$f":"IF(NOT(ISBLANK(QCI.DescManual)),IF(QCI.Divisao=\"Calculado\",\"Manual\",\"SemiAuto\"),IF(ISERROR(MATCH($A18,ORÇAMENTO!$E$15:$E$27,0)),\"Branco\",\"Automático\"))","v":"Branco"},"",5,null,null,{"$f":"IF(OR($B18=\"Manual\",$B18=\"SemiAuto\"),QCI.DescManual,IF($B18=\"Automático\",INDEX(ORÇAMENTO!$R$15:$R$27,MATCH($A18,ORÇAMENTO!$E$15:$E$27,0)),\"\"))","v":""},null,null,{"$f":"IF(AND(ISBLANK(E18),ISBLANK(F18)),\"\",VLOOKUP($F18,OFFSET(DADOS!$A$2,1,MATCH(QCI!$E18,DADOS!$2:$2,0)-1,100,50),2,FALSE))","v":""},{"$f":"IF(OR($B18=\"Manual\",$B18=\"SemiAuto\"),QCI.LoteManual,IF($B18=\"Automático\",IF(TIPOORCAMENTO=\"Licitado\",Import.CTEF,\"LOTE 1\"),\"\"))","v":""},0,0,0,{"$f":"IF($B18=\"Branco\",0,IF(OR($B18=\"Manual\",$B18=\"SemiAuto\"),QCI.InvManual,INDEX(ORÇAMENTO!X$15:X$27,MATCH($A18,ORÇAMENTO!$E$15:$E$27,0))))","v":0},"",null,null,"",null,null,"Proporcional",null,null,null,0,{"$f":"IF($B18=\"Branco\",0,IF($B18=\"Manual\",QCI.CPManual,IF($B18=\"SemiAuto\",ROUND(QCI!$AA$3*QCI.InvManual,2),INDEX(ORÇAMENTO!$AA$15:$AA$27,MATCH($A18,ORÇAMENTO!$E$15:$E$27,0)))))","v":0},{"$f":"IF($B18=\"Branco\",0,IF($B18=\"Manual\",QCI.OutrosManual,IF($B18=\"SemiAuto\",0,INDEX(ORÇAMENTO!$AB$15:$AB$27,MATCH($A18,ORÇAMENTO!$E$15:$E$27,0)))))","v":0},null,{"$f":"AND($AA$3>0,$AA$3<1,$O18>0,OR($B18=\"Automático\",$B18=\"SemiAuto\"),OR(QCI!$Z$3=QCI!$Z$7,QCI!$Z$3=QCI!$AA$7,QCI!$Z$3=QCI!$AB$7))","v":false},{"$f":"IF(AND($AD18,$O18>0,COUNTIF(OFFSET($AD18,1,0):$AD$24,TRUE)=0),CHOOSE(1+LOG(1+2*(QCI!$Z$3=QCI!$Z$7)+4*(QCI!$Z$3=QCI!$AA$7)+8*(QCI!$Z$3=QCI!$AB$7),2),0,$AA$24-ROUND(Import.CPMinPerc*$O$24,2),$AA$24-Import.CPMinAbsoluta,Import.Repasse-$Z$24),0)","v":0}]
[6,{"$f":"IF(NOT(ISBLANK(QCI.DescManual)),IF(QCI.Divisao=\"Calculado\",\"Manual\",\"SemiAuto\"),IF(ISERROR(MATCH($A19,ORÇAMENTO!$E$15:$E$27,0)),\"Branco\",\"Automático\"))","v":"Branco"},"",6,null,null,{"$f":"IF(OR($B19=\"Manual\",$B19=\"SemiAuto\"),QCI.DescManual,IF($B19=\"Automático\",INDEX(ORÇAMENTO!$R$15:$R$27,MATCH($A19,ORÇAMENTO!$E$15:$E$27,0)),\"\"))","v":""},null,null,{"$f":"IF(AND(ISBLANK(E19),ISBLANK(F19)),\"\",VLOOKUP($F19,OFFSET(DADOS!$A$2,1,MATCH(QCI!$E19,DADOS!$2:$2,0)-1,100,50),2,FALSE))","v":""},{"$f":"IF(OR($B19=\"Manual\",$B19=\"SemiAuto\"),QCI.LoteManual,IF($B19=\"Automático\",IF(TIPOORCAMENTO=\"Licitado\",Import.CTEF,\"LOTE 1\"),\"\"))","v":""},0,0,0,{"$f":"IF($B19=\"Branco\",0,IF(OR($B19=\"Manual\",$B19=\"SemiAuto\"),QCI.InvManual,INDEX(ORÇAMENTO!X$15:X$27,MATCH($A19,ORÇAMENTO!$E$15:$E$27,0))))","v":0},"",null,null,"",null,null,"Proporcional",null,null,null,0,{"$f":"IF($B19=\"Branco\",0,IF($B19=\"Manual\",QCI.CPManual,IF($B19=\"SemiAuto\",ROUND(QCI!$AA$3*QCI.InvManual,2),INDEX(ORÇAMENTO!$AA$15:$AA$27,MATCH($A19,ORÇAMENTO!$E$15:$E$27,0)))))","v":0},{"$f":"IF($B19=\"Branco\",0,IF($B19=\"Manual\",QCI.OutrosManual,IF($B19=\"SemiAuto\",0,INDEX(ORÇAMENTO!$AB$15:$AB$27,MATCH($A19,ORÇAMENTO!$E$15:$E$27,0)))))","v":0},null,{"$f":"AND($AA$3>0,$AA$3<1,$O19>0,OR($B19=\"Automático\",$B19=\"SemiAuto\"),OR(QCI!$Z$3=QCI!$Z$7,QCI!$Z$3=QCI!$AA$7,QCI!$Z$3=QCI!$AB$7))","v":false},{"$f":"IF(AND($AD19,$O19>0,COUNTIF(OFFSET($AD19,1,0):$AD$24,TRUE)=0),CHOOSE(1+LOG(1+2*(QCI!$Z$3=QCI!$Z$7)+4*(QCI!$Z$3=QCI!$AA$7)+8*(QCI!$Z$3=QCI!$AB$7),2),0,$AA$24-ROUND(Import.CPMinPerc*$O$24,2),$AA$24-Import.CPMinAbsoluta,Import.Repasse-$Z$24),0)","v":0}]
[7,{"$f":"IF(NOT(ISBLANK(QCI.DescManual)),IF(QCI.Divisao=\"Calculado\",\"Manual\",\"SemiAuto\"),IF(ISERROR(MATCH($A20,ORÇAMENTO!$E$15:$E$27,0)),\"Branco\",\"Automático\"))","v":"Branco"},"",7,null,null,{"$f":"IF(OR($B20=\"Manual\",$B20=\"SemiAuto\"),QCI.DescManual,IF($B20=\"Automático\",INDEX(ORÇAMENTO!$R$15:$R$27,MATCH($A20,ORÇAMENTO!$E$15:$E$27,0)),\"\"))","v":""},null,null,{"$f":"IF(AND(ISBLANK(E20),ISBLANK(F20)),\"\",VLOOKUP($F20,OFFSET(DADOS!$A$2,1,MATCH(QCI!$E20,DADOS!$2:$2,0)-1,100,50),2,FALSE))","v":""},{"$f":"IF(OR($B20=\"Manual\",$B20=\"SemiAuto\"),QCI.LoteManual,IF($B20=\"Automático\",IF(TIPOORCAMENTO=\"Licitado\",Import.CTEF,\"LOTE 1\"),\"\"))","v":""},0,0,0,{"$f":"IF($B20=\"Branco\",0,IF(OR($B20=\"Manual\",$B20=\"SemiAuto\"),QCI.InvManual,INDEX(ORÇAMENTO!X$15:X$27,MATCH($A20,ORÇAMENTO!$E$15:$E$27,0))))","v":0},"",null,null,"",null,null,"Proporcional",null,null,null,0,{"$f":"IF($B20=\"Branco\",0,IF($B20=\"Manual\",QCI.CPManual,IF($B20=\"SemiAuto\",ROUND(QCI!$AA$3*QCI.InvManual,2),INDEX(ORÇAMENTO!$AA$15:$AA$27,MATCH($A20,ORÇAMENTO!$E$15:$E$27,0)))))","v":0},{"$f":"IF($B20=\"Branco\",0,IF($B20=\"Manual\",QCI.OutrosManual,IF($B20=\"SemiAuto\",0,INDEX(ORÇAMENTO!$AB$15:$AB$27,MATCH($A20,ORÇAMENTO!$E$15:$E$27,0)))))","v":0},null,{"$f":"AND($AA$3>0,$AA$3<1,$O20>0,OR($B20=\"Automático\",$B20=\"SemiAuto\"),OR(QCI!$Z$3=QCI!$Z$7,QCI!$Z$3=QCI!$AA$7,QCI!$Z$3=QCI!$AB$7))","v":false},{"$f":"IF(AND($AD20,$O20>0,COUNTIF(OFFSET($AD20,1,0):$AD$24,TRUE)=0),CHOOSE(1+LOG(1+2*(QCI!$Z$3=QCI!$Z$7)+4*(QCI!$Z$3=QCI!$AA$7)+8*(QCI!$Z$3=QCI!$AB$7),2),0,$AA$24-ROUND(Import.CPMinPerc*$O$24,2),$AA$24-Import.CPMinAbsoluta,Import.Repasse-$Z$24),0)","v":0}]
[8,{"$f":"IF(NOT(ISBLANK(QCI.DescManual)),IF(QCI.Divisao=\"Calculado\",\"Manual\",\"SemiAuto\"),IF(ISERROR(MATCH($A21,ORÇAMENTO!$E$15:$E$27,0)),\"Branco\",\"Automático\"))","v":"Branco"},"",8,null,null,{"$f":"IF(OR($B21=\"Manual\",$B21=\"SemiAuto\"),QCI.DescManual,IF($B21=\"Automático\",INDEX(ORÇAMENTO!$R$15:$R$27,MATCH($A21,ORÇAMENTO!$E$15:$E$27,0)),\"\"))","v":""},null,null,{"$f":"IF(AND(ISBLANK(E21),ISBLANK(F21)),\"\",VLOOKUP($F21,OFFSET(DADOS!$A$2,1,MATCH(QCI!$E21,DADOS!$2:$2,0)-1,100,50),2,FALSE))","v":""},{"$f":"IF(OR($B21=\"Manual\",$B21=\"SemiAuto\"),QCI.LoteManual,IF($B21=\"Automático\",IF(TIPOORCAMENTO=\"Licitado\",Import.CTEF,\"LOTE 1\"),\"\"))","v":""},0,0,0,{"$f":"IF($B21=\"Branco\",0,IF(OR($B21=\"Manual\",$B21=\"SemiAuto\"),QCI.InvManual,INDEX(ORÇAMENTO!X$15:X$27,MATCH($A21,ORÇAMENTO!$E$15:$E$27,0))))","v":0},"",null,null,"",null,null,"Proporcional",null,null,null,0,{"$f":"IF($B21=\"Branco\",0,IF($B21=\"Manual\",QCI.CPManual,IF($B21=\"SemiAuto\",ROUND(QCI!$AA$3*QCI.InvManual,2),INDEX(ORÇAMENTO!$AA$15:$AA$27,MATCH($A21,ORÇAMENTO!$E$15:$E$27,0)))))","v":0},{"$f":"IF($B21=\"Branco\",0,IF($B21=\"Manual\",QCI.OutrosManual,IF($B21=\"SemiAuto\",0,INDEX(ORÇAMENTO!$AB$15:$AB$27,MATCH($A21,ORÇAMENTO!$E$15:$E$27,0)))))","v":0},null,{"$f":"AND($AA$3>0,$AA$3<1,$O21>0,OR($B21=\"Automático\",$B21=\"SemiAuto\"),OR(QCI!$Z$3=QCI!$Z$7,QCI!$Z$3=QCI!$AA$7,QCI!$Z$3=QCI!$AB$7))","v":false},{"$f":"IF(AND($AD21,$O21>0,COUNTIF(OFFSET($AD21,1,0):$AD$24,TRUE)=0),CHOOSE(1+LOG(1+2*(QCI!$Z$3=QCI!$Z$7)+4*(QCI!$Z$3=QCI!$AA$7)+8*(QCI!$Z$3=QCI!$AB$7),2),0,$AA$24-ROUND(Import.CPMinPerc*$O$24,2),$AA$24-Import.CPMinAbsoluta,Import.Repasse-$Z$24),0)","v":0}]
[9,{"$f":"IF(NOT(ISBLANK(QCI.DescManual)),IF(QCI.Divisao=\"Calculado\",\"Manual\",\"SemiAuto\"),IF(ISERROR(MATCH($A22,ORÇAMENTO!$E$15:$E$27,0)),\"Branco\",\"Automático\"))","v":"Branco"},"",9,null,null,{"$f":"IF(OR($B22=\"Manual\",$B22=\"SemiAuto\"),QCI.DescManual,IF($B22=\"Automático\",INDEX(ORÇAMENTO!$R$15:$R$27,MATCH($A22,ORÇAMENTO!$E$15:$E$27,0)),\"\"))","v":""},null,null,{"$f":"IF(AND(ISBLANK(E22),ISBLANK(F22)),\"\",VLOOKUP($F22,OFFSET(DADOS!$A$2,1,MATCH(QCI!$E22,DADOS!$2:$2,0)-1,100,50),2,FALSE))","v":""},{"$f":"IF(OR($B22=\"Manual\",$B22=\"SemiAuto\"),QCI.LoteManual,IF($B22=\"Automático\",IF(TIPOORCAMENTO=\"Licitado\",Import.CTEF,\"LOTE 1\"),\"\"))","v":""},0,0,0,{"$f":"IF($B22=\"Branco\",0,IF(OR($B22=\"Manual\",$B22=\"SemiAuto\"),QCI.InvManual,INDEX(ORÇAMENTO!X$15:X$27,MATCH($A22,ORÇAMENTO!$E$15:$E$27,0))))","v":0},"",null,null,"",null,null,"Proporcional",null,null,null,0,{"$f":"IF($B22=\"Branco\",0,IF($B22=\"Manual\",QCI.CPManual,IF($B22=\"SemiAuto\",ROUND(QCI!$AA$3*QCI.InvManual,2),INDEX(ORÇAMENTO!$AA$15:$AA$27,MATCH($A22,ORÇAMENTO!$E$15:$E$27,0)))))","v":0},{"$f":"IF($B22=\"Branco\",0,IF($B22=\"Manual\",QCI.OutrosManual,IF($B22=\"SemiAuto\",0,INDEX(ORÇAMENTO!$AB$15:$AB$27,MATCH($A22,ORÇAMENTO!$E$15:$E$27,0)))))","v":0},null,{"$f":"AND($AA$3>0,$AA$3<1,$O22>0,OR($B22=\"Automático\",$B22=\"SemiAuto\"),OR(QCI!$Z$3=QCI!$Z$7,QCI!$Z$3=QCI!$AA$7,QCI!$Z$3=QCI!$AB$7))","v":false},{"$f":"IF(AND($AD22,$O22>0,COUNTIF(OFFSET($AD22,1,0):$AD$24,TRUE)=0),CHOOSE(1+LOG(1+2*(QCI!$Z$3=QCI!$Z$7)+4*(QCI!$Z$3=QCI!$AA$7)+8*(QCI!$Z$3=QCI!$AB$7),2),0,$AA$24-ROUND(Import.CPMinPerc*$O$24,2),$AA$24-Import.CPMinAbsoluta,Import.Repasse-$Z$24),0)","v":0}]
[10,{"$f":"IF(NOT(ISBLANK(QCI.DescManual)),IF(QCI.Divisao=\"Calculado\",\"Manual\",\"SemiAuto\"),IF(ISERROR(MATCH($A23,ORÇAMENTO!$E$15:$E$27,0)),\"Branco\",\"Automático\"))","v":"Branco"},{"$f":"IF(O23>0,\"F\",\"\")","v":""},{"$f":"ROW()-ROW($D$13)","v":10},null,null,{"$f":"IF(OR($B23=\"Manual\",$B23=\"SemiAuto\"),QCI.DescManual,IF($B23=\"Automático\",INDEX(ORÇAMENTO!$R$15:$R$27,MATCH($A23,ORÇAMENTO!$E$15:$E$27,0)),\"\"))","v":""},null,null,{"$f":"IF(AND(ISBLANK(E23),ISBLANK(F23)),\"\",VLOOKUP($F23,OFFSET(DADOS!$A$2,1,MATCH(QCI!$E23,DADOS!$2:$2,0)-1,100,50),2,FALSE))","v":""},{"$f":"IF(OR($B23=\"Manual\",$B23=\"SemiAuto\"),QCI.LoteManual,IF($B23=\"Automático\",IF(TIPOORCAMENTO=\"Licitado\",Import.CTEF,\"LOTE 1\"),\"\"))","v":""},{"$f":"ROUND($O23,2)-ROUND($M23,2)-ROUND($N23,2)","v":0},{"$f":"ROUND($AA23,2)-ROUND($AE23,2)","v":0},{"$f":"ROUND($AB23,2)","v":0},{"$f":"IF($B23=\"Branco\",0,IF(OR($B23=\"Manual\",$B23=\"SemiAuto\"),QCI.InvManual,INDEX(ORÇAMENTO!X$15:X$27,MATCH($A23,ORÇAMENTO!$E$15:$E$27,0))))","v":0},{"$f":"IF(O23=0,\"\",\n  IF(E23=\"\",\"ITEM\",\n  IF(F23=\"\",\"SUBITEM\",\n  IF(H23=\"\",\"SITUAÇÃO\",\n  IF(I23=0,\"QUANT.\",\"\")))))","v":""},null,null,{"$f":"IF(R23=\"\",\"\",\n  IF(T23=0,\"► LOTE\",\n  IF(U23=0,\"► INVEST\",\n  IF(V23=0,\"► DIV\",\n  IF(AND(V23=\"Calculado\",W23=\"\"),\"► CP\",\n  IF(AND(V23=\"Calculado\",X23=\"\"),\"► OU\",\"\"))))))","v":""},null,null,"Proporcional",null,null,null,{"$f":"$O23-$AA23-$AB23","v":0},{"$f":"IF($B23=\"Branco\",0,IF($B23=\"Manual\",QCI.CPManual,IF($B23=\"SemiAuto\",ROUND(QCI!$AA$3*QCI.InvManual,2),INDEX(ORÇAMENTO!$AA$15:$AA$27,MATCH($A23,ORÇAMENTO!$E$15:$E$27,0)))))","v":0},{"$f":"IF($B23=\"Branco\",0,IF($B23=\"Manual\",QCI.OutrosManual,IF($B23=\"SemiAuto\",0,INDEX(ORÇAMENTO!$AB$15:$AB$27,MATCH($A23,ORÇAMENTO!$E$15:$E$27,0)))))","v":0},null,{"$f":"AND($AA$3>0,$AA$3<1,$O23>0,OR($B23=\"Automático\",$B23=\"SemiAuto\"),OR(QCI!$Z$3=QCI!$Z$7,QCI!$Z$3=QCI!$AA$7,QCI!$Z$3=QCI!$AB$7))","v":false},{"$f":"IF(AND($AD23,$O23>0,COUNTIF(OFFSET($AD23,1,0):$AD$24,TRUE)=0),CHOOSE(1+LOG(1+2*(QCI!$Z$3=QCI!$Z$7)+4*(QCI!$Z$3=QCI!$AA$7)+8*(QCI!$Z$3=QCI!$AB$7),2),0,$AA$24-ROUND(Import.CPMinPerc*$O$24,2),$AA$24-Import.CPMinAbsoluta,Import.Repasse-$Z$24),0)","v":0}]
[null,"TR$","F",null,null,null,null,null,null,null,"TOTAL",{"$f":"SUM(L13:OFFSET(L24,-1,0))","v":0},{"$f":"SUM(M13:OFFSET(M24,-1,0))","v":134660.96},{"$f":"SUM(N13:OFFSET(N24,-1,0))","v":0},{"$f":"SUM(O13:OFFSET(O24,-1,0))","v":134660.96},null,null,null,null,null,null,null,null,null,null,{"$f":"SUMPRODUCT(ROUND(Z13:OFFSET(Z24,-1,0),2))","v":0},{"$f":"SUMPRODUCT(ROUND(AA13:OFFSET(AA24,-1,0),2))","v":134660.96},{"$f":"SUM(AB13:OFFSET(AB24,-1,0))","v":0}]
[null,"T%","F",null,null,null,null,null,null,null,null,{"$f":"IF(ISERROR(L24/$O24),0,ROUND(L24/$O24,4))","v":0},{"$f":"IF(ISERROR(M24/$O24),0,ROUND(M24/$O24,4))","v":1},{"$f":"IF(ISERROR(N24/$O24),0,ROUND(N24/$O24,4))","v":0},{"$f":"IF(ISERROR(O24/$O24),0,ROUND(O24/$O24,4))","v":1}]
[]
[null,null,null,"Observações:"]
[]
[]
[]
[]
[]
[null,null,null,{"$f":"Import.Município","v":"SÃO VALENTIM/RS"}]
[null,null,null,"Local",null,null,null,null,"Representante Tomador"]
[null,null,null,null,null,null,null,null,{"$f":"\"Nome:\" &  \" \" & DADOS!C28","v":"Nome: "}]
[null,null,null,{"$f":"DADOS!$C$25","v":"00:00:00"},null,null,null,null,{"$f":"\"Cargo:\"  & \" \" & DADOS!C29","v":"Cargo: "}]
[null,null,null,"Data"]

{"sheet":"PLE","index":10,"n_rows":35,"n_cols":32,"rows_kept":35,"cut":false,"hidden":true,"merged":[[32,1,32,3],[29,1,29,3],[24,3,25,3],[24,12,24,13],[25,12,25,13],[25,8,25,9],[25,10,25,11],[24,10,24,11],[24,8,24,9],[28,8,28,9],[26,8,26,9],[26,10,26,11],[26,12,26,13],[0,2,0,3],[10,2,10,3],[11,2,12,3],[2,29,2,31],[3,29,3,31],[5,30,5,31],[6,7,6,13],[6,14,6,20],[6,30,6,31],[6,21,6,29],[8,24,8,25],[8,30,8,31],[8,9,8,10],[8,13,8,19],[6,1,6,2],[11,1,12,1],[23,30,23,31],[21,14,21,15],[22,22,22,23],[22,20,22,21],[22,28,22,29],[21,30,21,31],[24,20,24,21],[24,24,24,25],[20,26,20,27],[23,22,23,23],[21,18,21,19],[21,16,21,17],[23,28,23,29],[24,28,24,29],[23,26,23,27],[20,18,20,19],[20,20,20,21],[20,16,20,17],[22,18,22,19],[21,20,21,21],[22,30,22,31],[23,18,23,19],[23,16,23,17],[21,22,21,23],[14,2,14,3],[20,22,20,23],[20,28,20,29],[21,24,21,25],[22,26,22,27],[23,24,23,25],[23,20,23,21],[21,10,21,11],[20,10,20,11],[20,8,20,9],[16,2,16,3],[22,3,23,3],[15,2,15,3],[22,14,22,15],[22,12,22,13],[22,10,22,11],[19,8,19,31],[20,14,20,15],[20,30,20,31],[20,24,20,25],[22,16,22,17],[21,28,21,29],[21,26,21,27],[22,24,22,25],[26,30,26,31],[26,18,26,19],[26,20,26,21],[26,22,26,23],[26,24,26,25],[26,26,26,27],[24,22,24,23],[24,18,24,19],[25,28,25,29],[24,26,24,27],[25,30,25,31],[24,30,24,31],[25,24,25,25],[25,26,25,27],[25,18,25,19],[25,22,25,23],[25,20,25,21],[20,12,20,13],[23,14,23,15],[23,12,23,13],[23,10,23,11],[23,8,23,9],[21,8,21,9],[22,8,22,9],[21,12,21,13],[26,28,26,29],[26,14,26,15],[26,16,26,17],[25,14,25,15],[24,14,24,15],[24,16,24,17],[25,16,25,17]]}
[{"$f":"IF(C1=0,\"\",\"F\")","v":{"$error":"#REF!"}},{"$f":"OFFSET(B1,-1,0)+1","v":{"$error":"#REF!"}},{"$f":"IF(AUTOEVENTO=\"Manual\",OFFSET(EVENTOS!$D$15,$B1-$B$15,0),IF(B1<=MAX(CÁLCULO!$M$15:$M$27),VLOOKUP($B1,CÁLCULO!$M$15:$N$27,2,FALSE),0))","v":{"$error":"#REF!"}}]
[]
[null,null,null,null,null,null,null,"PLE - PLANILHA DE LEVANTAMENTO DE EVENTOS",null,null,null,null,null,null,null,null,null,null,null,null,null,null,null,null,null,null,null,null,null,"Grau de Sigilo"]
[null,null,null,null,null,null,null,{"$f":"import.recurso","v":"OGU"},null,null,null,null,null,null,null,null,null,null,null,null,null,null,null,null,null,null,null,null,null,"#PUBLICO"]
[]
[null,"Nº OPERAÇÃO",null,"Nº TransfereGOV",null,null,null,"PROPONENTE TOMADOR",null,null,null,null,null,null,"APELIDO EMPREENDIMENTO",null,null,null,null,null,null,{"$f":"IF(TIPOORCAMENTO=\"Licitado\",\"NOME DA EMPRESA\",\"DESCRIÇÃO DO LOTE\")","v":"DESCRIÇÃO DO LOTE"},null,null,null,null,null,null,null,null,{"$f":"IF(TIPOORCAMENTO=\"Licitado\",\"Nº CTEF\",\"\")","v":""}]
[null,{"$f":"Import.CR","v":0},null,{"$f":"Import.TransfereGOV","v":0},null,null,null,{"$f":"Import.Proponente","v":"MUNICÍPIO DE SÃO VALENTIN"},null,null,null,null,null,null,{"$f":"Import.Apelido","v":"COBERTURA RUA PEDRO DASSOLER"},null,null,null,null,null,null,{"$f":"IF(TIPOORCAMENTO=\"Licitado\",Import.empresa,Import.DescLote)","v":0},null,null,null,null,null,null,null,null,{"$f":"IF(TIPOORCAMENTO=\"Licitado\",Import.CTEF,\"\")","v":""}]
[]
[0,null,null,null,null,null,null,null,"Medição:",1,null,null,"Período:",{"$f":"TEXT(IF(PLE.Medicao=1,Import.DataInicioObra,OFFSET($H$21,0,1+(PLE.Medicao-$I$22)*2-2)+1),\"dd/mm/aaaa\")&\" a \"&TEXT(OFFSET($H$21,0,1+(PLE.Medicao-$I$22)*2),\"dd/mm/aaaa\")","v":"00/01/1900 a 00/01/1900"},null,null,null,null,null,null,null,null,null,"% Realizado Período.:",{"$f":"OFFSET($I$22,1+8*(ROUNDUP(($J$9-0)/((COLUMN($AG$14)-COLUMN($G$14)-1)/25*12),0)-1),ROUNDDOWN((($J$9-0)-OFFSET($I$22,8*(ROUNDUP(($J$9-0)/((COLUMN($AG$14)-COLUMN($G$14)-1)/25*12),0)-1),0))*(2+1/12),0))","v":0},null,null,null,null,"% Realizado Acum.:",{"$f":"OFFSET($I$22,3+8*(ROUNDUP(($J$9-0)/((COLUMN($AG$14)-COLUMN($G$14)-1)/25*12),0)-1),ROUNDDOWN((($J$9-0)-OFFSET($I$22,8*(ROUNDUP(($J$9-0)/((COLUMN($AG$14)-COLUMN($G$14)-1)/25*12),0)-1),0))*(2+1/12),0))","v":0}]
[]
["Filtro",null,{"$f":"IF(_xlfn.SINGLE(TIPOORCAMENTO)=\"proposto\",\"ALTERE O TIPO DE ORÇAMENTO NA ABA 'MENU' PARA LICITADO.\",\n IF(_xlfn.SINGLE(ACOMPANHAMENTO)=\"BM\",\"FOI SELECIONADO NA ABA 'MENU' O ACOMPANHAMENTO POR BM.\",\n IF(AND(PLE.Medicao=1,DADOS!$C$47=0),\"PREENCHER A DATA DE INÍCIO DA OBRA, NA ABA DADOS\",\n IF($Y$9=0,\"PREENCHER A MEDIÇÃO \"&PLE.Medicao,\n IF($H$21<>\"\",UPPER($H$21),\n IF($S$30<>\"\",UPPER($S$30),\"\"))))))","v":"ALTERE O TIPO DE ORÇAMENTO NA ABA 'MENU' PARA LICITADO."},null,null,{"$f":"IF(F$12>CÁLCULO.NúmeroDeFrentes,\"\",OFFSET(CÁLCULO!$P$12,0,F$12))","v":"PILARES PRÉ MOLDADO 20X25 CM"},null,{"$f":"IF(H$12>CÁLCULO.NúmeroDeFrentes,\"\",OFFSET(CÁLCULO!$P$12,0,H$12))","v":"PILARES PRÉ MOLDADO 20X25 CM"},{"$f":"IF(I$12>CÁLCULO.NúmeroDeFrentes,\"\",OFFSET(CÁLCULO!$P$12,0,I$12))","v":"ESTRUTURA E COBERTURA"},{"$f":"IF(J$12>CÁLCULO.NúmeroDeFrentes,\"\",OFFSET(CÁLCULO!$P$12,0,J$12))","v":"ESTRUTURA E COBERTURA"},{"$f":"IF(K$12>CÁLCULO.NúmeroDeFrentes,\"\",OFFSET(CÁLCULO!$P$12,0,K$12))","v":0},{"$f":"IF(L$12>CÁLCULO.NúmeroDeFrentes,\"\",OFFSET(CÁLCULO!$P$12,0,L$12))","v":0},{"$f":"IF(M$12>CÁLCULO.NúmeroDeFrentes,\"\",OFFSET(CÁLCULO!$P$12,0,M$12))","v":0},{"$f":"IF(N$12>CÁLCULO.NúmeroDeFrentes,\"\",OFFSET(CÁLCULO!$P$12,0,N$12))","v":0},{"$f":"IF(O$12>CÁLCULO.NúmeroDeFrentes,\"\",OFFSET(CÁLCULO!$P$12,0,O$12))","v":0},{"$f":"IF(P$12>CÁLCULO.NúmeroDeFrentes,\"\",OFFSET(CÁLCULO!$P$12,0,P$12))","v":0},{"$f":"IF(Q$12>CÁLCULO.NúmeroDeFrentes,\"\",OFFSET(CÁLCULO!$P$12,0,Q$12))","v":0},{"$f":"IF(R$12>CÁLCULO.NúmeroDeFrentes,\"\",OFFSET(CÁLCULO!$P$12,0,R$12))","v":""},{"$f":"IF(S$12>CÁLCULO.NúmeroDeFrentes,\"\",OFFSET(CÁLCULO!$P$12,0,S$12))","v":""},{"$f":"IF(T$12>CÁLCULO.NúmeroDeFrentes,\"\",OFFSET(CÁLCULO!$P$12,0,T$12))","v":""},{"$f":"IF(U$12>CÁLCULO.NúmeroDeFrentes,\"\",OFFSET(CÁLCULO!$P$12,0,U$12))","v":""},{"$f":"IF(V$12>CÁLCULO.NúmeroDeFrentes,\"\",OFFSET(CÁLCULO!$P$12,0,V$12))","v":""},{"$f":"IF(W$12>CÁLCULO.NúmeroDeFrentes,\"\",OFFSET(CÁLCULO!$P$12,0,W$12))","v":""},{"$f":"IF(X$12>CÁLCULO.NúmeroDeFrentes,\"\",OFFSET(CÁLCULO!$P$12,0,X$12))","v":""},{"$f":"IF(Y$12>CÁLCULO.NúmeroDeFrentes,\"\",OFFSET(CÁLCULO!$P$12,0,Y$12))","v":""},{"$f":"IF(Z$12>CÁLCULO.NúmeroDeFrentes,\"\",OFFSET(CÁLCULO!$P$12,0,Z$12))","v":""},{"$f":"IF(AA$12>CÁLCULO.NúmeroDeFrentes,\"\",OFFSET(CÁLCULO!$P$12,0,AA$12))","v":""},{"$f":"IF(AB$12>CÁLCULO.NúmeroDeFrentes,\"\",OFFSET(CÁLCULO!$P$12,0,AB$12))","v":""},{"$f":"IF(AC$12>CÁLCULO.NúmeroDeFrentes,\"\",OFFSET(CÁLCULO!$P$12,0,AC$12))","v":""},{"$f":"IF(AD$12>CÁLCULO.NúmeroDeFrentes,\"\",OFFSET(CÁLCULO!$P$12,0,AD$12))","v":""},{"$f":"IF(AE$12>CÁLCULO.NúmeroDeFrentes,\"\",OFFSET(CÁLCULO!$P$12,0,AE$12))","v":""},{"$f":"IF(AF$12>CÁLCULO.NúmeroDeFrentes,\"\",OFFSET(CÁLCULO!$P$12,0,AF$12))","v":""}]
["↓","Nº do Evento","Título dos Eventos",null,null,{"$f":"OFFSET(F12,0,-1)+1","v":1},null,{"$f":"OFFSET(H12,0,-1)+1","v":1},{"$f":"OFFSET(I12,0,-1)+1","v":2},{"$f":"OFFSET(J12,0,-1)+1","v":3},4,5,6,7,8,9,10,11,12,13,14,15,16,17,18,19,20,21,22,23,24,25]
[null,null,null,null,null,null,null,null,null,null,null,null,null,"Informe abaixo o NÚMERO DA MEDIÇÃO em que os eventos foram concluídos"]
["F"]
[{"$f":"IF(B15=0,\"\",\"F\")","v":""},{"$f":"EVENTOS!$C$15","v":0},{"$f":"EVENTOS!$D$15","v":""},null,null,null,null,{"$f":"IF(AUTOEVENTO=\"MANUAL\",\"A administração local será proporcional a execução dos demais eventos, independente de frentes de obra.\",\"Para aplicação de Adm. Local é necessário definir os eventos manualmente.\")","v":"Para aplicação de Adm. Local é necessário definir os eventos manualmente."}]
[{"$f":"IF(C16=0,\"\",\"F\")","v":"F"},{"$f":"OFFSET(B16,-1,0)+1","v":1},{"$f":"IF(AUTOEVENTO=\"Manual\",OFFSET(EVENTOS!$D$15,$B16-$B$15,0),IF(B16<=MAX(CÁLCULO!$M$15:$M$27),VLOOKUP($B16,CÁLCULO!$M$15:$N$27,2,FALSE),0))","v":"PILARES PRÉ MOLDADO 20X25 CM"}]
["F",2,{"$f":"IF(AUTOEVENTO=\"Manual\",OFFSET(EVENTOS!$D$15,$B17-$B$15,0),IF(B17<=MAX(CÁLCULO!$M$15:$M$27),VLOOKUP($B17,CÁLCULO!$M$15:$N$27,2,FALSE),0))","v":"ESTRUTURA E COBERTURA "}]
["F"]
["F"]
["F",null,null,null,null,null,null,null,"Data das Medições"]
["F",null,null,null,null,null,null,{"$f":"IF(INDEX($I$21:$AG$21,MATCH(PLE.Medicao,$I$22:$AG$22,0))=\"\",\"Preencher a data da medição \"&PLE.Medicao,\"\")","v":"Preencher a data da medição 1"}]
["F",null,null,"Medições",null,null,null,null,{"$f":"IF(PLE.Medicao<=12,1,TRUNC((PLE.Medicao - 2)/11,0) * 11 + 1)","v":1},null,{"$f":"I22+1","v":2},null,{"$f":"K22+1","v":3},null,{"$f":"M22+1","v":4},null,{"$f":"O22+1","v":5},null,{"$f":"Q22+1","v":6},null,{"$f":"S22+1","v":7},null,{"$f":"U22+1","v":8},null,{"$f":"W22+1","v":9},null,{"$f":"Y22+1","v":10},null,{"$f":"AA22+1","v":11},null,{"$f":"AC22+1","v":12}]
["F",null,null,"Período:",null,null,null,"%",{"$f":"ROUND(I24,2)/ORÇAMENTO!$X$15","v":0},null,{"$f":"ROUND(K24,2)/ORÇAMENTO!$X$15","v":0},null,{"$f":"ROUND(M24,2)/ORÇAMENTO!$X$15","v":0},null,{"$f":"ROUND(O24,2)/ORÇAMENTO!$X$15","v":0},null,{"$f":"ROUND(Q24,2)/ORÇAMENTO!$X$15","v":0},null,{"$f":"ROUND(S24,2)/ORÇAMENTO!$X$15","v":0},null,{"$f":"ROUND(U24,2)/ORÇAMENTO!$X$15","v":0},null,{"$f":"ROUND(W24,2)/ORÇAMENTO!$X$15","v":0},null,{"$f":"ROUND(Y24,2)/ORÇAMENTO!$X$15","v":0},null,{"$f":"ROUND(AA24,2)/ORÇAMENTO!$X$15","v":0},null,{"$f":"ROUND(AC24,2)/ORÇAMENTO!$X$15","v":0},null,{"$f":"ROUND(AE24,2)/ORÇAMENTO!$X$15","v":0}]
["F",null,null,null,null,null,null,"R$",{"$f":"IF(I22=1,I26,_xlfn.SINGLE(AH11ARRED(I26,2))-ROUND(SUMIF(CÁLCULO!$AX$15:$BH$27,\"<=\"&PLE!I22-1,CÁLCULO!$AB$15:$AL$27)*IF(AdmLocal=\"Automática\",(1+_xlfn.SINGLE(CÁLCULO.TotalAdmLocal)/(ORÇAMENTO!$X$15-_xlfn.SINGLE(CÁLCULO.TotalAdmLocal))),1),2))","v":0},null,{"$f":"ROUND(K26,2)-ROUND(I26,2)","v":0},null,{"$f":"ROUND(M26,2)-ROUND(K26,2)","v":0},null,{"$f":"ROUND(O26,2)-ROUND(M26,2)","v":0},null,{"$f":"ROUND(Q26,2)-ROUND(O26,2)","v":0},null,{"$f":"ROUND(S26,2)-ROUND(Q26,2)","v":0},null,{"$f":"ROUND(U26,2)-ROUND(S26,2)","v":0},null,{"$f":"ROUND(W26,2)-ROUND(U26,2)","v":0},null,{"$f":"ROUND(Y26,2)-ROUND(W26,2)","v":0},null,{"$f":"ROUND(AA26,2)-ROUND(Y26,2)","v":0},null,{"$f":"ROUND(AC26,2)-ROUND(AA26,2)","v":0},null,{"$f":"ROUND(AE26,2)-ROUND(AC26,2)","v":0}]
["F",null,null,"Acumulado:",null,null,null,"%",{"$f":"ROUND(I26,2)/ORÇAMENTO!$X$15","v":0},null,{"$f":"ROUND(K26,2)/ORÇAMENTO!$X$15","v":0},null,{"$f":"ROUND(M26,2)/ORÇAMENTO!$X$15","v":0},null,{"$f":"ROUND(O26,2)/ORÇAMENTO!$X$15","v":0},null,{"$f":"ROUND(Q26,2)/ORÇAMENTO!$X$15","v":0},null,{"$f":"ROUND(S26,2)/ORÇAMENTO!$X$15","v":0},null,{"$f":"ROUND(U26,2)/ORÇAMENTO!$X$15","v":0},null,{"$f":"ROUND(W26,2)/ORÇAMENTO!$X$15","v":0},null,{"$f":"ROUND(Y26,2)/ORÇAMENTO!$X$15","v":0},null,{"$f":"ROUND(AA26,2)/ORÇAMENTO!$X$15","v":0},null,{"$f":"ROUND(AC26,2)/ORÇAMENTO!$X$15","v":0},null,{"$f":"ROUND(AE26,2)/ORÇAMENTO!$X$15","v":0}]
["F",null,null,null,null,null,null,"R$",{"$f":"SUMIF(CÁLCULO!$AX$15:$BH$27,\"<=\"&PLE!I22,CÁLCULO!$AB$15:$AL$27)*IF(AdmLocal=\"Automática\",(1+_xlfn.SINGLE(CÁLCULO.TotalAdmLocal)/(ORÇAMENTO!$X$15-_xlfn.SINGLE(CÁLCULO.TotalAdmLocal))),1)","v":0},null,{"$f":"SUMIF(CÁLCULO!$AX$15:$BH$27,\"<=\"&PLE!K22,CÁLCULO!$AB$15:$AL$27)*IF(AdmLocal=\"Automática\",(1+_xlfn.SINGLE(CÁLCULO.TotalAdmLocal)/(ORÇAMENTO!$X$15-_xlfn.SINGLE(CÁLCULO.TotalAdmLocal))),1)","v":0},null,{"$f":"SUMIF(CÁLCULO!$AX$15:$BH$27,\"<=\"&PLE!M22,CÁLCULO!$AB$15:$AL$27)*IF(AdmLocal=\"Automática\",(1+_xlfn.SINGLE(CÁLCULO.TotalAdmLocal)/(ORÇAMENTO!$X$15-_xlfn.SINGLE(CÁLCULO.TotalAdmLocal))),1)","v":0},null,{"$f":"SUMIF(CÁLCULO!$AX$15:$BH$27,\"<=\"&PLE!O22,CÁLCULO!$AB$15:$AL$27)*IF(AdmLocal=\"Automática\",(1+_xlfn.SINGLE(CÁLCULO.TotalAdmLocal)/(ORÇAMENTO!$X$15-_xlfn.SINGLE(CÁLCULO.TotalAdmLocal))),1)","v":0},null,{"$f":"SUMIF(CÁLCULO!$AX$15:$BH$27,\"<=\"&PLE!Q22,CÁLCULO!$AB$15:$AL$27)*IF(AdmLocal=\"Automática\",(1+_xlfn.SINGLE(CÁLCULO.TotalAdmLocal)/(ORÇAMENTO!$X$15-_xlfn.SINGLE(CÁLCULO.TotalAdmLocal))),1)","v":0},null,{"$f":"SUMIF(CÁLCULO!$AX$15:$BH$27,\"<=\"&PLE!S22,CÁLCULO!$AB$15:$AL$27)*IF(AdmLocal=\"Automática\",(1+_xlfn.SINGLE(CÁLCULO.TotalAdmLocal)/(ORÇAMENTO!$X$15-_xlfn.SINGLE(CÁLCULO.TotalAdmLocal))),1)","v":0},null,{"$f":"SUMIF(CÁLCULO!$AX$15:$BH$27,\"<=\"&PLE!U22,CÁLCULO!$AB$15:$AL$27)*IF(AdmLocal=\"Automática\",(1+_xlfn.SINGLE(CÁLCULO.TotalAdmLocal)/(ORÇAMENTO!$X$15-_xlfn.SINGLE(CÁLCULO.TotalAdmLocal))),1)","v":0},null,{"$f":"SUMIF(CÁLCULO!$AX$15:$BH$27,\"<=\"&PLE!W22,CÁLCULO!$AB$15:$AL$27)*IF(AdmLocal=\"Automática\",(1+_xlfn.SINGLE(CÁLCULO.TotalAdmLocal)/(ORÇAMENTO!$X$15-_xlfn.SINGLE(CÁLCULO.TotalAdmLocal))),1)","v":0},null,{"$f":"SUMIF(CÁLCULO!$AX$15:$BH$27,\"<=\"&PLE!Y22,CÁLCULO!$AB$15:$AL$27)*IF(AdmLocal=\"Automática\",(1+_xlfn.SINGLE(CÁLCULO.TotalAdmLocal)/(ORÇAMENTO!$X$15-_xlfn.SINGLE(CÁLCULO.TotalAdmLocal))),1)","v":0},null,{"$f":"SUMIF(CÁLCULO!$AX$15:$BH$27,\"<=\"&PLE!AA22,CÁLCULO!$AB$15:$AL$27)*IF(AdmLocal=\"Automática\",(1+_xlfn.SINGLE(CÁLCULO.TotalAdmLocal)/(ORÇAMENTO!$X$15-_xlfn.SINGLE(CÁLCULO.TotalAdmLocal))),1)","v":0},null,{"$f":"SUMIF(CÁLCULO!$AX$15:$BH$27,\"<=\"&PLE!AC22,CÁLCULO!$AB$15:$AL$27)*IF(AdmLocal=\"Automática\",(1+_xlfn.SINGLE(CÁLCULO.TotalAdmLocal)/(ORÇAMENTO!$X$15-_xlfn.SINGLE(CÁLCULO.TotalAdmLocal))),1)","v":0},null,{"$f":"SUMIF(CÁLCULO!$AX$15:$BH$27,\"<=\"&PLE!AE22,CÁLCULO!$AB$15:$AL$27)*IF(AdmLocal=\"Automática\",(1+_xlfn.SINGLE(CÁLCULO.TotalAdmLocal)/(ORÇAMENTO!$X$15-_xlfn.SINGLE(CÁLCULO.TotalAdmLocal))),1)","v":0}]
[null,null,null,"Administração Local",null,null,null,"%",{"$f":"IF(OR(_xlfn.SINGLE(ACOMPANHAMENTO)<>\"PLE\",I22>PLE.Medicao),0,\n   IF(AUTOEVENTO=\"Manual\",\n      IF(AdmLocal=\"Automática\",I25,\n         IF(Import.EventoAdmLocal=\"\",\"\",SUMIF(OFFSET($G$14,CRONOPLE!$A$8+1,1,1,OFFSET($AG$12,0,-1)),\"<=\"&I22,OFFSET(EVENTOS!$G$14,CRONOPLE!$A$8+1,1,1,OFFSET($AG$12,0,-1)))/OFFSET(EVENTOS!$G$14,CRONOPLE!$A$8+1,-1))),\n      IF(Import.EventoAdmLocal=\"\",\"\",SUMIF(OFFSET(CÁLCULO!$AW$15,CRONOPLE!$A$10,1,OFFSET(ORÇAMENTO!$D$15,CRONOPLE!$A$10,0),COLUMN(CÁLCULO!$BH$15)-COLUMN(CÁLCULO!$AW$15)-1),\"<=\"&I22,OFFSET(CÁLCULO!$AA$15,CRONOPLE!$A$10,1,OFFSET(ORÇAMENTO!$D$15,CRONOPLE!$A$10,0),COLUMN(CÁLCULO!$AL$15)-COLUMN(CÁLCULO!$AA$15)-1))/OFFSET(ORÇAMENTO!$X$15,CRONOPLE!$A$10,0))))","v":0},null,{"$f":"IF(OR(_xlfn.SINGLE(ACOMPANHAMENTO)<>\"PLE\",K22>PLE.Medicao),0,\n   IF(AUTOEVENTO=\"Manual\",\n      IF(AdmLocal=\"Automática\",K25,\n         IF(Import.EventoAdmLocal=\"\",\"\",SUMIF(OFFSET($G$14,CRONOPLE!$A$8+1,1,1,OFFSET($AG$12,0,-1)),\"<=\"&K22,OFFSET(EVENTOS!$G$14,CRONOPLE!$A$8+1,1,1,OFFSET($AG$12,0,-1)))/OFFSET(EVENTOS!$G$14,CRONOPLE!$A$8+1,-1))),\n      IF(Import.EventoAdmLocal=\"\",\"\",SUMIF(OFFSET(CÁLCULO!$AW$15,CRONOPLE!$A$10,1,OFFSET(ORÇAMENTO!$D$15,CRONOPLE!$A$10,0),COLUMN(CÁLCULO!$BH$15)-COLUMN(CÁLCULO!$AW$15)-1),\"<=\"&K22,OFFSET(CÁLCULO!$AA$15,CRONOPLE!$A$10,1,OFFSET(ORÇAMENTO!$D$15,CRONOPLE!$A$10,0),COLUMN(CÁLCULO!$AL$15)-COLUMN(CÁLCULO!$AA$15)-1))/OFFSET(ORÇAMENTO!$X$15,CRONOPLE!$A$10,0))))","v":0},null,{"$f":"IF(OR(_xlfn.SINGLE(ACOMPANHAMENTO)<>\"PLE\",M22>PLE.Medicao),0,\n   IF(AUTOEVENTO=\"Manual\",\n      IF(AdmLocal=\"Automática\",M25,\n         IF(Import.EventoAdmLocal=\"\",\"\",SUMIF(OFFSET($G$14,CRONOPLE!$A$8+1,1,1,OFFSET($AG$12,0,-1)),\"<=\"&M22,OFFSET(EVENTOS!$G$14,CRONOPLE!$A$8+1,1,1,OFFSET($AG$12,0,-1)))/OFFSET(EVENTOS!$G$14,CRONOPLE!$A$8+1,-1))),\n      IF(Import.EventoAdmLocal=\"\",\"\",SUMIF(OFFSET(CÁLCULO!$AW$15,CRONOPLE!$A$10,1,OFFSET(ORÇAMENTO!$D$15,CRONOPLE!$A$10,0),COLUMN(CÁLCULO!$BH$15)-COLUMN(CÁLCULO!$AW$15)-1),\"<=\"&M22,OFFSET(CÁLCULO!$AA$15,CRONOPLE!$A$10,1,OFFSET(ORÇAMENTO!$D$15,CRONOPLE!$A$10,0),COLUMN(CÁLCULO!$AL$15)-COLUMN(CÁLCULO!$AA$15)-1))/OFFSET(ORÇAMENTO!$X$15,CRONOPLE!$A$10,0))))","v":0},null,{"$f":"IF(OR(_xlfn.SINGLE(ACOMPANHAMENTO)<>\"PLE\",O22>PLE.Medicao),0,\n   IF(AUTOEVENTO=\"Manual\",\n      IF(AdmLocal=\"Automática\",O25,\n         IF(Import.EventoAdmLocal=\"\",\"\",SUMIF(OFFSET($G$14,CRONOPLE!$A$8+1,1,1,OFFSET($AG$12,0,-1)),\"<=\"&O22,OFFSET(EVENTOS!$G$14,CRONOPLE!$A$8+1,1,1,OFFSET($AG$12,0,-1)))/OFFSET(EVENTOS!$G$14,CRONOPLE!$A$8+1,-1))),\n      IF(Import.EventoAdmLocal=\"\",\"\",SUMIF(OFFSET(CÁLCULO!$AW$15,CRONOPLE!$A$10,1,OFFSET(ORÇAMENTO!$D$15,CRONOPLE!$A$10,0),COLUMN(CÁLCULO!$BH$15)-COLUMN(CÁLCULO!$AW$15)-1),\"<=\"&O22,OFFSET(CÁLCULO!$AA$15,CRONOPLE!$A$10,1,OFFSET(ORÇAMENTO!$D$15,CRONOPLE!$A$10,0),COLUMN(CÁLCULO!$AL$15)-COLUMN(CÁLCULO!$AA$15)-1))/OFFSET(ORÇAMENTO!$X$15,CRONOPLE!$A$10,0))))","v":0},null,{"$f":"IF(OR(_xlfn.SINGLE(ACOMPANHAMENTO)<>\"PLE\",Q22>PLE.Medicao),0,\n   IF(AUTOEVENTO=\"Manual\",\n      IF(AdmLocal=\"Automática\",Q25,\n         IF(Import.EventoAdmLocal=\"\",\"\",SUMIF(OFFSET($G$14,CRONOPLE!$A$8+1,1,1,OFFSET($AG$12,0,-1)),\"<=\"&Q22,OFFSET(EVENTOS!$G$14,CRONOPLE!$A$8+1,1,1,OFFSET($AG$12,0,-1)))/OFFSET(EVENTOS!$G$14,CRONOPLE!$A$8+1,-1))),\n      IF(Import.EventoAdmLocal=\"\",\"\",SUMIF(OFFSET(CÁLCULO!$AW$15,CRONOPLE!$A$10,1,OFFSET(ORÇAMENTO!$D$15,CRONOPLE!$A$10,0),COLUMN(CÁLCULO!$BH$15)-COLUMN(CÁLCULO!$AW$15)-1),\"<=\"&Q22,OFFSET(CÁLCULO!$AA$15,CRONOPLE!$A$10,1,OFFSET(ORÇAMENTO!$D$15,CRONOPLE!$A$10,0),COLUMN(CÁLCULO!$AL$15)-COLUMN(CÁLCULO!$AA$15)-1))/OFFSET(ORÇAMENTO!$X$15,CRONOPLE!$A$10,0))))","v":0},null,{"$f":"IF(OR(_xlfn.SINGLE(ACOMPANHAMENTO)<>\"PLE\",S22>PLE.Medicao),0,\n   IF(AUTOEVENTO=\"Manual\",\n      IF(AdmLocal=\"Automática\",S25,\n         IF(Import.EventoAdmLocal=\"\",\"\",SUMIF(OFFSET($G$14,CRONOPLE!$A$8+1,1,1,OFFSET($AG$12,0,-1)),\"<=\"&S22,OFFSET(EVENTOS!$G$14,CRONOPLE!$A$8+1,1,1,OFFSET($AG$12,0,-1)))/OFFSET(EVENTOS!$G$14,CRONOPLE!$A$8+1,-1))),\n      IF(Import.EventoAdmLocal=\"\",\"\",SUMIF(OFFSET(CÁLCULO!$AW$15,CRONOPLE!$A$10,1,OFFSET(ORÇAMENTO!$D$15,CRONOPLE!$A$10,0),COLUMN(CÁLCULO!$BH$15)-COLUMN(CÁLCULO!$AW$15)-1),\"<=\"&S22,OFFSET(CÁLCULO!$AA$15,CRONOPLE!$A$10,1,OFFSET(ORÇAMENTO!$D$15,CRONOPLE!$A$10,0),COLUMN(CÁLCULO!$AL$15)-COLUMN(CÁLCULO!$AA$15)-1))/OFFSET(ORÇAMENTO!$X$15,CRONOPLE!$A$10,0))))","v":0},null,{"$f":"IF(OR(_xlfn.SINGLE(ACOMPANHAMENTO)<>\"PLE\",U22>PLE.Medicao),0,\n   IF(AUTOEVENTO=\"Manual\",\n      IF(AdmLocal=\"Automática\",U25,\n         IF(Import.EventoAdmLocal=\"\",\"\",SUMIF(OFFSET($G$14,CRONOPLE!$A$8+1,1,1,OFFSET($AG$12,0,-1)),\"<=\"&U22,OFFSET(EVENTOS!$G$14,CRONOPLE!$A$8+1,1,1,OFFSET($AG$12,0,-1)))/OFFSET(EVENTOS!$G$14,CRONOPLE!$A$8+1,-1))),\n      IF(Import.EventoAdmLocal=\"\",\"\",SUMIF(OFFSET(CÁLCULO!$AW$15,CRONOPLE!$A$10,1,OFFSET(ORÇAMENTO!$D$15,CRONOPLE!$A$10,0),COLUMN(CÁLCULO!$BH$15)-COLUMN(CÁLCULO!$AW$15)-1),\"<=\"&U22,OFFSET(CÁLCULO!$AA$15,CRONOPLE!$A$10,1,OFFSET(ORÇAMENTO!$D$15,CRONOPLE!$A$10,0),COLUMN(CÁLCULO!$AL$15)-COLUMN(CÁLCULO!$AA$15)-1))/OFFSET(ORÇAMENTO!$X$15,CRONOPLE!$A$10,0))))","v":0},null,{"$f":"IF(OR(_xlfn.SINGLE(ACOMPANHAMENTO)<>\"PLE\",W22>PLE.Medicao),0,\n   IF(AUTOEVENTO=\"Manual\",\n      IF(AdmLocal=\"Automática\",W25,\n         IF(Import.EventoAdmLocal=\"\",\"\",SUMIF(OFFSET($G$14,CRONOPLE!$A$8+1,1,1,OFFSET($AG$12,0,-1)),\"<=\"&W22,OFFSET(EVENTOS!$G$14,CRONOPLE!$A$8+1,1,1,OFFSET($AG$12,0,-1)))/OFFSET(EVENTOS!$G$14,CRONOPLE!$A$8+1,-1))),\n      IF(Import.EventoAdmLocal=\"\",\"\",SUMIF(OFFSET(CÁLCULO!$AW$15,CRONOPLE!$A$10,1,OFFSET(ORÇAMENTO!$D$15,CRONOPLE!$A$10,0),COLUMN(CÁLCULO!$BH$15)-COLUMN(CÁLCULO!$AW$15)-1),\"<=\"&W22,OFFSET(CÁLCULO!$AA$15,CRONOPLE!$A$10,1,OFFSET(ORÇAMENTO!$D$15,CRONOPLE!$A$10,0),COLUMN(CÁLCULO!$AL$15)-COLUMN(CÁLCULO!$AA$15)-1))/OFFSET(ORÇAMENTO!$X$15,CRONOPLE!$A$10,0))))","v":0},null,{"$f":"IF(OR(_xlfn.SINGLE(ACOMPANHAMENTO)<>\"PLE\",Y22>PLE.Medicao),0,\n   IF(AUTOEVENTO=\"Manual\",\n      IF(AdmLocal=\"Automática\",Y25,\n         IF(Import.EventoAdmLocal=\"\",\"\",SUMIF(OFFSET($G$14,CRONOPLE!$A$8+1,1,1,OFFSET($AG$12,0,-1)),\"<=\"&Y22,OFFSET(EVENTOS!$G$14,CRONOPLE!$A$8+1,1,1,OFFSET($AG$12,0,-1)))/OFFSET(EVENTOS!$G$14,CRONOPLE!$A$8+1,-1))),\n      IF(Import.EventoAdmLocal=\"\",\"\",SUMIF(OFFSET(CÁLCULO!$AW$15,CRONOPLE!$A$10,1,OFFSET(ORÇAMENTO!$D$15,CRONOPLE!$A$10,0),COLUMN(CÁLCULO!$BH$15)-COLUMN(CÁLCULO!$AW$15)-1),\"<=\"&Y22,OFFSET(CÁLCULO!$AA$15,CRONOPLE!$A$10,1,OFFSET(ORÇAMENTO!$D$15,CRONOPLE!$A$10,0),COLUMN(CÁLCULO!$AL$15)-COLUMN(CÁLCULO!$AA$15)-1))/OFFSET(ORÇAMENTO!$X$15,CRONOPLE!$A$10,0))))","v":0},null,{"$f":"IF(OR(_xlfn.SINGLE(ACOMPANHAMENTO)<>\"PLE\",AA22>PLE.Medicao),0,\n   IF(AUTOEVENTO=\"Manual\",\n      IF(AdmLocal=\"Automática\",AA25,\n         IF(Import.EventoAdmLocal=\"\",\"\",SUMIF(OFFSET($G$14,CRONOPLE!$A$8+1,1,1,OFFSET($AG$12,0,-1)),\"<=\"&AA22,OFFSET(EVENTOS!$G$14,CRONOPLE!$A$8+1,1,1,OFFSET($AG$12,0,-1)))/OFFSET(EVENTOS!$G$14,CRONOPLE!$A$8+1,-1))),\n      IF(Import.EventoAdmLocal=\"\",\"\",SUMIF(OFFSET(CÁLCULO!$AW$15,CRONOPLE!$A$10,1,OFFSET(ORÇAMENTO!$D$15,CRONOPLE!$A$10,0),COLUMN(CÁLCULO!$BH$15)-COLUMN(CÁLCULO!$AW$15)-1),\"<=\"&AA22,OFFSET(CÁLCULO!$AA$15,CRONOPLE!$A$10,1,OFFSET(ORÇAMENTO!$D$15,CRONOPLE!$A$10,0),COLUMN(CÁLCULO!$AL$15)-COLUMN(CÁLCULO!$AA$15)-1))/OFFSET(ORÇAMENTO!$X$15,CRONOPLE!$A$10,0))))","v":0},null,{"$f":"IF(OR(_xlfn.SINGLE(ACOMPANHAMENTO)<>\"PLE\",AC22>PLE.Medicao),0,\n   IF(AUTOEVENTO=\"Manual\",\n      IF(AdmLocal=\"Automática\",AC25,\n         IF(Import.EventoAdmLocal=\"\",\"\",SUMIF(OFFSET($G$14,CRONOPLE!$A$8+1,1,1,OFFSET($AG$12,0,-1)),\"<=\"&AC22,OFFSET(EVENTOS!$G$14,CRONOPLE!$A$8+1,1,1,OFFSET($AG$12,0,-1)))/OFFSET(EVENTOS!$G$14,CRONOPLE!$A$8+1,-1))),\n      IF(Import.EventoAdmLocal=\"\",\"\",SUMIF(OFFSET(CÁLCULO!$AW$15,CRONOPLE!$A$10,1,OFFSET(ORÇAMENTO!$D$15,CRONOPLE!$A$10,0),COLUMN(CÁLCULO!$BH$15)-COLUMN(CÁLCULO!$AW$15)-1),\"<=\"&AC22,OFFSET(CÁLCULO!$AA$15,CRONOPLE!$A$10,1,OFFSET(ORÇAMENTO!$D$15,CRONOPLE!$A$10,0),COLUMN(CÁLCULO!$AL$15)-COLUMN(CÁLCULO!$AA$15)-1))/OFFSET(ORÇAMENTO!$X$15,CRONOPLE!$A$10,0))))","v":0},null,{"$f":"IF(OR(_xlfn.SINGLE(ACOMPANHAMENTO)<>\"PLE\",AE22>PLE.Medicao),0,\n   IF(AUTOEVENTO=\"Manual\",\n      IF(AdmLocal=\"Automática\",AE25,\n         IF(Import.EventoAdmLocal=\"\",\"\",SUMIF(OFFSET($G$14,CRONOPLE!$A$8+1,1,1,OFFSET($AG$12,0,-1)),\"<=\"&AE22,OFFSET(EVENTOS!$G$14,CRONOPLE!$A$8+1,1,1,OFFSET($AG$12,0,-1)))/OFFSET(EVENTOS!$G$14,CRONOPLE!$A$8+1,-1))),\n      IF(Import.EventoAdmLocal=\"\",\"\",SUMIF(OFFSET(CÁLCULO!$AW$15,CRONOPLE!$A$10,1,OFFSET(ORÇAMENTO!$D$15,CRONOPLE!$A$10,0),COLUMN(CÁLCULO!$BH$15)-COLUMN(CÁLCULO!$AW$15)-1),\"<=\"&AE22,OFFSET(CÁLCULO!$AA$15,CRONOPLE!$A$10,1,OFFSET(ORÇAMENTO!$D$15,CRONOPLE!$A$10,0),COLUMN(CÁLCULO!$AL$15)-COLUMN(CÁLCULO!$AA$15)-1))/OFFSET(ORÇAMENTO!$X$15,CRONOPLE!$A$10,0))))","v":0}]
["F",null,null,null,null,null,null,{"$f":"IF(COUNTIF(I28:AG28,\"%Adm>%Global\")>0,\"Verificar proporcionalidade da Administração Local\",\"\")","v":""},{"$f":"IF(I27=\"\",\"\",IF(ROUND(I27,4)>ROUND(I25,4),\"%Adm>%Global\",\"\"))","v":""},null,{"$f":"IF(K27=\"\",\"\",IF(ROUND(K27,4)>ROUND(K25,4),\"%Adm>%Global\",\"\"))","v":""},null,{"$f":"IF(M27=\"\",\"\",IF(ROUND(M27,4)>ROUND(M25,4),\"%Adm>%Global\",\"\"))","v":""},null,{"$f":"IF(O27=\"\",\"\",IF(ROUND(O27,4)>ROUND(O25,4),\"%Adm>%Global\",\"\"))","v":""},null,{"$f":"IF(Q27=\"\",\"\",IF(ROUND(Q27,4)>ROUND(Q25,4),\"%Adm>%Global\",\"\"))","v":""},null,{"$f":"IF(S27=\"\",\"\",IF(ROUND(S27,4)>ROUND(S25,4),\"%Adm>%Global\",\"\"))","v":""},null,{"$f":"IF(U27=\"\",\"\",IF(ROUND(U27,4)>ROUND(U25,4),\"%Adm>%Global\",\"\"))","v":""},null,{"$f":"IF(W27=\"\",\"\",IF(ROUND(W27,4)>ROUND(W25,4),\"%Adm>%Global\",\"\"))","v":""},null,{"$f":"IF(Y27=\"\",\"\",IF(ROUND(Y27,4)>ROUND(Y25,4),\"%Adm>%Global\",\"\"))","v":""},null,{"$f":"IF(AA27=\"\",\"\",IF(ROUND(AA27,4)>ROUND(AA25,4),\"%Adm>%Global\",\"\"))","v":""},null,{"$f":"IF(AC27=\"\",\"\",IF(ROUND(AC27,4)>ROUND(AC25,4),\"%Adm>%Global\",\"\"))","v":""},null,{"$f":"IF(AE27=\"\",\"\",IF(ROUND(AE27,4)>ROUND(AE25,4),\"%Adm>%Global\",\"\"))","v":""}]
["F"]
["F",{"$f":"Import.Município","v":"SÃO VALENTIM/RS"},null,null,null,null,null,null,null,null,null,null,null,null,null,null,null,null,{"$f":"IF(DADOS!$D$50<>\"\",\"Preencher os Dados do Responsável pela Fiscalização, na aba DADOS.\",\"\")","v":""}]
["F","Local",null,null,null,null,null,null,null,null,null,null,null,null,null,null,null,null,null,null,"Responsável Técnico pela Fiscalização"]
["F",null,null,null,null,null,null,null,null,null,null,null,null,null,null,null,null,null,null,null,"Nome:",null,{"$f":"Import.RespFiscalização","v":0}]
["F",{"$f":"DADOS!$C$48","v":"00:00:00"},null,null,null,null,null,null,null,null,null,null,null,null,null,null,null,null,null,null,"Profissão:",null,0]
["F","Data",null,null,null,null,null,null,null,null,null,null,null,null,null,null,null,null,null,null,"CREA/CAU:",null,0]
[null,null,null,null,null,null,null,null,null,null,null,null,null,null,null,null,null,null,null,null,"ART/RRT:",null,0]

{"sheet":"BM","index":11,"n_rows":42,"n_cols":41,"rows_kept":42,"cut":false,"hidden":true,"merged":[[40,23,40,25],[35,3,35,14],[36,22,36,25],[38,23,38,25],[39,23,39,25],[33,3,33,11],[34,3,34,8],[14,27,14,38],[28,3,28,14],[28,19,28,25],[29,3,31,14],[29,19,31,25],[14,3,14,4],[10,27,10,38],[11,9,11,11],[11,12,11,14],[11,16,11,17],[6,5,6,7],[6,8,6,11],[6,12,6,13],[10,19,10,20],[7,2,11,2],[7,5,7,7],[7,8,7,11],[7,12,7,13],[9,5,10,8],[4,3,4,4],[4,5,4,7],[4,9,4,13],[2,0,2,1],[3,3,3,4],[3,5,3,7],[3,9,3,13]]}
[null,null,null,null,{"$f":"IF(CAIXA.Modo,\"BA - Boletim de Aferição\",\"BM - Boletim de Medição\")","v":"BM - Boletim de Medição"},null,null,null,null,null,null,null,null,null,"Grau de Sigilo"]
["Modo CAIXA",null,null,null,{"$f":"IF(Import.RegimeExecução=\"(SELECIONAR)\",\"Selecione o Regime de Execução na Aba Dados\",Import.RegimeExecução&\" - \"&import.recurso)","v":"Selecione o Regime de Execução na Aba Dados"},null,null,null,null,null,null,null,null,null,"#PUBLICO"]
[false]
[null,null,null,"PROPONENTE / TOMADOR",null,"Nº OPERAÇÃO",null,null,"Nº TransfereGOV","APELIDO DO EMPREENDIMENTO",null,null,null,null,"INÍCIO DE OBRA"]
["Regime ",null,null,{"$f":"Import.Proponente","v":"MUNICÍPIO DE SÃO VALENTIN"},null,{"$f":"Import.CR","v":0},null,null,{"$f":"Import.TransfereGOV","v":0},{"$f":"Import.Apelido","v":"COBERTURA RUA PEDRO DASSOLER"},null,null,null,null,{"$f":"Import.DataInicioObra","v":"00:00:00"},null,null,null,null,null,null,null,null,null,null,null,null,null,null,null,null,null,null,null,null,null,null,null,null,null,"Fórmula CopMed"]
[]
[{"$f":"RegimeExecucao","v":"Unitário"},null,null,"Nº CTEF","EMPRESA EXECUTORA","CNPJ",null,null,{"$f":"IF(TIPOORCAMENTO=\"Licitado\",\"REGIME DE EXECUÇÃO\",\"MUNICÍPIO / UF\")","v":"MUNICÍPIO / UF"},null,null,null,"PERÍODO DA MEDIÇÃO",null,"Nº MEDIÇÃO",null,null,null,null,null,null,null,null,null,null,null,null,null,null,null,null,null,null,null,null,null,null,null,null,null,{"$f":"BM.MEDAcumulado","v":0}]
["ARREDMED",null,"FILTRO",{"$f":"Import.CTEF","v":0},{"$f":"Import.empresa","v":0},{"$f":"Import.CNPJ","v":0},null,null,{"$f":"IF(TIPOORCAMENTO=\"Licitado\",Import.RegimeExecução,Import.Município)","v":"SÃO VALENTIM/RS"},null,null,null,{"$f":"TEXT(IF(BM.medicao=1,Import.DataInicioObra,OFFSET($AB$12,0,BM.medicao-1-$AB$13)+1),\"dd/mm/aaaa\")&\" a \"&TEXT(OFFSET($AB$12,0,BM.medicao-$AB$13),\"dd/mm/aaaa\")","v":"00/01/1900 a 00/01/1900"},null,1]
[true]
["Linha Adm. L.",null,null,null,null,{"$f":"IF(_xlfn.SINGLE(ACOMPANHAMENTO)=\"PLE\",\"Foi selecionado na aba 'MENU' o acompanhamento por PLE.\",\n  IF(_xlfn.SINGLE(TIPOORCAMENTO)=\"Proposto\",\"Altere na aba 'MENU' o tipo de orçamento para 'Licitado'.\",\n  IF(_xlfn.SINGLE(Import.RegimeExecução)=\"(SELECIONAR)\",UPPER($E$2),\n  IF(AND(BM.medicao=1,DADOS!$C$47=0),\"PREENCHER A DATA DE INÍCIO DA OBRA, NA ABA DADOS\",\n  IF($N$15=0,\"PREENCHER A MEDIÇÃO \"&BM.medicao,\n  IF($AB$10<>\"\",UPPER($AB$10),\n  IF($J$37<>\"\",UPPER($J$37),\n \"\")))))))","v":"Foi selecionado na aba 'MENU' o acompanhamento por PLE."},null,null,null,null,null,null,null,null,{"$f":"\"Realizado Acumulado: \"&TEXT(P10,\"0,00%\")","v":"Realizado Acumulado: 0,00%"},{"$f":"ROUND($O$15/($I$15+10^-12),4)","v":0},null,null,null,null,null,null,null,null,null,null,null,{"$f":"IF(INDEX($AB$12:$AN$12,MATCH($O$8,$AB$13:$AN$13,0))=0,\"Preencher a data da medição \"&$O$8,\"\")","v":"Preencher a data da medição 1"}]
[{"$f":"OFFSET(CRONO!$F$13,CRONO!$F$34,0)","v":2},null,null,null,null,null,null,null,null,null,null,null,null,null,{"$f":"IF(ISERROR(P11),\"\",\"Administração Local Acumulada: \"&TEXT(P11,\"0,00%\"))","v":"Administração Local Acumulada: 0,00%"},{"$f":"OFFSET($O$15,$A$11,0)/OFFSET($I$15,$A$11,0)","v":0},null,null,null,"Anexo",null,null,null,null,null,null,null,"Datas das Medições"]
[null,null,null,null,"Orçamento Contratado",null,null,null,null,{"$f":"\"Evolução Física \"&CHOOSE(MATCH(RegimeExecucao,{\"Unitário\",\"Global\"},0),\"(Qtde.)\",\"(%)\")","v":"Evolução Física (Qtde.)"},null,null,"Evolução Financeira (R$)",null,null,null,{"$f":"\"Aferido (CAIXA) \"&CHOOSE(MATCH(RegimeExecucao,{\"Unitário\",\"Global\"},0),\"(Qtde.)\",\"(%)\")","v":"Aferido (CAIXA) (Qtde.)"},null,null,"Quadro de Glosas"]
["n1","Altura","↓","Item","Descrição","Unidade","Quantidade","Preço Unitário (com BDI) (R$)","Preço Total\n(R$)","Acum. Anterior","Período","Acum. Incluindo o Período","Acum. Anterior","Período","Acum. Incluindo o Período",null,"Acum. Anterior","Acum. Incluindo o Período",null,"Item","Descrição",{"$f":"IF(RegimeExecucao=\"Unitário\",\"Unidade\",\"\")","v":"Unidade"},{"$f":"CHOOSE(MATCH(RegimeExecucao,{\"Unitário\",\"Global\"},0),\"Quant. Glosada (unid)\",\"Percentual Glosado (%)\")","v":"Quant. Glosada (unid)"},{"$f":"CHOOSE(MATCH(RegimeExecucao,{\"Unitário\",\"Global\"},0),\"Preço Unitário (R$)\",\"Valor Total do Item (R$)\")","v":"Preço Unitário (R$)"},"Valor Total Glosado (R$)","Motivo da Glosa",null,{"$f":"IF(BM.medicao<=12,1,TRUNC((BM.medicao - 2)/11,0) * 11 + 1)","v":1},{"$f":"OFFSET(AC13,0,-1)+1","v":2},{"$f":"OFFSET(AD13,0,-1)+1","v":3},4,5,6,7,8,9,10,11,12,null,"Valor Total Medido (R$)"]
[{"$f":"ORÇAMENTO!C14","v":"S"},{"$f":"ORÇAMENTO!D14","v":0},{"$f":"IF(OR($I14>0,$A14=1,$A14=2,$A14=3,$A14=4),\"F\",\"\")","v":""},{"$f":"ORÇAMENTO!O14","v":"-"},{"$f":"ORÇAMENTO.Descricao","v":"(abra o arquivo 'Referência 02-2026.xlsm)"},{"$f":"IF(RegimeExecucao=\"Global\",\"\",ORÇAMENTO.Unidade)","v":"-"},{"$f":"IF(RegimeExecucao=\"Global\",\"\",ORÇAMENTO!T14)","v":0},{"$f":"IF(RegimeExecucao=\"Global\",\"\",ORÇAMENTO!W14)","v":0},{"$f":"ORÇAMENTO!X14","v":0},{"$f":"_xlfn.SINGLE(IF($A14=\"S\",IF(CAIXA.Modo,BM.AFAnterior,BM.MEDAnterior),IF(AND(_xlfn.SINGLE(RegimeExecucao)=\"Global\",$I14>0,COUNTIF($AB$13:$AM$13,BM.medicao-1)>0),M14/$I14*100,0)))","v":0},{"$f":"L14-J14","v":0},{"$f":"_xlfn.SINGLE(IF($A14=\"S\",IF(CAIXA.Modo,BM.AFAcumulado,BM.MEDAcumulado),IF(AND(_xlfn.SINGLE(RegimeExecucao)=\"Global\",$I14>0,COUNTIF($AB$13:$AM$13,BM.medicao)>0),O14/$I14*100,0)))","v":0},{"$f":"IF($A14=\"S\",VTOTALBM,IF($A14=0,0,ROUND(SomaAgrupBM,15-13*ORÇAMENTO!$AF$11)))","v":0},{"$f":"O14-M14","v":0},{"$f":"IF($A14=\"S\",VTOTALBM,IF($A14=0,0,ROUND(SomaAgrupBM,15-13*ORÇAMENTO!$AF$11)))","v":0},null,null,null,null,{"$f":"IF($W14>0,$D14,\"\")","v":""},{"$f":"IF($W14>0,$E14,\"\")","v":""},{"$f":"IF(AND($W14>0,RegimeExecucao=\"Unitário\"),$F14,\"\")","v":""},{"$f":"IF($Y14>0,CHOOSE(MATCH(RegimeExecucao,{\"Unitário\",\"Global\"},0),IF($A14=\"S\",$Y14/$X14,\"\"),($Y14/$X14)*100),0)","v":0},{"$f":"IF($Y14>0,CHOOSE(MATCH(RegimeExecucao,{\"Unitário\",\"Global\"},0),IF($A14=\"S\",ROUND($H14,ORÇAMENTO!$AF$10),\"\"),ROUND($I14,ORÇAMENTO!$AF$11)),\"\")","v":""},{"$f":"AO14-O14","v":0},null,null,null,null,null,null,null,null,null,null,null,null,null,null,null,{"$f":"IF($A14=\"S\",IF(BM!$I14=0,0,CHOOSE(MATCH(RegimeExecucao,{\"Global\",\"Unitário\"},0),ROUND(ROUND(BM.MEDAcumulado,15-13*BM!$A$9)/100*BM!$I14,15-13*ORÇAMENTO!$AF$11),ROUND(ROUND(BM.MEDAcumulado,15-13*BM!$A$9)*ROUND(BM!$H14,15-13*ORÇAMENTO!$AF$10),15-13*ORÇAMENTO!$AF$11))),IF($A14=0,0,ROUND(SomaAgrupBM,15-13*ORÇAMENTO!$AF$11)))","v":0}]
[null,null,"F",{"$f":"\"Objeto do CTEF: \"&Import.DescLote","v":"Objeto do CTEF: "},null,null,null,"TOTAL:",{"$f":"IF(OR(_xlfn.SINGLE(ACOMPANHAMENTO)=\"PLE\",_xlfn.SINGLE(TIPOORCAMENTO)=\"Proposto\"),0,ORÇAMENTO!$X$15)","v":0},{"$f":"IF(M$15=0,0,IF(RegimeExecucao=\"Global\",M$15/$I$15*100,0))","v":0},{"$f":"L15-J15","v":0},{"$f":"IF(O$15=0,0,IF(RegimeExecucao=\"Global\",O$15/$I$15*100,0))","v":0},{"$f":"IF(OR(_xlfn.SINGLE(ACOMPANHAMENTO)=\"PLE\",_xlfn.SINGLE(TIPOORCAMENTO)=\"Proposto\"),0,SUMIF(OFFSET($A15,1,0):$A$27,\"S\",OFFSET(M15,1,0):M$27))","v":0},{"$f":"O15-M15","v":0},{"$f":"IF(OR(_xlfn.SINGLE(ACOMPANHAMENTO)=\"PLE\",_xlfn.SINGLE(TIPOORCAMENTO)=\"Proposto\"),0,SUMIF(OFFSET($A15,1,0):$A$27,\"S\",OFFSET(O15,1,0):O$27))","v":0},null,null,null,null,null,null,null,null,null,null,null,null,{"$f":"\"Preencher abaixo com a \"&CHOOSE(MATCH(RegimeExecucao,{\"Unitário\",\"Global\"},0),\"QUANTIDADE\",\"PORCENTAGEM\")&\" executada no PERÍODO\"","v":"Preencher abaixo com a QUANTIDADE executada no PERÍODO"}]
[{"$f":"ORÇAMENTO!C16","v":1},{"$f":"ORÇAMENTO!D16","v":11},{"$f":"IF(OR($I16>0,$A16=1,$A16=2,$A16=3,$A16=4),\"F\",\"\")","v":"F"},{"$f":"ORÇAMENTO!O16","v":"1."},{"$f":"ORÇAMENTO.Descricao","v":"COBERTURA RUA PEDRO DASSOLER "},{"$f":"IF(RegimeExecucao=\"Global\",\"\",ORÇAMENTO.Unidade)","v":"-"},{"$f":"IF(RegimeExecucao=\"Global\",\"\",ORÇAMENTO!T16)","v":0},{"$f":"IF(RegimeExecucao=\"Global\",\"\",ORÇAMENTO!W16)","v":0},{"$f":"ORÇAMENTO!X16","v":134660.96},{"$f":"_xlfn.SINGLE(IF($A16=\"S\",IF(CAIXA.Modo,BM.AFAnterior,BM.MEDAnterior),IF(AND(_xlfn.SINGLE(RegimeExecucao)=\"Global\",$I16>0,COUNTIF($AB$13:$AM$13,BM.medicao-1)>0),M16/$I16*100,0)))","v":0},{"$f":"L16-J16","v":0},{"$f":"_xlfn.SINGLE(IF($A16=\"S\",IF(CAIXA.Modo,BM.AFAcumulado,BM.MEDAcumulado),IF(AND(_xlfn.SINGLE(RegimeExecucao)=\"Global\",$I16>0,COUNTIF($AB$13:$AM$13,BM.medicao)>0),O16/$I16*100,0)))","v":0},{"$f":"IF($A16=\"S\",VTOTALBM,IF($A16=0,0,ROUND(SomaAgrupBM,15-13*ORÇAMENTO!$AF$11)))","v":0},{"$f":"O16-M16","v":0},{"$f":"IF($A16=\"S\",VTOTALBM,IF($A16=0,0,ROUND(SomaAgrupBM,15-13*ORÇAMENTO!$AF$11)))","v":0},null,null,null,null,{"$f":"IF($W16>0,$D16,\"\")","v":""},{"$f":"IF($W16>0,$E16,\"\")","v":""},{"$f":"IF(AND($W16>0,RegimeExecucao=\"Unitário\"),$F16,\"\")","v":""},{"$f":"IF($Y16>0,CHOOSE(MATCH(RegimeExecucao,{\"Unitário\",\"Global\"},0),IF($A16=\"S\",$Y16/$X16,\"\"),($Y16/$X16)*100),0)","v":0},{"$f":"IF($Y16>0,CHOOSE(MATCH(RegimeExecucao,{\"Unitário\",\"Global\"},0),IF($A16=\"S\",ROUND($H16,ORÇAMENTO!$AF$10),\"\"),ROUND($I16,ORÇAMENTO!$AF$11)),\"\")","v":""},{"$f":"AO16-O16","v":0},null,null,null,null,null,null,null,null,null,null,null,null,null,null,null,{"$f":"IF($A16=\"S\",IF(BM!$I16=0,0,CHOOSE(MATCH(RegimeExecucao,{\"Global\",\"Unitário\"},0),ROUND(ROUND(BM.MEDAcumulado,15-13*BM!$A$9)/100*BM!$I16,15-13*ORÇAMENTO!$AF$11),ROUND(ROUND(BM.MEDAcumulado,15-13*BM!$A$9)*ROUND(BM!$H16,15-13*ORÇAMENTO!$AF$10),15-13*ORÇAMENTO!$AF$11))),IF($A16=0,0,ROUND(SomaAgrupBM,15-13*ORÇAMENTO!$AF$11)))","v":0}]
[{"$f":"ORÇAMENTO!C17","v":2},{"$f":"ORÇAMENTO!D17","v":2},"F",{"$f":"ORÇAMENTO!O17","v":"1.1."},"PILARES PRÉ MOLDADO 20X25 CM",{"$f":"IF(RegimeExecucao=\"Global\",\"\",ORÇAMENTO.Unidade)","v":"-"},{"$f":"IF(RegimeExecucao=\"Global\",\"\",ORÇAMENTO!T17)","v":0},{"$f":"IF(RegimeExecucao=\"Global\",\"\",ORÇAMENTO!W17)","v":0},{"$f":"ORÇAMENTO!X17","v":14441.56},{"$f":"_xlfn.SINGLE(IF($A17=\"S\",IF(CAIXA.Modo,BM.AFAnterior,BM.MEDAnterior),IF(AND(_xlfn.SINGLE(RegimeExecucao)=\"Global\",$I17>0,COUNTIF($AB$13:$AM$13,BM.medicao-1)>0),M17/$I17*100,0)))","v":0},0,{"$f":"_xlfn.SINGLE(IF($A17=\"S\",IF(CAIXA.Modo,BM.AFAcumulado,BM.MEDAcumulado),IF(AND(_xlfn.SINGLE(RegimeExecucao)=\"Global\",$I17>0,COUNTIF($AB$13:$AM$13,BM.medicao)>0),O17/$I17*100,0)))","v":0},{"$f":"IF($A17=\"S\",VTOTALBM,IF($A17=0,0,ROUND(SomaAgrupBM,15-13*ORÇAMENTO!$AF$11)))","v":0},0,{"$f":"IF($A17=\"S\",VTOTALBM,IF($A17=0,0,ROUND(SomaAgrupBM,15-13*ORÇAMENTO!$AF$11)))","v":0},null,null,null,null,"","",{"$f":"IF(AND($W17>0,RegimeExecucao=\"Unitário\"),$F17,\"\")","v":""},{"$f":"IF($Y17>0,CHOOSE(MATCH(RegimeExecucao,{\"Unitário\",\"Global\"},0),IF($A17=\"S\",$Y17/$X17,\"\"),($Y17/$X17)*100),0)","v":0},{"$f":"IF($Y17>0,CHOOSE(MATCH(RegimeExecucao,{\"Unitário\",\"Global\"},0),IF($A17=\"S\",ROUND($H17,ORÇAMENTO!$AF$10),\"\"),ROUND($I17,ORÇAMENTO!$AF$11)),\"\")","v":""},0,null,null,null,null,null,null,null,null,null,null,null,null,null,null,null,{"$f":"IF($A17=\"S\",IF(BM!$I17=0,0,CHOOSE(MATCH(RegimeExecucao,{\"Global\",\"Unitário\"},0),ROUND(ROUND(BM.MEDAcumulado,15-13*BM!$A$9)/100*BM!$I17,15-13*ORÇAMENTO!$AF$11),ROUND(ROUND(BM.MEDAcumulado,15-13*BM!$A$9)*ROUND(BM!$H17,15-13*ORÇAMENTO!$AF$10),15-13*ORÇAMENTO!$AF$11))),IF($A17=0,0,ROUND(SomaAgrupBM,15-13*ORÇAMENTO!$AF$11)))","v":0}]
[{"$f":"ORÇAMENTO!C18","v":"S"},{"$f":"ORÇAMENTO!D18","v":0},"F",{"$f":"ORÇAMENTO!O18","v":"1.1.1."},"PILAR EM CONCRETO PRÉ-MOLDADO 20X25 CM ARMADURA LONGITUDINAL 12,5MM ARMADURA TRANSVERSAL 5,0MM - PÉ DIREITO 4 METROS",{"$f":"IF(RegimeExecucao=\"Global\",\"\",ORÇAMENTO.Unidade)","v":"UN"},{"$f":"IF(RegimeExecucao=\"Global\",\"\",ORÇAMENTO!T18)","v":14},{"$f":"IF(RegimeExecucao=\"Global\",\"\",ORÇAMENTO!W18)","v":1031.54},{"$f":"ORÇAMENTO!X18","v":14441.56},{"$f":"_xlfn.SINGLE(IF($A18=\"S\",IF(CAIXA.Modo,BM.AFAnterior,BM.MEDAnterior),IF(AND(_xlfn.SINGLE(RegimeExecucao)=\"Global\",$I18>0,COUNTIF($AB$13:$AM$13,BM.medicao-1)>0),M18/$I18*100,0)))","v":0},0,{"$f":"_xlfn.SINGLE(IF($A18=\"S\",IF(CAIXA.Modo,BM.AFAcumulado,BM.MEDAcumulado),IF(AND(_xlfn.SINGLE(RegimeExecucao)=\"Global\",$I18>0,COUNTIF($AB$13:$AM$13,BM.medicao)>0),O18/$I18*100,0)))","v":0},{"$f":"IF($A18=\"S\",VTOTALBM,IF($A18=0,0,ROUND(SomaAgrupBM,15-13*ORÇAMENTO!$AF$11)))","v":0},0,{"$f":"IF($A18=\"S\",VTOTALBM,IF($A18=0,0,ROUND(SomaAgrupBM,15-13*ORÇAMENTO!$AF$11)))","v":0},null,null,null,null,"","",{"$f":"IF(AND($W18>0,RegimeExecucao=\"Unitário\"),$F18,\"\")","v":""},{"$f":"IF($Y18>0,CHOOSE(MATCH(RegimeExecucao,{\"Unitário\",\"Global\"},0),IF($A18=\"S\",$Y18/$X18,\"\"),($Y18/$X18)*100),0)","v":0},{"$f":"IF($Y18>0,CHOOSE(MATCH(RegimeExecucao,{\"Unitário\",\"Global\"},0),IF($A18=\"S\",ROUND($H18,ORÇAMENTO!$AF$10),\"\"),ROUND($I18,ORÇAMENTO!$AF$11)),\"\")","v":""},0,null,null,null,null,null,null,null,null,null,null,null,null,null,null,null,{"$f":"IF($A18=\"S\",IF(BM!$I18=0,0,CHOOSE(MATCH(RegimeExecucao,{\"Global\",\"Unitário\"},0),ROUND(ROUND(BM.MEDAcumulado,15-13*BM!$A$9)/100*BM!$I18,15-13*ORÇAMENTO!$AF$11),ROUND(ROUND(BM.MEDAcumulado,15-13*BM!$A$9)*ROUND(BM!$H18,15-13*ORÇAMENTO!$AF$10),15-13*ORÇAMENTO!$AF$11))),IF($A18=0,0,ROUND(SomaAgrupBM,15-13*ORÇAMENTO!$AF$11)))","v":0}]
[{"$f":"ORÇAMENTO!C19","v":2},{"$f":"ORÇAMENTO!D19","v":8},"F",{"$f":"ORÇAMENTO!O19","v":"1.2."},"ESTRUTURA E COBERTURA ",{"$f":"IF(RegimeExecucao=\"Global\",\"\",ORÇAMENTO.Unidade)","v":"-"},{"$f":"IF(RegimeExecucao=\"Global\",\"\",ORÇAMENTO!T19)","v":0},{"$f":"IF(RegimeExecucao=\"Global\",\"\",ORÇAMENTO!W19)","v":0},{"$f":"ORÇAMENTO!X19","v":120219.4},{"$f":"_xlfn.SINGLE(IF($A19=\"S\",IF(CAIXA.Modo,BM.AFAnterior,BM.MEDAnterior),IF(AND(_xlfn.SINGLE(RegimeExecucao)=\"Global\",$I19>0,COUNTIF($AB$13:$AM$13,BM.medicao-1)>0),M19/$I19*100,0)))","v":0},0,{"$f":"_xlfn.SINGLE(IF($A19=\"S\",IF(CAIXA.Modo,BM.AFAcumulado,BM.MEDAcumulado),IF(AND(_xlfn.SINGLE(RegimeExecucao)=\"Global\",$I19>0,COUNTIF($AB$13:$AM$13,BM.medicao)>0),O19/$I19*100,0)))","v":0},{"$f":"IF($A19=\"S\",VTOTALBM,IF($A19=0,0,ROUND(SomaAgrupBM,15-13*ORÇAMENTO!$AF$11)))","v":0},0,{"$f":"IF($A19=\"S\",VTOTALBM,IF($A19=0,0,ROUND(SomaAgrupBM,15-13*ORÇAMENTO!$AF$11)))","v":0},null,null,null,null,"","",{"$f":"IF(AND($W19>0,RegimeExecucao=\"Unitário\"),$F19,\"\")","v":""},{"$f":"IF($Y19>0,CHOOSE(MATCH(RegimeExecucao,{\"Unitário\",\"Global\"},0),IF($A19=\"S\",$Y19/$X19,\"\"),($Y19/$X19)*100),0)","v":0},{"$f":"IF($Y19>0,CHOOSE(MATCH(RegimeExecucao,{\"Unitário\",\"Global\"},0),IF($A19=\"S\",ROUND($H19,ORÇAMENTO!$AF$10),\"\"),ROUND($I19,ORÇAMENTO!$AF$11)),\"\")","v":""},0,null,null,null,null,null,null,null,null,null,null,null,null,null,null,null,{"$f":"IF($A19=\"S\",IF(BM!$I19=0,0,CHOOSE(MATCH(RegimeExecucao,{\"Global\",\"Unitário\"},0),ROUND(ROUND(BM.MEDAcumulado,15-13*BM!$A$9)/100*BM!$I19,15-13*ORÇAMENTO!$AF$11),ROUND(ROUND(BM.MEDAcumulado,15-13*BM!$A$9)*ROUND(BM!$H19,15-13*ORÇAMENTO!$AF$10),15-13*ORÇAMENTO!$AF$11))),IF($A19=0,0,ROUND(SomaAgrupBM,15-13*ORÇAMENTO!$AF$11)))","v":0}]
[{"$f":"ORÇAMENTO!C20","v":"S"},{"$f":"ORÇAMENTO!D20","v":0},"F",{"$f":"ORÇAMENTO!O20","v":"1.2.1."},"(abra o arquivo 'Referência 02-2026.xlsm)",{"$f":"IF(RegimeExecucao=\"Global\",\"\",ORÇAMENTO.Unidade)","v":"M"},{"$f":"IF(RegimeExecucao=\"Global\",\"\",ORÇAMENTO!T20)","v":68},{"$f":"IF(RegimeExecucao=\"Global\",\"\",ORÇAMENTO!W20)","v":154.24},{"$f":"ORÇAMENTO!X20","v":10488.32},{"$f":"_xlfn.SINGLE(IF($A20=\"S\",IF(CAIXA.Modo,BM.AFAnterior,BM.MEDAnterior),IF(AND(_xlfn.SINGLE(RegimeExecucao)=\"Global\",$I20>0,COUNTIF($AB$13:$AM$13,BM.medicao-1)>0),M20/$I20*100,0)))","v":0},0,{"$f":"_xlfn.SINGLE(IF($A20=\"S\",IF(CAIXA.Modo,BM.AFAcumulado,BM.MEDAcumulado),IF(AND(_xlfn.SINGLE(RegimeExecucao)=\"Global\",$I20>0,COUNTIF($AB$13:$AM$13,BM.medicao)>0),O20/$I20*100,0)))","v":0},{"$f":"IF($A20=\"S\",VTOTALBM,IF($A20=0,0,ROUND(SomaAgrupBM,15-13*ORÇAMENTO!$AF$11)))","v":0},0,{"$f":"IF($A20=\"S\",VTOTALBM,IF($A20=0,0,ROUND(SomaAgrupBM,15-13*ORÇAMENTO!$AF$11)))","v":0},null,null,null,null,"","",{"$f":"IF(AND($W20>0,RegimeExecucao=\"Unitário\"),$F20,\"\")","v":""},{"$f":"IF($Y20>0,CHOOSE(MATCH(RegimeExecucao,{\"Unitário\",\"Global\"},0),IF($A20=\"S\",$Y20/$X20,\"\"),($Y20/$X20)*100),0)","v":0},{"$f":"IF($Y20>0,CHOOSE(MATCH(RegimeExecucao,{\"Unitário\",\"Global\"},0),IF($A20=\"S\",ROUND($H20,ORÇAMENTO!$AF$10),\"\"),ROUND($I20,ORÇAMENTO!$AF$11)),\"\")","v":""},0,null,null,null,null,null,null,null,null,null,null,null,null,null,null,null,{"$f":"IF($A20=\"S\",IF(BM!$I20=0,0,CHOOSE(MATCH(RegimeExecucao,{\"Global\",\"Unitário\"},0),ROUND(ROUND(BM.MEDAcumulado,15-13*BM!$A$9)/100*BM!$I20,15-13*ORÇAMENTO!$AF$11),ROUND(ROUND(BM.MEDAcumulado,15-13*BM!$A$9)*ROUND(BM!$H20,15-13*ORÇAMENTO!$AF$10),15-13*ORÇAMENTO!$AF$11))),IF($A20=0,0,ROUND(SomaAgrupBM,15-13*ORÇAMENTO!$AF$11)))","v":0}]
[{"$f":"ORÇAMENTO!C21","v":"S"},{"$f":"ORÇAMENTO!D21","v":0},"F",{"$f":"ORÇAMENTO!O21","v":"1.2.2."},"(abra o arquivo 'Referência 02-2026.xlsm)",{"$f":"IF(RegimeExecucao=\"Global\",\"\",ORÇAMENTO.Unidade)","v":"UN"},{"$f":"IF(RegimeExecucao=\"Global\",\"\",ORÇAMENTO!T21)","v":8},{"$f":"IF(RegimeExecucao=\"Global\",\"\",ORÇAMENTO!W21)","v":2282.7199999999998},{"$f":"ORÇAMENTO!X21","v":18261.759999999998},{"$f":"_xlfn.SINGLE(IF($A21=\"S\",IF(CAIXA.Modo,BM.AFAnterior,BM.MEDAnterior),IF(AND(_xlfn.SINGLE(RegimeExecucao)=\"Global\",$I21>0,COUNTIF($AB$13:$AM$13,BM.medicao-1)>0),M21/$I21*100,0)))","v":0},0,{"$f":"_xlfn.SINGLE(IF($A21=\"S\",IF(CAIXA.Modo,BM.AFAcumulado,BM.MEDAcumulado),IF(AND(_xlfn.SINGLE(RegimeExecucao)=\"Global\",$I21>0,COUNTIF($AB$13:$AM$13,BM.medicao)>0),O21/$I21*100,0)))","v":0},{"$f":"IF($A21=\"S\",VTOTALBM,IF($A21=0,0,ROUND(SomaAgrupBM,15-13*ORÇAMENTO!$AF$11)))","v":0},0,{"$f":"IF($A21=\"S\",VTOTALBM,IF($A21=0,0,ROUND(SomaAgrupBM,15-13*ORÇAMENTO!$AF$11)))","v":0},null,null,null,null,"","",{"$f":"IF(AND($W21>0,RegimeExecucao=\"Unitário\"),$F21,\"\")","v":""},{"$f":"IF($Y21>0,CHOOSE(MATCH(RegimeExecucao,{\"Unitário\",\"Global\"},0),IF($A21=\"S\",$Y21/$X21,\"\"),($Y21/$X21)*100),0)","v":0},{"$f":"IF($Y21>0,CHOOSE(MATCH(RegimeExecucao,{\"Unitário\",\"Global\"},0),IF($A21=\"S\",ROUND($H21,ORÇAMENTO!$AF$10),\"\"),ROUND($I21,ORÇAMENTO!$AF$11)),\"\")","v":""},0,null,null,null,null,null,null,null,null,null,null,null,null,null,null,null,{"$f":"IF($A21=\"S\",IF(BM!$I21=0,0,CHOOSE(MATCH(RegimeExecucao,{\"Global\",\"Unitário\"},0),ROUND(ROUND(BM.MEDAcumulado,15-13*BM!$A$9)/100*BM!$I21,15-13*ORÇAMENTO!$AF$11),ROUND(ROUND(BM.MEDAcumulado,15-13*BM!$A$9)*ROUND(BM!$H21,15-13*ORÇAMENTO!$AF$10),15-13*ORÇAMENTO!$AF$11))),IF($A21=0,0,ROUND(SomaAgrupBM,15-13*ORÇAMENTO!$AF$11)))","v":0}]
[{"$f":"ORÇAMENTO!C22","v":"S"},{"$f":"ORÇAMENTO!D22","v":0},"F",{"$f":"ORÇAMENTO!O22","v":"1.2.3."},"(abra o arquivo 'Referência 02-2026.xlsm)",{"$f":"IF(RegimeExecucao=\"Global\",\"\",ORÇAMENTO.Unidade)","v":"M"},{"$f":"IF(RegimeExecucao=\"Global\",\"\",ORÇAMENTO!T22)","v":578},{"$f":"IF(RegimeExecucao=\"Global\",\"\",ORÇAMENTO!W22)","v":28.38},{"$f":"ORÇAMENTO!X22","v":16403.64},{"$f":"_xlfn.SINGLE(IF($A22=\"S\",IF(CAIXA.Modo,BM.AFAnterior,BM.MEDAnterior),IF(AND(_xlfn.SINGLE(RegimeExecucao)=\"Global\",$I22>0,COUNTIF($AB$13:$AM$13,BM.medicao-1)>0),M22/$I22*100,0)))","v":0},0,{"$f":"_xlfn.SINGLE(IF($A22=\"S\",IF(CAIXA.Modo,BM.AFAcumulado,BM.MEDAcumulado),IF(AND(_xlfn.SINGLE(RegimeExecucao)=\"Global\",$I22>0,COUNTIF($AB$13:$AM$13,BM.medicao)>0),O22/$I22*100,0)))","v":0},{"$f":"IF($A22=\"S\",VTOTALBM,IF($A22=0,0,ROUND(SomaAgrupBM,15-13*ORÇAMENTO!$AF$11)))","v":0},0,{"$f":"IF($A22=\"S\",VTOTALBM,IF($A22=0,0,ROUND(SomaAgrupBM,15-13*ORÇAMENTO!$AF$11)))","v":0},null,null,null,null,"","",{"$f":"IF(AND($W22>0,RegimeExecucao=\"Unitário\"),$F22,\"\")","v":""},{"$f":"IF($Y22>0,CHOOSE(MATCH(RegimeExecucao,{\"Unitário\",\"Global\"},0),IF($A22=\"S\",$Y22/$X22,\"\"),($Y22/$X22)*100),0)","v":0},{"$f":"IF($Y22>0,CHOOSE(MATCH(RegimeExecucao,{\"Unitário\",\"Global\"},0),IF($A22=\"S\",ROUND($H22,ORÇAMENTO!$AF$10),\"\"),ROUND($I22,ORÇAMENTO!$AF$11)),\"\")","v":""},0,null,null,null,null,null,null,null,null,null,null,null,null,null,null,null,{"$f":"IF($A22=\"S\",IF(BM!$I22=0,0,CHOOSE(MATCH(RegimeExecucao,{\"Global\",\"Unitário\"},0),ROUND(ROUND(BM.MEDAcumulado,15-13*BM!$A$9)/100*BM!$I22,15-13*ORÇAMENTO!$AF$11),ROUND(ROUND(BM.MEDAcumulado,15-13*BM!$A$9)*ROUND(BM!$H22,15-13*ORÇAMENTO!$AF$10),15-13*ORÇAMENTO!$AF$11))),IF($A22=0,0,ROUND(SomaAgrupBM,15-13*ORÇAMENTO!$AF$11)))","v":0}]
[{"$f":"ORÇAMENTO!C23","v":"S"},{"$f":"ORÇAMENTO!D23","v":0},"F",{"$f":"ORÇAMENTO!O23","v":"1.2.4."},"(abra o arquivo 'Referência 02-2026.xlsm)",{"$f":"IF(RegimeExecucao=\"Global\",\"\",ORÇAMENTO.Unidade)","v":"M2"},{"$f":"IF(RegimeExecucao=\"Global\",\"\",ORÇAMENTO!T23)","v":656},{"$f":"IF(RegimeExecucao=\"Global\",\"\",ORÇAMENTO!W23)","v":72.790000000000006},{"$f":"ORÇAMENTO!X23","v":47750.239999999998},{"$f":"_xlfn.SINGLE(IF($A23=\"S\",IF(CAIXA.Modo,BM.AFAnterior,BM.MEDAnterior),IF(AND(_xlfn.SINGLE(RegimeExecucao)=\"Global\",$I23>0,COUNTIF($AB$13:$AM$13,BM.medicao-1)>0),M23/$I23*100,0)))","v":0},0,{"$f":"_xlfn.SINGLE(IF($A23=\"S\",IF(CAIXA.Modo,BM.AFAcumulado,BM.MEDAcumulado),IF(AND(_xlfn.SINGLE(RegimeExecucao)=\"Global\",$I23>0,COUNTIF($AB$13:$AM$13,BM.medicao)>0),O23/$I23*100,0)))","v":0},{"$f":"IF($A23=\"S\",VTOTALBM,IF($A23=0,0,ROUND(SomaAgrupBM,15-13*ORÇAMENTO!$AF$11)))","v":0},0,{"$f":"IF($A23=\"S\",VTOTALBM,IF($A23=0,0,ROUND(SomaAgrupBM,15-13*ORÇAMENTO!$AF$11)))","v":0},null,null,null,null,"","",{"$f":"IF(AND($W23>0,RegimeExecucao=\"Unitário\"),$F23,\"\")","v":""},{"$f":"IF($Y23>0,CHOOSE(MATCH(RegimeExecucao,{\"Unitário\",\"Global\"},0),IF($A23=\"S\",$Y23/$X23,\"\"),($Y23/$X23)*100),0)","v":0},{"$f":"IF($Y23>0,CHOOSE(MATCH(RegimeExecucao,{\"Unitário\",\"Global\"},0),IF($A23=\"S\",ROUND($H23,ORÇAMENTO!$AF$10),\"\"),ROUND($I23,ORÇAMENTO!$AF$11)),\"\")","v":""},0,null,null,null,null,null,null,null,null,null,null,null,null,null,null,null,{"$f":"IF($A23=\"S\",IF(BM!$I23=0,0,CHOOSE(MATCH(RegimeExecucao,{\"Global\",\"Unitário\"},0),ROUND(ROUND(BM.MEDAcumulado,15-13*BM!$A$9)/100*BM!$I23,15-13*ORÇAMENTO!$AF$11),ROUND(ROUND(BM.MEDAcumulado,15-13*BM!$A$9)*ROUND(BM!$H23,15-13*ORÇAMENTO!$AF$10),15-13*ORÇAMENTO!$AF$11))),IF($A23=0,0,ROUND(SomaAgrupBM,15-13*ORÇAMENTO!$AF$11)))","v":0}]
[{"$f":"ORÇAMENTO!C24","v":"S"},{"$f":"ORÇAMENTO!D24","v":0},{"$f":"IF(OR($I24>0,$A24=1,$A24=2,$A24=3,$A24=4),\"F\",\"\")","v":"F"},{"$f":"ORÇAMENTO!O24","v":"1.2.5."},{"$f":"ORÇAMENTO.Descricao","v":"(abra o arquivo 'Referência 02-2026.xlsm)"},{"$f":"IF(RegimeExecucao=\"Global\",\"\",ORÇAMENTO.Unidade)","v":"-"},{"$f":"IF(RegimeExecucao=\"Global\",\"\",ORÇAMENTO!T24)","v":70},{"$f":"IF(RegimeExecucao=\"Global\",\"\",ORÇAMENTO!W24)","v":92.78},{"$f":"ORÇAMENTO!X24","v":6494.6},{"$f":"_xlfn.SINGLE(IF($A24=\"S\",IF(CAIXA.Modo,BM.AFAnterior,BM.MEDAnterior),IF(AND(_xlfn.SINGLE(RegimeExecucao)=\"Global\",$I24>0,COUNTIF($AB$13:$AM$13,BM.medicao-1)>0),M24/$I24*100,0)))","v":0},{"$f":"L24-J24","v":0},{"$f":"_xlfn.SINGLE(IF($A24=\"S\",IF(CAIXA.Modo,BM.AFAcumulado,BM.MEDAcumulado),IF(AND(_xlfn.SINGLE(RegimeExecucao)=\"Global\",$I24>0,COUNTIF($AB$13:$AM$13,BM.medicao)>0),O24/$I24*100,0)))","v":0},{"$f":"IF($A24=\"S\",VTOTALBM,IF($A24=0,0,ROUND(SomaAgrupBM,15-13*ORÇAMENTO!$AF$11)))","v":0},{"$f":"O24-M24","v":0},{"$f":"IF($A24=\"S\",VTOTALBM,IF($A24=0,0,ROUND(SomaAgrupBM,15-13*ORÇAMENTO!$AF$11)))","v":0},null,null,null,null,{"$f":"IF($W24>0,$D24,\"\")","v":""},{"$f":"IF($W24>0,$E24,\"\")","v":""},{"$f":"IF(AND($W24>0,RegimeExecucao=\"Unitário\"),$F24,\"\")","v":""},{"$f":"IF($Y24>0,CHOOSE(MATCH(RegimeExecucao,{\"Unitário\",\"Global\"},0),IF($A24=\"S\",$Y24/$X24,\"\"),($Y24/$X24)*100),0)","v":0},{"$f":"IF($Y24>0,CHOOSE(MATCH(RegimeExecucao,{\"Unitário\",\"Global\"},0),IF($A24=\"S\",ROUND($H24,ORÇAMENTO!$AF$10),\"\"),ROUND($I24,ORÇAMENTO!$AF$11)),\"\")","v":""},{"$f":"AO24-O24","v":0},null,null,null,null,null,null,null,null,null,null,null,null,null,null,null,{"$f":"IF($A24=\"S\",IF(BM!$I24=0,0,CHOOSE(MATCH(RegimeExecucao,{\"Global\",\"Unitário\"},0),ROUND(ROUND(BM.MEDAcumulado,15-13*BM!$A$9)/100*BM!$I24,15-13*ORÇAMENTO!$AF$11),ROUND(ROUND(BM.MEDAcumulado,15-13*BM!$A$9)*ROUND(BM!$H24,15-13*ORÇAMENTO!$AF$10),15-13*ORÇAMENTO!$AF$11))),IF($A24=0,0,ROUND(SomaAgrupBM,15-13*ORÇAMENTO!$AF$11)))","v":0}]
[{"$f":"ORÇAMENTO!C25","v":"S"},{"$f":"ORÇAMENTO!D25","v":0},{"$f":"IF(OR($I25>0,$A25=1,$A25=2,$A25=3,$A25=4),\"F\",\"\")","v":"F"},{"$f":"ORÇAMENTO!O25","v":"1.2.6."},{"$f":"ORÇAMENTO.Descricao","v":"(abra o arquivo 'Referência 02-2026.xlsm)"},{"$f":"IF(RegimeExecucao=\"Global\",\"\",ORÇAMENTO.Unidade)","v":"-"},{"$f":"IF(RegimeExecucao=\"Global\",\"\",ORÇAMENTO!T25)","v":48},{"$f":"IF(RegimeExecucao=\"Global\",\"\",ORÇAMENTO!W25)","v":40.43},{"$f":"ORÇAMENTO!X25","v":1940.64},{"$f":"_xlfn.SINGLE(IF($A25=\"S\",IF(CAIXA.Modo,BM.AFAnterior,BM.MEDAnterior),IF(AND(_xlfn.SINGLE(RegimeExecucao)=\"Global\",$I25>0,COUNTIF($AB$13:$AM$13,BM.medicao-1)>0),M25/$I25*100,0)))","v":0},{"$f":"L25-J25","v":0},{"$f":"_xlfn.SINGLE(IF($A25=\"S\",IF(CAIXA.Modo,BM.AFAcumulado,BM.MEDAcumulado),IF(AND(_xlfn.SINGLE(RegimeExecucao)=\"Global\",$I25>0,COUNTIF($AB$13:$AM$13,BM.medicao)>0),O25/$I25*100,0)))","v":0},{"$f":"IF($A25=\"S\",VTOTALBM,IF($A25=0,0,ROUND(SomaAgrupBM,15-13*ORÇAMENTO!$AF$11)))","v":0},{"$f":"O25-M25","v":0},{"$f":"IF($A25=\"S\",VTOTALBM,IF($A25=0,0,ROUND(SomaAgrupBM,15-13*ORÇAMENTO!$AF$11)))","v":0},null,null,null,null,{"$f":"IF($W25>0,$D25,\"\")","v":""},{"$f":"IF($W25>0,$E25,\"\")","v":""},{"$f":"IF(AND($W25>0,RegimeExecucao=\"Unitário\"),$F25,\"\")","v":""},{"$f":"IF($Y25>0,CHOOSE(MATCH(RegimeExecucao,{\"Unitário\",\"Global\"},0),IF($A25=\"S\",$Y25/$X25,\"\"),($Y25/$X25)*100),0)","v":0},{"$f":"IF($Y25>0,CHOOSE(MATCH(RegimeExecucao,{\"Unitário\",\"Global\"},0),IF($A25=\"S\",ROUND($H25,ORÇAMENTO!$AF$10),\"\"),ROUND($I25,ORÇAMENTO!$AF$11)),\"\")","v":""},{"$f":"AO25-O25","v":0},null,null,null,null,null,null,null,null,null,null,null,null,null,null,null,{"$f":"IF($A25=\"S\",IF(BM!$I25=0,0,CHOOSE(MATCH(RegimeExecucao,{\"Global\",\"Unitário\"},0),ROUND(ROUND(BM.MEDAcumulado,15-13*BM!$A$9)/100*BM!$I25,15-13*ORÇAMENTO!$AF$11),ROUND(ROUND(BM.MEDAcumulado,15-13*BM!$A$9)*ROUND(BM!$H25,15-13*ORÇAMENTO!$AF$10),15-13*ORÇAMENTO!$AF$11))),IF($A25=0,0,ROUND(SomaAgrupBM,15-13*ORÇAMENTO!$AF$11)))","v":0}]
[{"$f":"ORÇAMENTO!C26","v":"S"},{"$f":"ORÇAMENTO!D26","v":0},{"$f":"IF(OR($I26>0,$A26=1,$A26=2,$A26=3,$A26=4),\"F\",\"\")","v":"F"},{"$f":"ORÇAMENTO!O26","v":"1.2.7."},{"$f":"ORÇAMENTO.Descricao","v":"MÃO DE OBRA P/ MONTAGEM DA ESTRUTURA"},{"$f":"IF(RegimeExecucao=\"Global\",\"\",ORÇAMENTO.Unidade)","v":"M2"},{"$f":"IF(RegimeExecucao=\"Global\",\"\",ORÇAMENTO!T26)","v":612},{"$f":"IF(RegimeExecucao=\"Global\",\"\",ORÇAMENTO!W26)","v":30.85},{"$f":"ORÇAMENTO!X26","v":18880.2},{"$f":"_xlfn.SINGLE(IF($A26=\"S\",IF(CAIXA.Modo,BM.AFAnterior,BM.MEDAnterior),IF(AND(_xlfn.SINGLE(RegimeExecucao)=\"Global\",$I26>0,COUNTIF($AB$13:$AM$13,BM.medicao-1)>0),M26/$I26*100,0)))","v":0},{"$f":"L26-J26","v":0},{"$f":"_xlfn.SINGLE(IF($A26=\"S\",IF(CAIXA.Modo,BM.AFAcumulado,BM.MEDAcumulado),IF(AND(_xlfn.SINGLE(RegimeExecucao)=\"Global\",$I26>0,COUNTIF($AB$13:$AM$13,BM.medicao)>0),O26/$I26*100,0)))","v":0},{"$f":"IF($A26=\"S\",VTOTALBM,IF($A26=0,0,ROUND(SomaAgrupBM,15-13*ORÇAMENTO!$AF$11)))","v":0},{"$f":"O26-M26","v":0},{"$f":"IF($A26=\"S\",VTOTALBM,IF($A26=0,0,ROUND(SomaAgrupBM,15-13*ORÇAMENTO!$AF$11)))","v":0},null,null,null,null,{"$f":"IF($W26>0,$D26,\"\")","v":""},{"$f":"IF($W26>0,$E26,\"\")","v":""},{"$f":"IF(AND($W26>0,RegimeExecucao=\"Unitário\"),$F26,\"\")","v":""},{"$f":"IF($Y26>0,CHOOSE(MATCH(RegimeExecucao,{\"Unitário\",\"Global\"},0),IF($A26=\"S\",$Y26/$X26,\"\"),($Y26/$X26)*100),0)","v":0},{"$f":"IF($Y26>0,CHOOSE(MATCH(RegimeExecucao,{\"Unitário\",\"Global\"},0),IF($A26=\"S\",ROUND($H26,ORÇAMENTO!$AF$10),\"\"),ROUND($I26,ORÇAMENTO!$AF$11)),\"\")","v":""},{"$f":"AO26-O26","v":0},null,null,null,null,null,null,null,null,null,null,null,null,null,null,null,{"$f":"IF($A26=\"S\",IF(BM!$I26=0,0,CHOOSE(MATCH(RegimeExecucao,{\"Global\",\"Unitário\"},0),ROUND(ROUND(BM.MEDAcumulado,15-13*BM!$A$9)/100*BM!$I26,15-13*ORÇAMENTO!$AF$11),ROUND(ROUND(BM.MEDAcumulado,15-13*BM!$A$9)*ROUND(BM!$H26,15-13*ORÇAMENTO!$AF$10),15-13*ORÇAMENTO!$AF$11))),IF($A26=0,0,ROUND(SomaAgrupBM,15-13*ORÇAMENTO!$AF$11)))","v":0}]
[null,null,"F"]
[]
[null,null,null,"Observações:",null,null,null,null,null,null,null,null,null,null,null,null,null,null,null,"Observações"]
[]
[]
[]
[]
[null,null,null,{"$f":"IF(OR(AND(ORÇAMENTO!$AF$7=FALSE,ORÇAMENTO!$AF$10=FALSE,RegimeExecucao=\"Global\"),AND(ORÇAMENTO!$AF$7=FALSE,ORÇAMENTO!$AF$10=FALSE,ORÇAMENTO!$AF$11=FALSE,BM!$A$9=FALSE)),\"Não foi considerado arredondamento nos valores da planilha.\",CONCATENATE(\"Foi considerado arredondamento de duas casas decimais para \",IF(AND(RegimeExecucao=\"Unitário\",ORÇAMENTO!$AF$7=TRUE),\"Quantidade; \",\"\"),IF(AND(RegimeExecucao=\"Unitário\",ORÇAMENTO!$AF$10=TRUE),\"Preço unitário; \",\"\"),IF(ORÇAMENTO!$AF$11=TRUE,\"Preço total; \",\"\"),,IF(BM!$A$9=TRUE,\"Medição.\",\"\")))","v":"Foi considerado arredondamento de duas casas decimais para Quantidade; Preço unitário; Preço total; Medição."}]
[]
[null,null,null,{"$f":"IF(CAIXA.Modo,\"\",\"Os serviços medidos informados neste BM encontram-se concluídos, estão em conformidade com os projetos e especificações aceitos pela CAIXA e foram executados de acordo com as normas técnicas.\")","v":"Os serviços medidos informados neste BM encontram-se concluídos, estão em conformidade com os projetos e especificações aceitos pela CAIXA e foram executados de acordo com as normas técnicas."}]
[null,null,null,null,{"$f":"Import.Município","v":"SÃO VALENTIM/RS"},null,null,null,null,{"$f":"IF(DADOS!$D$50<>\"\",\"Preencher os Dados do Responsável pela Fiscalização, na aba DADOS.\",\"\")","v":""}]
[null,null,null,null,"Local",null,null,null,null,"Responsável Técnico pela Fiscalização",null,null,null,null,null,null,null,null,null,null,null,null,"Profissional CAIXA:"]
[null,null,null,null,null,null,null,null,null,"Nome:",{"$f":"Import.RespFiscalização","v":0},null,null,null,null,null,null,null,null,null,null,null,"Nome:"]
[null,null,null,null,{"$f":"DADOS!$C$48","v":"00:00:00"},null,null,null,null,"Profissão:",0,null,null,null,null,null,null,null,null,null,null,null,"Matrícula"]
[null,null,null,null,"Data",null,null,null,null,"CREA/CAU:",0,null,null,null,null,null,null,null,null,null,null,null,"CREA/CAU:"]
[null,null,null,null,null,null,null,null,null,"ART/RRT:",0]

{"sheet":"RRE","index":12,"n_rows":49,"n_cols":41,"rows_kept":49,"cut":false,"hidden":true,"merged":[[3,12,3,14],[48,12,48,14],[30,4,32,15],[34,11,34,14],[39,12,39,14],[40,12,40,14],[41,12,41,14],[46,12,46,14],[48,5,48,6],[34,4,34,6],[46,5,46,6],[47,5,47,6],[23,9,23,10],[23,15,27,15],[24,9,24,10],[25,9,25,10],[26,9,26,10],[27,9,27,10],[28,14,28,15],[47,12,47,14],[9,28,9,33],[9,35,9,40],[10,24,10,25],[10,28,10,30],[10,31,10,33],[10,35,10,37],[10,38,10,40],[6,3,10,3],[6,4,6,7],[6,8,6,11],[8,6,8,7],[8,8,8,9],[8,11,9,11],[9,6,9,7],[5,4,5,7],[5,8,5,11],[2,4,2,7],[2,8,2,10],[3,4,3,7],[3,8,3,10]]}
[null,null,null,null,null,{"$f":"CONCATENATE(\"RRE - RELATÓRIO RESUMO DO EMPREENDIMENTO - \",IF(CAIXA.Modo,\"CAIXA\",\"TOMADOR\"))","v":"RRE - RELATÓRIO RESUMO DO EMPREENDIMENTO - TOMADOR"},null,null,null,null,null,null,null,null,null,"Grau de Sigilo\n#PUBLICO",null,null,null,null,null,null,null,null,null,null,null,null,null,"Acum. Previsto","Acum. Chegada"]
[null,null,null,null,null,null,null,null,null,null,null,null,null,null,null,null,null,null,null,null,null,null,null,null,null,null,null,null,{"$f":"J25","v":"Repasse"},{"$f":"AD6-AD4-AD3","v":0},{"$f":"AE6-AE4-AE3","v":0}]
[null,null,null,null,"PROPONENTE / TOMADOR",null,null,null,"Nº OPERAÇÃO",null,null,"Nº TransfereGOV",null,null,null,"RECURSO",null,null,null,null,null,null,null,null,null,null,null,null,"CP",{"$f":"SUM(T13:OFFSET(T24,-1,0))","v":0},{"$f":"IF(OR($O$28<$M$28,$M$26>$AD$3),MIN($M$26,$L$26),MIN($AD$3,$N$28-$N$27+$M$26))","v":0}]
[null,null,null,null,{"$f":"Import.Proponente","v":"MUNICÍPIO DE SÃO VALENTIN"},null,null,null,{"$f":"Import.CR","v":0},null,null,{"$f":"Import.TransfereGOV","v":0},"VALORES CONTRATADOS (R$):",null,null,{"$f":"import.recurso","v":"OGU"},null,null,null,null,null,null,null,null,null,null,null,null,"Outros",{"$f":"SUM(U13:OFFSET(U24,-1,0))","v":0},{"$f":"IF(OR($O$28<$M$28,$M$27>$AD$4),MIN($M$27,$L$27),MIN($AD$4,$N$28+$M$27))","v":0}]
[]
[null,null,null,null,"APELIDO DO EMPREENDIMENTO",null,null,null,"MUNICÍPIO / UF",null,null,null,{"$f":"IF(import.recurso=\"FGTS\",\"FINANCIAMENTO\",\"REPASSE\")","v":"REPASSE"},"CONTRAPARTIDA","INVESTIMENTO","Nº RRE",null,null,null,null,null,null,null,null,null,null,null,null,"Investimento",{"$f":"$O$28","v":0},{"$f":"AD6","v":0}]
[null,null,null,"FILTRO",{"$f":"Import.Apelido","v":"COBERTURA RUA PEDRO DASSOLER"},null,null,null,{"$f":"Import.Município","v":"SÃO VALENTIM/RS"},null,null,null,{"$f":"Import.Repasse","v":0},{"$f":"Import.Contrapartida","v":0},{"$f":"M7+N7","v":0},{"$f":"IF(ACOMPANHAMENTO=\"PLE\",PLE.Medicao,BM.medicao)","v":1}]
[]
[null,null,null,null,null,null,"Situação do TC/CR:",null,"Percentual previsto em:",null,null,"Saldo a Reprogramar","Repasse (R$)","Contrapartida (R$)",null,null,null,null,null,null,null,"Lista CTEF"]
[null,null,null,null,null,null,{"$f":"IF(J10=\"-\",\"-\",IF($P$24<J10,\"Atrasada\",IF($P$24>J10,\"Adiantada\",\"Normal\")))","v":"Normal"},null,{"$f":"DATE(YEAR($L$35),MONTH($L$35),1)","v":"1900-01-01"},{"$f":"IF($I$10<DATE(YEAR(CRONO!$U$13),MONTH(CRONO!$U$13),1),0,IF($I$10>OFFSET(CRONO!$AG$13,0,-1),1,INDEX(CRONO!$T$29:$AH$29,MATCH(RRE!$I$10,CRONO!$T$13:$AG$13,0))))","v":0},null,null,{"$f":"QCI!L10","v":0},{"$f":"QCI!M10","v":-134660.96},null,null,null,null,null,null,null,null,null,null,null,null,null,null,"PLE",null,null,null,null,null,null,"BM"]
[null,null,null,null,null,null,null,null,null,null,null,null,{"$f":"IF(CAIXA.Modo,\"Valores Aferidos (R$)\",\"Valores Medidos (R$)\")","v":"Valores Medidos (R$)"},null,null,null,null,null,null,null,null,"Lista CTEFs",null,null,{"$f":"IF(CAIXA.Modo,\"Valores Aferidos (R$)\",\"Valores Medidos (R$)\")","v":"Valores Medidos (R$)"},null,null,null,"Acumulado Período Anterior",null,null,"Acumulado incluindo o Período",null,null,null,"Acumulado Período Anterior",null,null,"Acumulado incluindo o Período"]
[{"$f":"MATCH(E12,ORÇAMENTO!$E$15:$E$27,0)-1","v":{"$error":"#N/A"}},{"$f":"IF(ISERROR($A12),NA(),OFFSET(ORÇAMENTO!$D$15,$A12,0))","v":{"$error":"#N/A"}},{"$f":"QCI!B12","v":"Branco"},{"$f":"IF(L12>0,\"F\",\"\")","v":""},{"$f":"QCI!D12","v":-1},{"$f":"QCI!G12","v":""},{"$f":"QCI!H12","v":0},{"$f":"QCI!I12","v":0},{"$f":"QCI!J12","v":""},{"$f":"QCI!K12","v":""},{"$f":"_xlfn.SINGLE(IF($C12=\"Automático\",IF(_xlfn.SINGLE(ACOMPANHAMENTO)=\"BM\",BM.medicao,PLE.Medicao),IF(ISBLANK($X12),\"\",$X12)))","v":""},{"$f":"QCI!$O12","v":0},{"$f":"ROUND(IF(C12=\"Automático\",AE12+AL12,Y12),2)","v":0},{"$f":"O12-M12","v":0},{"$f":"ROUND(IF(C12=\"Automático\",AH12+AO12,Z12),2)","v":0},{"$f":"O12/(L12+10^-12)","v":0},null,{"$f":"ROUND(IF($C12=\"Automático\",AC12+AJ12,$Y12*IF(ISERROR(QCI!$AA12/QCI!$O12),0,QCI!$AA12/QCI!$O12)),2)","v":0},{"$f":"ROUND(IF($C12=\"Automático\",AD12+AK12,$Y12*IF(ISERROR(QCI!$AB12/QCI!$O12),0,QCI!$AB12/QCI!$O12)),2)","v":0},{"$f":"ROUND(IF($C12=\"Automático\",AF12+AM12,$Z12*IF(ISERROR(QCI!$AA12/QCI!$O12),0,QCI!$AA12/QCI!$O12)),2)","v":0},{"$f":"ROUND(IF($C12=\"Automático\",AG12+AN12,$Z12*IF(ISERROR(QCI!$AB12/QCI!$O12),0,QCI!$AB12/QCI!$O12)),2)","v":0},{"$f":"IF(AND($L12>0,$J12<>0,$J12<>\"\",COUNTIF($J12:$J$13,$J12)=1),OFFSET(V12,-1,0)+1,OFFSET(V12,-1,0))","v":"Lista CTEFs"},null,null,null,null,null,null,{"$f":"IF(_xlfn.SINGLE(ACOMPANHAMENTO)<>\"PLE\",0,SUMPRODUCT((OFFSET(CÁLCULO!$AX$15:$BH$15,$A12,0,$B12)<=(PLE.Medicao-1))*OFFSET(CÁLCULO!$AB$15:$AL$15,$A12,0,$B12)*OFFSET(ORÇAMENTO!$AA$15,$A12,0,$B12)/(OFFSET(ORÇAMENTO!$X$15,$A12,0,$B12)+10^-12))+IF(AUTOEVENTO=\"Manual\",SUMPRODUCT((OFFSET(CÁLCULO!$M$15,$A12,0,$B12)=1)*OFFSET(ORÇAMENTO!$AA$15,$A12,0,$B12)*(PLE!$AE$9-PLE!$Y$9)),0))","v":{"$error":"#N/A"}},{"$f":"IF(_xlfn.SINGLE(ACOMPANHAMENTO)<>\"PLE\",0,SUMPRODUCT((OFFSET(CÁLCULO!$AX$15:$BH$15,$A12,0,$B12)<=(PLE.Medicao-1))*OFFSET(CÁLCULO!$AB$15:$AL$15,$A12,0,$B12)*OFFSET(ORÇAMENTO!$AB$15,$A12,0,$B12)/(OFFSET(ORÇAMENTO!$X$15,$A12,0,$B12)+10^-12))+IF(AUTOEVENTO=\"Manual\",SUMPRODUCT((OFFSET(CÁLCULO!$M$15,$A12,0,$B12)=1)*OFFSET(ORÇAMENTO!$AB$15,$A12,0,$B12)*(PLE!$AE$9-PLE!$Y$9)),0))","v":{"$error":"#N/A"}},{"$f":"ROUND(\n            IF(ACOMPANHAMENTO<>\"PLE\",0,\n                      SUMIF(OFFSET(CÁLCULO!$AX$15:$BH$15,$A12,0,$B12),\"<=\"&(PLE.Medicao-1),OFFSET(CÁLCULO!$AB$15:$AL$15,$A12,0,$B12))\n                      +IF(AdmLocal=\"Automática\",\n                              SUMIF(OFFSET(CÁLCULO!$M$15,$A12,0,$B12),1,OFFSET(ORÇAMENTO!$X$15,$A12,0,$B12))*(PLE!$AE$9-PLE!$Y$9),\n                              0)),\n            2)","v":{"$error":"#N/A"}},{"$f":"IF(_xlfn.SINGLE(ACOMPANHAMENTO)<>\"PLE\",0,SUMPRODUCT((OFFSET(CÁLCULO!$AX$15:$BH$15,$A12,0,$B12)<=PLE.Medicao)*OFFSET(CÁLCULO!$AB$15:$AL$15,$A12,0,$B12)*OFFSET(ORÇAMENTO!$AA$15,$A12,0,$B12)/(OFFSET(ORÇAMENTO!$X$15,$A12,0,$B12)+10^-12))+IF(AUTOEVENTO=\"Manual\",SUMPRODUCT((OFFSET(CÁLCULO!$M$15,$A12,0,$B12)=1)*OFFSET(ORÇAMENTO!$AA$15,$A12,0,$B12)*PLE!$AE$9),0))","v":{"$error":"#N/A"}},{"$f":"IF(_xlfn.SINGLE(ACOMPANHAMENTO)<>\"PLE\",0,SUMPRODUCT((OFFSET(CÁLCULO!$AX$15:$BH$15,$A12,0,$B12)<=PLE.Medicao)*OFFSET(CÁLCULO!$AB$15:$AL$15,$A12,0,$B12)*OFFSET(ORÇAMENTO!$AB$15,$A12,0,$B12)/(OFFSET(ORÇAMENTO!$X$15,$A12,0,$B12)+10^-12))+IF(AUTOEVENTO=\"Manual\",SUMPRODUCT((OFFSET(CÁLCULO!$M$15,$A12,0,$B12)=1)*OFFSET(ORÇAMENTO!$AB$15,$A12,0,$B12)*PLE!$AE$9),0))","v":{"$error":"#N/A"}},{"$f":"ROUND(IF(_xlfn.SINGLE(ACOMPANHAMENTO)<>\"PLE\",0,SUMIF(OFFSET(CÁLCULO!$AX$15:$BH$15,$A12,0,$B12),\"<=\"&PLE.Medicao,OFFSET(CÁLCULO!$AB$15:$AL$15,$A12,0,$B12))+IF(AdmLocal=\"Automática\",SUMIF(OFFSET(CÁLCULO!$M$15,$A12,0,$B12),1,OFFSET(ORÇAMENTO!$X$15,$A12,0,$B12))*PLE!$AE$9,0)),2)","v":{"$error":"#N/A"}},null,{"$f":"IF(_xlfn.SINGLE(ACOMPANHAMENTO)<>\"BM\",0,SUMPRODUCT(OFFSET(BM!$M$15,$A12,0,$B12)*(OFFSET(BM!$A$15,$A12,0,$B12)=\"S\")*OFFSET(ORÇAMENTO!AA$15,$A12,0,$B12)/(OFFSET(ORÇAMENTO!$X$15,$A12,0,$B12)+10^-12)))","v":0},{"$f":"IF(_xlfn.SINGLE(ACOMPANHAMENTO)<>\"BM\",0,SUMPRODUCT(OFFSET(BM!$M$15,$A12,0,$B12)*(OFFSET(BM!$A$15,$A12,0,$B12)=\"S\")*OFFSET(ORÇAMENTO!AB$15,$A12,0,$B12)/(OFFSET(ORÇAMENTO!$X$15,$A12,0,$B12)+10^-12)))","v":0},{"$f":"IF(_xlfn.SINGLE(ACOMPANHAMENTO)<>\"BM\",0,OFFSET(BM!$M$15,$A12,0))","v":0},{"$f":"IF(_xlfn.SINGLE(ACOMPANHAMENTO)<>\"BM\",0,SUMPRODUCT(OFFSET(BM!$O$15,$A12,0,$B12)*(OFFSET(BM!$A$15,$A12,0,$B12)=\"S\")*OFFSET(ORÇAMENTO!AA$15,$A12,0,$B12)/(OFFSET(ORÇAMENTO!$X$15,$A12,0,$B12)+10^-12)))","v":0},{"$f":"IF(_xlfn.SINGLE(ACOMPANHAMENTO)<>\"BM\",0,SUMPRODUCT(OFFSET(BM!$O$15,$A12,0,$B12)*(OFFSET(BM!$A$15,$A12,0,$B12)=\"S\")*OFFSET(ORÇAMENTO!AB$15,$A12,0,$B12)/(OFFSET(ORÇAMENTO!$X$15,$A12,0,$B12)+10^-12)))","v":0},{"$f":"IF(_xlfn.SINGLE(ACOMPANHAMENTO)<>\"BM\",0,OFFSET(BM!$O$15,$A12,0))","v":0}]
["Linha\nPO","Altura","Busca","↓","Meta","Descrição da Meta","Situação","Quantidade","Unid.","Lote de Licitação / nº do CTEF","BM / PLE nº","Valor Total (R$)","Acumulado Período Anterior","No Período","Acumulado incluindo o Período","Execução Física Acum.",null,"Acum. Período Anterior - CP","Acum. Período Anterior - Outros","Acum. Incluindo Período - CP","Acum. Incluindo Período - Outros",null,null,"BM / PLE nº","Acumulado Período Anterior","Acumulado incluindo o Período",null,null,"CP","Outros","Investimento","CP","Outros","Investimento",null,"CP","Outros","Investimento","CP","Outros","Investimento"]
[{"$f":"MATCH(E14,ORÇAMENTO!$E$15:$E$27,0)-1","v":1},{"$f":"IF(ISERROR($A14),NA(),OFFSET(ORÇAMENTO!$D$15,$A14,0))","v":11},{"$f":"QCI!B14","v":"Automático"},{"$f":"IF(L14>0,\"F\",\"\")","v":"F"},{"$f":"QCI!D14","v":1},{"$f":"QCI!G14","v":"COBERTURA RUA PEDRO DASSOLER "},{"$f":"QCI!H14","v":0},{"$f":"QCI!I14","v":0},{"$f":"QCI!J14","v":""},{"$f":"QCI!K14","v":"LOTE 1"},{"$f":"_xlfn.SINGLE(IF($C14=\"Automático\",IF(_xlfn.SINGLE(ACOMPANHAMENTO)=\"BM\",BM.medicao,PLE.Medicao),IF(ISBLANK($X14),\"\",$X14)))","v":1},{"$f":"QCI!$O14","v":134660.96},{"$f":"ROUND(IF(C14=\"Automático\",AE14+AL14,Y14),2)","v":0},{"$f":"O14-M14","v":0},{"$f":"ROUND(IF(C14=\"Automático\",AH14+AO14,Z14),2)","v":0},{"$f":"O14/(L14+10^-12)","v":0},null,{"$f":"ROUND(IF($C14=\"Automático\",AC14+AJ14,$Y14*IF(ISERROR(QCI!$AA14/QCI!$O14),0,QCI!$AA14/QCI!$O14)),2)","v":0},{"$f":"ROUND(IF($C14=\"Automático\",AD14+AK14,$Y14*IF(ISERROR(QCI!$AB14/QCI!$O14),0,QCI!$AB14/QCI!$O14)),2)","v":0},{"$f":"ROUND(IF($C14=\"Automático\",AF14+AM14,$Z14*IF(ISERROR(QCI!$AA14/QCI!$O14),0,QCI!$AA14/QCI!$O14)),2)","v":0},{"$f":"ROUND(IF($C14=\"Automático\",AG14+AN14,$Z14*IF(ISERROR(QCI!$AB14/QCI!$O14),0,QCI!$AB14/QCI!$O14)),2)","v":0},{"$f":"IF(AND($L14>0,$J14<>0,$J14<>\"\",COUNTIF($J$13:$J14,$J14)=1),OFFSET(V14,-1,0)+1,OFFSET(V14,-1,0))","v":1},null,null,null,null,null,null,{"$f":"IF(_xlfn.SINGLE(ACOMPANHAMENTO)<>\"PLE\",0,SUMPRODUCT((OFFSET(CÁLCULO!$AX$15:$BH$15,$A14,0,$B14)<=(PLE.Medicao-1))*OFFSET(CÁLCULO!$AB$15:$AL$15,$A14,0,$B14)*OFFSET(ORÇAMENTO!$AA$15,$A14,0,$B14)/(OFFSET(ORÇAMENTO!$X$15,$A14,0,$B14)+10^-12))+IF(AUTOEVENTO=\"Manual\",SUMPRODUCT((OFFSET(CÁLCULO!$M$15,$A14,0,$B14)=1)*OFFSET(ORÇAMENTO!$AA$15,$A14,0,$B14)*(PLE!$AE$9-PLE!$Y$9)),0))","v":0},{"$f":"IF(_xlfn.SINGLE(ACOMPANHAMENTO)<>\"PLE\",0,SUMPRODUCT((OFFSET(CÁLCULO!$AX$15:$BH$15,$A14,0,$B14)<=(PLE.Medicao-1))*OFFSET(CÁLCULO!$AB$15:$AL$15,$A14,0,$B14)*OFFSET(ORÇAMENTO!$AB$15,$A14,0,$B14)/(OFFSET(ORÇAMENTO!$X$15,$A14,0,$B14)+10^-12))+IF(AUTOEVENTO=\"Manual\",SUMPRODUCT((OFFSET(CÁLCULO!$M$15,$A14,0,$B14)=1)*OFFSET(ORÇAMENTO!$AB$15,$A14,0,$B14)*(PLE!$AE$9-PLE!$Y$9)),0))","v":0},{"$f":"ROUND(\n            IF(ACOMPANHAMENTO<>\"PLE\",0,\n                      SUMIF(OFFSET(CÁLCULO!$AX$15:$BH$15,$A14,0,$B14),\"<=\"&(PLE.Medicao-1),OFFSET(CÁLCULO!$AB$15:$AL$15,$A14,0,$B14))\n                      +IF(AdmLocal=\"Automática\",\n                              SUMIF(OFFSET(CÁLCULO!$M$15,$A14,0,$B14),1,OFFSET(ORÇAMENTO!$X$15,$A14,0,$B14))*(PLE!$AE$9-PLE!$Y$9),\n                              0)),\n            2)","v":0},{"$f":"IF(_xlfn.SINGLE(ACOMPANHAMENTO)<>\"PLE\",0,SUMPRODUCT((OFFSET(CÁLCULO!$AX$15:$BH$15,$A14,0,$B14)<=PLE.Medicao)*OFFSET(CÁLCULO!$AB$15:$AL$15,$A14,0,$B14)*OFFSET(ORÇAMENTO!$AA$15,$A14,0,$B14)/(OFFSET(ORÇAMENTO!$X$15,$A14,0,$B14)+10^-12))+IF(AUTOEVENTO=\"Manual\",SUMPRODUCT((OFFSET(CÁLCULO!$M$15,$A14,0,$B14)=1)*OFFSET(ORÇAMENTO!$AA$15,$A14,0,$B14)*PLE!$AE$9),0))","v":0},{"$f":"IF(_xlfn.SINGLE(ACOMPANHAMENTO)<>\"PLE\",0,SUMPRODUCT((OFFSET(CÁLCULO!$AX$15:$BH$15,$A14,0,$B14)<=PLE.Medicao)*OFFSET(CÁLCULO!$AB$15:$AL$15,$A14,0,$B14)*OFFSET(ORÇAMENTO!$AB$15,$A14,0,$B14)/(OFFSET(ORÇAMENTO!$X$15,$A14,0,$B14)+10^-12))+IF(AUTOEVENTO=\"Manual\",SUMPRODUCT((OFFSET(CÁLCULO!$M$15,$A14,0,$B14)=1)*OFFSET(ORÇAMENTO!$AB$15,$A14,0,$B14)*PLE!$AE$9),0))","v":0},{"$f":"ROUND(IF(_xlfn.SINGLE(ACOMPANHAMENTO)<>\"PLE\",0,SUMIF(OFFSET(CÁLCULO!$AX$15:$BH$15,$A14,0,$B14),\"<=\"&PLE.Medicao,OFFSET(CÁLCULO!$AB$15:$AL$15,$A14,0,$B14))+IF(AdmLocal=\"Automática\",SUMIF(OFFSET(CÁLCULO!$M$15,$A14,0,$B14),1,OFFSET(ORÇAMENTO!$X$15,$A14,0,$B14))*PLE!$AE$9,0)),2)","v":0},null,{"$f":"IF(_xlfn.SINGLE(ACOMPANHAMENTO)<>\"BM\",0,SUMPRODUCT(OFFSET(BM!$M$15,$A14,0,$B14)*(OFFSET(BM!$A$15,$A14,0,$B14)=\"S\")*OFFSET(ORÇAMENTO!AA$15,$A14,0,$B14)/(OFFSET(ORÇAMENTO!$X$15,$A14,0,$B14)+10^-12)))","v":0},{"$f":"IF(_xlfn.SINGLE(ACOMPANHAMENTO)<>\"BM\",0,SUMPRODUCT(OFFSET(BM!$M$15,$A14,0,$B14)*(OFFSET(BM!$A$15,$A14,0,$B14)=\"S\")*OFFSET(ORÇAMENTO!AB$15,$A14,0,$B14)/(OFFSET(ORÇAMENTO!$X$15,$A14,0,$B14)+10^-12)))","v":0},{"$f":"IF(_xlfn.SINGLE(ACOMPANHAMENTO)<>\"BM\",0,OFFSET(BM!$M$15,$A14,0))","v":0},{"$f":"IF(_xlfn.SINGLE(ACOMPANHAMENTO)<>\"BM\",0,SUMPRODUCT(OFFSET(BM!$O$15,$A14,0,$B14)*(OFFSET(BM!$A$15,$A14,0,$B14)=\"S\")*OFFSET(ORÇAMENTO!AA$15,$A14,0,$B14)/(OFFSET(ORÇAMENTO!$X$15,$A14,0,$B14)+10^-12)))","v":0},{"$f":"IF(_xlfn.SINGLE(ACOMPANHAMENTO)<>\"BM\",0,SUMPRODUCT(OFFSET(BM!$O$15,$A14,0,$B14)*(OFFSET(BM!$A$15,$A14,0,$B14)=\"S\")*OFFSET(ORÇAMENTO!AB$15,$A14,0,$B14)/(OFFSET(ORÇAMENTO!$X$15,$A14,0,$B14)+10^-12)))","v":0},{"$f":"IF(_xlfn.SINGLE(ACOMPANHAMENTO)<>\"BM\",0,OFFSET(BM!$O$15,$A14,0))","v":0}]
[{"$f":"MATCH(E15,ORÇAMENTO!$E$15:$E$27,0)-1","v":{"$error":"#N/A"}},{"$f":"IF(ISERROR($A15),NA(),OFFSET(ORÇAMENTO!$D$15,$A15,0))","v":{"$error":"#N/A"}},{"$f":"QCI!B15","v":"Branco"},"",{"$f":"QCI!D15","v":2},{"$f":"QCI!G15","v":""},{"$f":"QCI!H15","v":0},{"$f":"QCI!I15","v":0},{"$f":"QCI!J15","v":""},{"$f":"QCI!K15","v":""},{"$f":"_xlfn.SINGLE(IF($C15=\"Automático\",IF(_xlfn.SINGLE(ACOMPANHAMENTO)=\"BM\",BM.medicao,PLE.Medicao),IF(ISBLANK($X15),\"\",$X15)))","v":""},{"$f":"QCI!$O15","v":0},0,0,0,0,null,{"$f":"ROUND(IF($C15=\"Automático\",AC15+AJ15,$Y15*IF(ISERROR(QCI!$AA15/QCI!$O15),0,QCI!$AA15/QCI!$O15)),2)","v":0},{"$f":"ROUND(IF($C15=\"Automático\",AD15+AK15,$Y15*IF(ISERROR(QCI!$AB15/QCI!$O15),0,QCI!$AB15/QCI!$O15)),2)","v":0},{"$f":"ROUND(IF($C15=\"Automático\",AF15+AM15,$Z15*IF(ISERROR(QCI!$AA15/QCI!$O15),0,QCI!$AA15/QCI!$O15)),2)","v":0},{"$f":"ROUND(IF($C15=\"Automático\",AG15+AN15,$Z15*IF(ISERROR(QCI!$AB15/QCI!$O15),0,QCI!$AB15/QCI!$O15)),2)","v":0},{"$f":"IF(AND($L15>0,$J15<>0,$J15<>\"\",COUNTIF($J$13:$J15,$J15)=1),OFFSET(V15,-1,0)+1,OFFSET(V15,-1,0))","v":1},null,null,null,null,null,null,{"$f":"IF(_xlfn.SINGLE(ACOMPANHAMENTO)<>\"PLE\",0,SUMPRODUCT((OFFSET(CÁLCULO!$AX$15:$BH$15,$A15,0,$B15)<=(PLE.Medicao-1))*OFFSET(CÁLCULO!$AB$15:$AL$15,$A15,0,$B15)*OFFSET(ORÇAMENTO!$AA$15,$A15,0,$B15)/(OFFSET(ORÇAMENTO!$X$15,$A15,0,$B15)+10^-12))+IF(AUTOEVENTO=\"Manual\",SUMPRODUCT((OFFSET(CÁLCULO!$M$15,$A15,0,$B15)=1)*OFFSET(ORÇAMENTO!$AA$15,$A15,0,$B15)*(PLE!$AE$9-PLE!$Y$9)),0))","v":{"$error":"#N/A"}},{"$f":"IF(_xlfn.SINGLE(ACOMPANHAMENTO)<>\"PLE\",0,SUMPRODUCT((OFFSET(CÁLCULO!$AX$15:$BH$15,$A15,0,$B15)<=(PLE.Medicao-1))*OFFSET(CÁLCULO!$AB$15:$AL$15,$A15,0,$B15)*OFFSET(ORÇAMENTO!$AB$15,$A15,0,$B15)/(OFFSET(ORÇAMENTO!$X$15,$A15,0,$B15)+10^-12))+IF(AUTOEVENTO=\"Manual\",SUMPRODUCT((OFFSET(CÁLCULO!$M$15,$A15,0,$B15)=1)*OFFSET(ORÇAMENTO!$AB$15,$A15,0,$B15)*(PLE!$AE$9-PLE!$Y$9)),0))","v":{"$error":"#N/A"}},{"$f":"ROUND(\n            IF(ACOMPANHAMENTO<>\"PLE\",0,\n                      SUMIF(OFFSET(CÁLCULO!$AX$15:$BH$15,$A15,0,$B15),\"<=\"&(PLE.Medicao-1),OFFSET(CÁLCULO!$AB$15:$AL$15,$A15,0,$B15))\n                      +IF(AdmLocal=\"Automática\",\n                              SUMIF(OFFSET(CÁLCULO!$M$15,$A15,0,$B15),1,OFFSET(ORÇAMENTO!$X$15,$A15,0,$B15))*(PLE!$AE$9-PLE!$Y$9),\n                              0)),\n            2)","v":{"$error":"#N/A"}},{"$f":"IF(_xlfn.SINGLE(ACOMPANHAMENTO)<>\"PLE\",0,SUMPRODUCT((OFFSET(CÁLCULO!$AX$15:$BH$15,$A15,0,$B15)<=PLE.Medicao)*OFFSET(CÁLCULO!$AB$15:$AL$15,$A15,0,$B15)*OFFSET(ORÇAMENTO!$AA$15,$A15,0,$B15)/(OFFSET(ORÇAMENTO!$X$15,$A15,0,$B15)+10^-12))+IF(AUTOEVENTO=\"Manual\",SUMPRODUCT((OFFSET(CÁLCULO!$M$15,$A15,0,$B15)=1)*OFFSET(ORÇAMENTO!$AA$15,$A15,0,$B15)*PLE!$AE$9),0))","v":{"$error":"#N/A"}},{"$f":"IF(_xlfn.SINGLE(ACOMPANHAMENTO)<>\"PLE\",0,SUMPRODUCT((OFFSET(CÁLCULO!$AX$15:$BH$15,$A15,0,$B15)<=PLE.Medicao)*OFFSET(CÁLCULO!$AB$15:$AL$15,$A15,0,$B15)*OFFSET(ORÇAMENTO!$AB$15,$A15,0,$B15)/(OFFSET(ORÇAMENTO!$X$15,$A15,0,$B15)+10^-12))+IF(AUTOEVENTO=\"Manual\",SUMPRODUCT((OFFSET(CÁLCULO!$M$15,$A15,0,$B15)=1)*OFFSET(ORÇAMENTO!$AB$15,$A15,0,$B15)*PLE!$AE$9),0))","v":{"$error":"#N/A"}},{"$f":"ROUND(IF(_xlfn.SINGLE(ACOMPANHAMENTO)<>\"PLE\",0,SUMIF(OFFSET(CÁLCULO!$AX$15:$BH$15,$A15,0,$B15),\"<=\"&PLE.Medicao,OFFSET(CÁLCULO!$AB$15:$AL$15,$A15,0,$B15))+IF(AdmLocal=\"Automática\",SUMIF(OFFSET(CÁLCULO!$M$15,$A15,0,$B15),1,OFFSET(ORÇAMENTO!$X$15,$A15,0,$B15))*PLE!$AE$9,0)),2)","v":{"$error":"#N/A"}},null,{"$f":"IF(_xlfn.SINGLE(ACOMPANHAMENTO)<>\"BM\",0,SUMPRODUCT(OFFSET(BM!$M$15,$A15,0,$B15)*(OFFSET(BM!$A$15,$A15,0,$B15)=\"S\")*OFFSET(ORÇAMENTO!AA$15,$A15,0,$B15)/(OFFSET(ORÇAMENTO!$X$15,$A15,0,$B15)+10^-12)))","v":0},{"$f":"IF(_xlfn.SINGLE(ACOMPANHAMENTO)<>\"BM\",0,SUMPRODUCT(OFFSET(BM!$M$15,$A15,0,$B15)*(OFFSET(BM!$A$15,$A15,0,$B15)=\"S\")*OFFSET(ORÇAMENTO!AB$15,$A15,0,$B15)/(OFFSET(ORÇAMENTO!$X$15,$A15,0,$B15)+10^-12)))","v":0},{"$f":"IF(_xlfn.SINGLE(ACOMPANHAMENTO)<>\"BM\",0,OFFSET(BM!$M$15,$A15,0))","v":0},{"$f":"IF(_xlfn.SINGLE(ACOMPANHAMENTO)<>\"BM\",0,SUMPRODUCT(OFFSET(BM!$O$15,$A15,0,$B15)*(OFFSET(BM!$A$15,$A15,0,$B15)=\"S\")*OFFSET(ORÇAMENTO!AA$15,$A15,0,$B15)/(OFFSET(ORÇAMENTO!$X$15,$A15,0,$B15)+10^-12)))","v":0},{"$f":"IF(_xlfn.SINGLE(ACOMPANHAMENTO)<>\"BM\",0,SUMPRODUCT(OFFSET(BM!$O$15,$A15,0,$B15)*(OFFSET(BM!$A$15,$A15,0,$B15)=\"S\")*OFFSET(ORÇAMENTO!AB$15,$A15,0,$B15)/(OFFSET(ORÇAMENTO!$X$15,$A15,0,$B15)+10^-12)))","v":0},{"$f":"IF(_xlfn.SINGLE(ACOMPANHAMENTO)<>\"BM\",0,OFFSET(BM!$O$15,$A15,0))","v":0}]
[{"$f":"MATCH(E16,ORÇAMENTO!$E$15:$E$27,0)-1","v":{"$error":"#N/A"}},{"$f":"IF(ISERROR($A16),NA(),OFFSET(ORÇAMENTO!$D$15,$A16,0))","v":{"$error":"#N/A"}},{"$f":"QCI!B16","v":"Branco"},"",{"$f":"QCI!D16","v":3},{"$f":"QCI!G16","v":""},{"$f":"QCI!H16","v":0},{"$f":"QCI!I16","v":0},{"$f":"QCI!J16","v":""},{"$f":"QCI!K16","v":""},{"$f":"_xlfn.SINGLE(IF($C16=\"Automático\",IF(_xlfn.SINGLE(ACOMPANHAMENTO)=\"BM\",BM.medicao,PLE.Medicao),IF(ISBLANK($X16),\"\",$X16)))","v":""},{"$f":"QCI!$O16","v":0},0,0,0,0,null,{"$f":"ROUND(IF($C16=\"Automático\",AC16+AJ16,$Y16*IF(ISERROR(QCI!$AA16/QCI!$O16),0,QCI!$AA16/QCI!$O16)),2)","v":0},{"$f":"ROUND(IF($C16=\"Automático\",AD16+AK16,$Y16*IF(ISERROR(QCI!$AB16/QCI!$O16),0,QCI!$AB16/QCI!$O16)),2)","v":0},{"$f":"ROUND(IF($C16=\"Automático\",AF16+AM16,$Z16*IF(ISERROR(QCI!$AA16/QCI!$O16),0,QCI!$AA16/QCI!$O16)),2)","v":0},{"$f":"ROUND(IF($C16=\"Automático\",AG16+AN16,$Z16*IF(ISERROR(QCI!$AB16/QCI!$O16),0,QCI!$AB16/QCI!$O16)),2)","v":0},{"$f":"IF(AND($L16>0,$J16<>0,$J16<>\"\",COUNTIF($J$13:$J16,$J16)=1),OFFSET(V16,-1,0)+1,OFFSET(V16,-1,0))","v":1},null,null,null,null,null,null,{"$f":"IF(_xlfn.SINGLE(ACOMPANHAMENTO)<>\"PLE\",0,SUMPRODUCT((OFFSET(CÁLCULO!$AX$15:$BH$15,$A16,0,$B16)<=(PLE.Medicao-1))*OFFSET(CÁLCULO!$AB$15:$AL$15,$A16,0,$B16)*OFFSET(ORÇAMENTO!$AA$15,$A16,0,$B16)/(OFFSET(ORÇAMENTO!$X$15,$A16,0,$B16)+10^-12))+IF(AUTOEVENTO=\"Manual\",SUMPRODUCT((OFFSET(CÁLCULO!$M$15,$A16,0,$B16)=1)*OFFSET(ORÇAMENTO!$AA$15,$A16,0,$B16)*(PLE!$AE$9-PLE!$Y$9)),0))","v":{"$error":"#N/A"}},{"$f":"IF(_xlfn.SINGLE(ACOMPANHAMENTO)<>\"PLE\",0,SUMPRODUCT((OFFSET(CÁLCULO!$AX$15:$BH$15,$A16,0,$B16)<=(PLE.Medicao-1))*OFFSET(CÁLCULO!$AB$15:$AL$15,$A16,0,$B16)*OFFSET(ORÇAMENTO!$AB$15,$A16,0,$B16)/(OFFSET(ORÇAMENTO!$X$15,$A16,0,$B16)+10^-12))+IF(AUTOEVENTO=\"Manual\",SUMPRODUCT((OFFSET(CÁLCULO!$M$15,$A16,0,$B16)=1)*OFFSET(ORÇAMENTO!$AB$15,$A16,0,$B16)*(PLE!$AE$9-PLE!$Y$9)),0))","v":{"$error":"#N/A"}},{"$f":"ROUND(\n            IF(ACOMPANHAMENTO<>\"PLE\",0,\n                      SUMIF(OFFSET(CÁLCULO!$AX$15:$BH$15,$A16,0,$B16),\"<=\"&(PLE.Medicao-1),OFFSET(CÁLCULO!$AB$15:$AL$15,$A16,0,$B16))\n                      +IF(AdmLocal=\"Automática\",\n                              SUMIF(OFFSET(CÁLCULO!$M$15,$A16,0,$B16),1,OFFSET(ORÇAMENTO!$X$15,$A16,0,$B16))*(PLE!$AE$9-PLE!$Y$9),\n                              0)),\n            2)","v":{"$error":"#N/A"}},{"$f":"IF(_xlfn.SINGLE(ACOMPANHAMENTO)<>\"PLE\",0,SUMPRODUCT((OFFSET(CÁLCULO!$AX$15:$BH$15,$A16,0,$B16)<=PLE.Medicao)*OFFSET(CÁLCULO!$AB$15:$AL$15,$A16,0,$B16)*OFFSET(ORÇAMENTO!$AA$15,$A16,0,$B16)/(OFFSET(ORÇAMENTO!$X$15,$A16,0,$B16)+10^-12))+IF(AUTOEVENTO=\"Manual\",SUMPRODUCT((OFFSET(CÁLCULO!$M$15,$A16,0,$B16)=1)*OFFSET(ORÇAMENTO!$AA$15,$A16,0,$B16)*PLE!$AE$9),0))","v":{"$error":"#N/A"}},{"$f":"IF(_xlfn.SINGLE(ACOMPANHAMENTO)<>\"PLE\",0,SUMPRODUCT((OFFSET(CÁLCULO!$AX$15:$BH$15,$A16,0,$B16)<=PLE.Medicao)*OFFSET(CÁLCULO!$AB$15:$AL$15,$A16,0,$B16)*OFFSET(ORÇAMENTO!$AB$15,$A16,0,$B16)/(OFFSET(ORÇAMENTO!$X$15,$A16,0,$B16)+10^-12))+IF(AUTOEVENTO=\"Manual\",SUMPRODUCT((OFFSET(CÁLCULO!$M$15,$A16,0,$B16)=1)*OFFSET(ORÇAMENTO!$AB$15,$A16,0,$B16)*PLE!$AE$9),0))","v":{"$error":"#N/A"}},{"$f":"ROUND(IF(_xlfn.SINGLE(ACOMPANHAMENTO)<>\"PLE\",0,SUMIF(OFFSET(CÁLCULO!$AX$15:$BH$15,$A16,0,$B16),\"<=\"&PLE.Medicao,OFFSET(CÁLCULO!$AB$15:$AL$15,$A16,0,$B16))+IF(AdmLocal=\"Automática\",SUMIF(OFFSET(CÁLCULO!$M$15,$A16,0,$B16),1,OFFSET(ORÇAMENTO!$X$15,$A16,0,$B16))*PLE!$AE$9,0)),2)","v":{"$error":"#N/A"}},null,{"$f":"IF(_xlfn.SINGLE(ACOMPANHAMENTO)<>\"BM\",0,SUMPRODUCT(OFFSET(BM!$M$15,$A16,0,$B16)*(OFFSET(BM!$A$15,$A16,0,$B16)=\"S\")*OFFSET(ORÇAMENTO!AA$15,$A16,0,$B16)/(OFFSET(ORÇAMENTO!$X$15,$A16,0,$B16)+10^-12)))","v":0},{"$f":"IF(_xlfn.SINGLE(ACOMPANHAMENTO)<>\"BM\",0,SUMPRODUCT(OFFSET(BM!$M$15,$A16,0,$B16)*(OFFSET(BM!$A$15,$A16,0,$B16)=\"S\")*OFFSET(ORÇAMENTO!AB$15,$A16,0,$B16)/(OFFSET(ORÇAMENTO!$X$15,$A16,0,$B16)+10^-12)))","v":0},{"$f":"IF(_xlfn.SINGLE(ACOMPANHAMENTO)<>\"BM\",0,OFFSET(BM!$M$15,$A16,0))","v":0},{"$f":"IF(_xlfn.SINGLE(ACOMPANHAMENTO)<>\"BM\",0,SUMPRODUCT(OFFSET(BM!$O$15,$A16,0,$B16)*(OFFSET(BM!$A$15,$A16,0,$B16)=\"S\")*OFFSET(ORÇAMENTO!AA$15,$A16,0,$B16)/(OFFSET(ORÇAMENTO!$X$15,$A16,0,$B16)+10^-12)))","v":0},{"$f":"IF(_xlfn.SINGLE(ACOMPANHAMENTO)<>\"BM\",0,SUMPRODUCT(OFFSET(BM!$O$15,$A16,0,$B16)*(OFFSET(BM!$A$15,$A16,0,$B16)=\"S\")*OFFSET(ORÇAMENTO!AB$15,$A16,0,$B16)/(OFFSET(ORÇAMENTO!$X$15,$A16,0,$B16)+10^-12)))","v":0},{"$f":"IF(_xlfn.SINGLE(ACOMPANHAMENTO)<>\"BM\",0,OFFSET(BM!$O$15,$A16,0))","v":0}]
[{"$f":"MATCH(E17,ORÇAMENTO!$E$15:$E$27,0)-1","v":{"$error":"#N/A"}},{"$f":"IF(ISERROR($A17),NA(),OFFSET(ORÇAMENTO!$D$15,$A17,0))","v":{"$error":"#N/A"}},{"$f":"QCI!B17","v":"Branco"},"",{"$f":"QCI!D17","v":4},{"$f":"QCI!G17","v":""},{"$f":"QCI!H17","v":0},{"$f":"QCI!I17","v":0},{"$f":"QCI!J17","v":""},{"$f":"QCI!K17","v":""},{"$f":"_xlfn.SINGLE(IF($C17=\"Automático\",IF(_xlfn.SINGLE(ACOMPANHAMENTO)=\"BM\",BM.medicao,PLE.Medicao),IF(ISBLANK($X17),\"\",$X17)))","v":""},{"$f":"QCI!$O17","v":0},0,0,0,0,null,{"$f":"ROUND(IF($C17=\"Automático\",AC17+AJ17,$Y17*IF(ISERROR(QCI!$AA17/QCI!$O17),0,QCI!$AA17/QCI!$O17)),2)","v":0},{"$f":"ROUND(IF($C17=\"Automático\",AD17+AK17,$Y17*IF(ISERROR(QCI!$AB17/QCI!$O17),0,QCI!$AB17/QCI!$O17)),2)","v":0},{"$f":"ROUND(IF($C17=\"Automático\",AF17+AM17,$Z17*IF(ISERROR(QCI!$AA17/QCI!$O17),0,QCI!$AA17/QCI!$O17)),2)","v":0},{"$f":"ROUND(IF($C17=\"Automático\",AG17+AN17,$Z17*IF(ISERROR(QCI!$AB17/QCI!$O17),0,QCI!$AB17/QCI!$O17)),2)","v":0},{"$f":"IF(AND($L17>0,$J17<>0,$J17<>\"\",COUNTIF($J$13:$J17,$J17)=1),OFFSET(V17,-1,0)+1,OFFSET(V17,-1,0))","v":1},null,null,null,null,null,null,{"$f":"IF(_xlfn.SINGLE(ACOMPANHAMENTO)<>\"PLE\",0,SUMPRODUCT((OFFSET(CÁLCULO!$AX$15:$BH$15,$A17,0,$B17)<=(PLE.Medicao-1))*OFFSET(CÁLCULO!$AB$15:$AL$15,$A17,0,$B17)*OFFSET(ORÇAMENTO!$AA$15,$A17,0,$B17)/(OFFSET(ORÇAMENTO!$X$15,$A17,0,$B17)+10^-12))+IF(AUTOEVENTO=\"Manual\",SUMPRODUCT((OFFSET(CÁLCULO!$M$15,$A17,0,$B17)=1)*OFFSET(ORÇAMENTO!$AA$15,$A17,0,$B17)*(PLE!$AE$9-PLE!$Y$9)),0))","v":{"$error":"#N/A"}},{"$f":"IF(_xlfn.SINGLE(ACOMPANHAMENTO)<>\"PLE\",0,SUMPRODUCT((OFFSET(CÁLCULO!$AX$15:$BH$15,$A17,0,$B17)<=(PLE.Medicao-1))*OFFSET(CÁLCULO!$AB$15:$AL$15,$A17,0,$B17)*OFFSET(ORÇAMENTO!$AB$15,$A17,0,$B17)/(OFFSET(ORÇAMENTO!$X$15,$A17,0,$B17)+10^-12))+IF(AUTOEVENTO=\"Manual\",SUMPRODUCT((OFFSET(CÁLCULO!$M$15,$A17,0,$B17)=1)*OFFSET(ORÇAMENTO!$AB$15,$A17,0,$B17)*(PLE!$AE$9-PLE!$Y$9)),0))","v":{"$error":"#N/A"}},{"$f":"ROUND(\n            IF(ACOMPANHAMENTO<>\"PLE\",0,\n                      SUMIF(OFFSET(CÁLCULO!$AX$15:$BH$15,$A17,0,$B17),\"<=\"&(PLE.Medicao-1),OFFSET(CÁLCULO!$AB$15:$AL$15,$A17,0,$B17))\n                      +IF(AdmLocal=\"Automática\",\n                              SUMIF(OFFSET(CÁLCULO!$M$15,$A17,0,$B17),1,OFFSET(ORÇAMENTO!$X$15,$A17,0,$B17))*(PLE!$AE$9-PLE!$Y$9),\n                              0)),\n            2)","v":{"$error":"#N/A"}},{"$f":"IF(_xlfn.SINGLE(ACOMPANHAMENTO)<>\"PLE\",0,SUMPRODUCT((OFFSET(CÁLCULO!$AX$15:$BH$15,$A17,0,$B17)<=PLE.Medicao)*OFFSET(CÁLCULO!$AB$15:$AL$15,$A17,0,$B17)*OFFSET(ORÇAMENTO!$AA$15,$A17,0,$B17)/(OFFSET(ORÇAMENTO!$X$15,$A17,0,$B17)+10^-12))+IF(AUTOEVENTO=\"Manual\",SUMPRODUCT((OFFSET(CÁLCULO!$M$15,$A17,0,$B17)=1)*OFFSET(ORÇAMENTO!$AA$15,$A17,0,$B17)*PLE!$AE$9),0))","v":{"$error":"#N/A"}},{"$f":"IF(_xlfn.SINGLE(ACOMPANHAMENTO)<>\"PLE\",0,SUMPRODUCT((OFFSET(CÁLCULO!$AX$15:$BH$15,$A17,0,$B17)<=PLE.Medicao)*OFFSET(CÁLCULO!$AB$15:$AL$15,$A17,0,$B17)*OFFSET(ORÇAMENTO!$AB$15,$A17,0,$B17)/(OFFSET(ORÇAMENTO!$X$15,$A17,0,$B17)+10^-12))+IF(AUTOEVENTO=\"Manual\",SUMPRODUCT((OFFSET(CÁLCULO!$M$15,$A17,0,$B17)=1)*OFFSET(ORÇAMENTO!$AB$15,$A17,0,$B17)*PLE!$AE$9),0))","v":{"$error":"#N/A"}},{"$f":"ROUND(IF(_xlfn.SINGLE(ACOMPANHAMENTO)<>\"PLE\",0,SUMIF(OFFSET(CÁLCULO!$AX$15:$BH$15,$A17,0,$B17),\"<=\"&PLE.Medicao,OFFSET(CÁLCULO!$AB$15:$AL$15,$A17,0,$B17))+IF(AdmLocal=\"Automática\",SUMIF(OFFSET(CÁLCULO!$M$15,$A17,0,$B17),1,OFFSET(ORÇAMENTO!$X$15,$A17,0,$B17))*PLE!$AE$9,0)),2)","v":{"$error":"#N/A"}},null,{"$f":"IF(_xlfn.SINGLE(ACOMPANHAMENTO)<>\"BM\",0,SUMPRODUCT(OFFSET(BM!$M$15,$A17,0,$B17)*(OFFSET(BM!$A$15,$A17,0,$B17)=\"S\")*OFFSET(ORÇAMENTO!AA$15,$A17,0,$B17)/(OFFSET(ORÇAMENTO!$X$15,$A17,0,$B17)+10^-12)))","v":0},{"$f":"IF(_xlfn.SINGLE(ACOMPANHAMENTO)<>\"BM\",0,SUMPRODUCT(OFFSET(BM!$M$15,$A17,0,$B17)*(OFFSET(BM!$A$15,$A17,0,$B17)=\"S\")*OFFSET(ORÇAMENTO!AB$15,$A17,0,$B17)/(OFFSET(ORÇAMENTO!$X$15,$A17,0,$B17)+10^-12)))","v":0},{"$f":"IF(_xlfn.SINGLE(ACOMPANHAMENTO)<>\"BM\",0,OFFSET(BM!$M$15,$A17,0))","v":0},{"$f":"IF(_xlfn.SINGLE(ACOMPANHAMENTO)<>\"BM\",0,SUMPRODUCT(OFFSET(BM!$O$15,$A17,0,$B17)*(OFFSET(BM!$A$15,$A17,0,$B17)=\"S\")*OFFSET(ORÇAMENTO!AA$15,$A17,0,$B17)/(OFFSET(ORÇAMENTO!$X$15,$A17,0,$B17)+10^-12)))","v":0},{"$f":"IF(_xlfn.SINGLE(ACOMPANHAMENTO)<>\"BM\",0,SUMPRODUCT(OFFSET(BM!$O$15,$A17,0,$B17)*(OFFSET(BM!$A$15,$A17,0,$B17)=\"S\")*OFFSET(ORÇAMENTO!AB$15,$A17,0,$B17)/(OFFSET(ORÇAMENTO!$X$15,$A17,0,$B17)+10^-12)))","v":0},{"$f":"IF(_xlfn.SINGLE(ACOMPANHAMENTO)<>\"BM\",0,OFFSET(BM!$O$15,$A17,0))","v":0}]
[{"$f":"MATCH(E18,ORÇAMENTO!$E$15:$E$27,0)-1","v":{"$error":"#N/A"}},{"$f":"IF(ISERROR($A18),NA(),OFFSET(ORÇAMENTO!$D$15,$A18,0))","v":{"$error":"#N/A"}},{"$f":"QCI!B18","v":"Branco"},"",{"$f":"QCI!D18","v":5},{"$f":"QCI!G18","v":""},{"$f":"QCI!H18","v":0},{"$f":"QCI!I18","v":0},{"$f":"QCI!J18","v":""},{"$f":"QCI!K18","v":""},{"$f":"_xlfn.SINGLE(IF($C18=\"Automático\",IF(_xlfn.SINGLE(ACOMPANHAMENTO)=\"BM\",BM.medicao,PLE.Medicao),IF(ISBLANK($X18),\"\",$X18)))","v":""},{"$f":"QCI!$O18","v":0},0,0,0,0,null,{"$f":"ROUND(IF($C18=\"Automático\",AC18+AJ18,$Y18*IF(ISERROR(QCI!$AA18/QCI!$O18),0,QCI!$AA18/QCI!$O18)),2)","v":0},{"$f":"ROUND(IF($C18=\"Automático\",AD18+AK18,$Y18*IF(ISERROR(QCI!$AB18/QCI!$O18),0,QCI!$AB18/QCI!$O18)),2)","v":0},{"$f":"ROUND(IF($C18=\"Automático\",AF18+AM18,$Z18*IF(ISERROR(QCI!$AA18/QCI!$O18),0,QCI!$AA18/QCI!$O18)),2)","v":0},{"$f":"ROUND(IF($C18=\"Automático\",AG18+AN18,$Z18*IF(ISERROR(QCI!$AB18/QCI!$O18),0,QCI!$AB18/QCI!$O18)),2)","v":0},{"$f":"IF(AND($L18>0,$J18<>0,$J18<>\"\",COUNTIF($J$13:$J18,$J18)=1),OFFSET(V18,-1,0)+1,OFFSET(V18,-1,0))","v":1},null,null,null,null,null,null,{"$f":"IF(_xlfn.SINGLE(ACOMPANHAMENTO)<>\"PLE\",0,SUMPRODUCT((OFFSET(CÁLCULO!$AX$15:$BH$15,$A18,0,$B18)<=(PLE.Medicao-1))*OFFSET(CÁLCULO!$AB$15:$AL$15,$A18,0,$B18)*OFFSET(ORÇAMENTO!$AA$15,$A18,0,$B18)/(OFFSET(ORÇAMENTO!$X$15,$A18,0,$B18)+10^-12))+IF(AUTOEVENTO=\"Manual\",SUMPRODUCT((OFFSET(CÁLCULO!$M$15,$A18,0,$B18)=1)*OFFSET(ORÇAMENTO!$AA$15,$A18,0,$B18)*(PLE!$AE$9-PLE!$Y$9)),0))","v":{"$error":"#N/A"}},{"$f":"IF(_xlfn.SINGLE(ACOMPANHAMENTO)<>\"PLE\",0,SUMPRODUCT((OFFSET(CÁLCULO!$AX$15:$BH$15,$A18,0,$B18)<=(PLE.Medicao-1))*OFFSET(CÁLCULO!$AB$15:$AL$15,$A18,0,$B18)*OFFSET(ORÇAMENTO!$AB$15,$A18,0,$B18)/(OFFSET(ORÇAMENTO!$X$15,$A18,0,$B18)+10^-12))+IF(AUTOEVENTO=\"Manual\",SUMPRODUCT((OFFSET(CÁLCULO!$M$15,$A18,0,$B18)=1)*OFFSET(ORÇAMENTO!$AB$15,$A18,0,$B18)*(PLE!$AE$9-PLE!$Y$9)),0))","v":{"$error":"#N/A"}},{"$f":"ROUND(\n            IF(ACOMPANHAMENTO<>\"PLE\",0,\n                      SUMIF(OFFSET(CÁLCULO!$AX$15:$BH$15,$A18,0,$B18),\"<=\"&(PLE.Medicao-1),OFFSET(CÁLCULO!$AB$15:$AL$15,$A18,0,$B18))\n                      +IF(AdmLocal=\"Automática\",\n                              SUMIF(OFFSET(CÁLCULO!$M$15,$A18,0,$B18),1,OFFSET(ORÇAMENTO!$X$15,$A18,0,$B18))*(PLE!$AE$9-PLE!$Y$9),\n                              0)),\n            2)","v":{"$error":"#N/A"}},{"$f":"IF(_xlfn.SINGLE(ACOMPANHAMENTO)<>\"PLE\",0,SUMPRODUCT((OFFSET(CÁLCULO!$AX$15:$BH$15,$A18,0,$B18)<=PLE.Medicao)*OFFSET(CÁLCULO!$AB$15:$AL$15,$A18,0,$B18)*OFFSET(ORÇAMENTO!$AA$15,$A18,0,$B18)/(OFFSET(ORÇAMENTO!$X$15,$A18,0,$B18)+10^-12))+IF(AUTOEVENTO=\"Manual\",SUMPRODUCT((OFFSET(CÁLCULO!$M$15,$A18,0,$B18)=1)*OFFSET(ORÇAMENTO!$AA$15,$A18,0,$B18)*PLE!$AE$9),0))","v":{"$error":"#N/A"}},{"$f":"IF(_xlfn.SINGLE(ACOMPANHAMENTO)<>\"PLE\",0,SUMPRODUCT((OFFSET(CÁLCULO!$AX$15:$BH$15,$A18,0,$B18)<=PLE.Medicao)*OFFSET(CÁLCULO!$AB$15:$AL$15,$A18,0,$B18)*OFFSET(ORÇAMENTO!$AB$15,$A18,0,$B18)/(OFFSET(ORÇAMENTO!$X$15,$A18,0,$B18)+10^-12))+IF(AUTOEVENTO=\"Manual\",SUMPRODUCT((OFFSET(CÁLCULO!$M$15,$A18,0,$B18)=1)*OFFSET(ORÇAMENTO!$AB$15,$A18,0,$B18)*PLE!$AE$9),0))","v":{"$error":"#N/A"}},{"$f":"ROUND(IF(_xlfn.SINGLE(ACOMPANHAMENTO)<>\"PLE\",0,SUMIF(OFFSET(CÁLCULO!$AX$15:$BH$15,$A18,0,$B18),\"<=\"&PLE.Medicao,OFFSET(CÁLCULO!$AB$15:$AL$15,$A18,0,$B18))+IF(AdmLocal=\"Automática\",SUMIF(OFFSET(CÁLCULO!$M$15,$A18,0,$B18),1,OFFSET(ORÇAMENTO!$X$15,$A18,0,$B18))*PLE!$AE$9,0)),2)","v":{"$error":"#N/A"}},null,{"$f":"IF(_xlfn.SINGLE(ACOMPANHAMENTO)<>\"BM\",0,SUMPRODUCT(OFFSET(BM!$M$15,$A18,0,$B18)*(OFFSET(BM!$A$15,$A18,0,$B18)=\"S\")*OFFSET(ORÇAMENTO!AA$15,$A18,0,$B18)/(OFFSET(ORÇAMENTO!$X$15,$A18,0,$B18)+10^-12)))","v":0},{"$f":"IF(_xlfn.SINGLE(ACOMPANHAMENTO)<>\"BM\",0,SUMPRODUCT(OFFSET(BM!$M$15,$A18,0,$B18)*(OFFSET(BM!$A$15,$A18,0,$B18)=\"S\")*OFFSET(ORÇAMENTO!AB$15,$A18,0,$B18)/(OFFSET(ORÇAMENTO!$X$15,$A18,0,$B18)+10^-12)))","v":0},{"$f":"IF(_xlfn.SINGLE(ACOMPANHAMENTO)<>\"BM\",0,OFFSET(BM!$M$15,$A18,0))","v":0},{"$f":"IF(_xlfn.SINGLE(ACOMPANHAMENTO)<>\"BM\",0,SUMPRODUCT(OFFSET(BM!$O$15,$A18,0,$B18)*(OFFSET(BM!$A$15,$A18,0,$B18)=\"S\")*OFFSET(ORÇAMENTO!AA$15,$A18,0,$B18)/(OFFSET(ORÇAMENTO!$X$15,$A18,0,$B18)+10^-12)))","v":0},{"$f":"IF(_xlfn.SINGLE(ACOMPANHAMENTO)<>\"BM\",0,SUMPRODUCT(OFFSET(BM!$O$15,$A18,0,$B18)*(OFFSET(BM!$A$15,$A18,0,$B18)=\"S\")*OFFSET(ORÇAMENTO!AB$15,$A18,0,$B18)/(OFFSET(ORÇAMENTO!$X$15,$A18,0,$B18)+10^-12)))","v":0},{"$f":"IF(_xlfn.SINGLE(ACOMPANHAMENTO)<>\"BM\",0,OFFSET(BM!$O$15,$A18,0))","v":0}]
[{"$f":"MATCH(E19,ORÇAMENTO!$E$15:$E$27,0)-1","v":{"$error":"#N/A"}},{"$f":"IF(ISERROR($A19),NA(),OFFSET(ORÇAMENTO!$D$15,$A19,0))","v":{"$error":"#N/A"}},{"$f":"QCI!B19","v":"Branco"},"",{"$f":"QCI!D19","v":6},{"$f":"QCI!G19","v":""},{"$f":"QCI!H19","v":0},{"$f":"QCI!I19","v":0},{"$f":"QCI!J19","v":""},{"$f":"QCI!K19","v":""},{"$f":"_xlfn.SINGLE(IF($C19=\"Automático\",IF(_xlfn.SINGLE(ACOMPANHAMENTO)=\"BM\",BM.medicao,PLE.Medicao),IF(ISBLANK($X19),\"\",$X19)))","v":""},{"$f":"QCI!$O19","v":0},0,0,0,0,null,{"$f":"ROUND(IF($C19=\"Automático\",AC19+AJ19,$Y19*IF(ISERROR(QCI!$AA19/QCI!$O19),0,QCI!$AA19/QCI!$O19)),2)","v":0},{"$f":"ROUND(IF($C19=\"Automático\",AD19+AK19,$Y19*IF(ISERROR(QCI!$AB19/QCI!$O19),0,QCI!$AB19/QCI!$O19)),2)","v":0},{"$f":"ROUND(IF($C19=\"Automático\",AF19+AM19,$Z19*IF(ISERROR(QCI!$AA19/QCI!$O19),0,QCI!$AA19/QCI!$O19)),2)","v":0},{"$f":"ROUND(IF($C19=\"Automático\",AG19+AN19,$Z19*IF(ISERROR(QCI!$AB19/QCI!$O19),0,QCI!$AB19/QCI!$O19)),2)","v":0},{"$f":"IF(AND($L19>0,$J19<>0,$J19<>\"\",COUNTIF($J$13:$J19,$J19)=1),OFFSET(V19,-1,0)+1,OFFSET(V19,-1,0))","v":1},null,null,null,null,null,null,{"$f":"IF(_xlfn.SINGLE(ACOMPANHAMENTO)<>\"PLE\",0,SUMPRODUCT((OFFSET(CÁLCULO!$AX$15:$BH$15,$A19,0,$B19)<=(PLE.Medicao-1))*OFFSET(CÁLCULO!$AB$15:$AL$15,$A19,0,$B19)*OFFSET(ORÇAMENTO!$AA$15,$A19,0,$B19)/(OFFSET(ORÇAMENTO!$X$15,$A19,0,$B19)+10^-12))+IF(AUTOEVENTO=\"Manual\",SUMPRODUCT((OFFSET(CÁLCULO!$M$15,$A19,0,$B19)=1)*OFFSET(ORÇAMENTO!$AA$15,$A19,0,$B19)*(PLE!$AE$9-PLE!$Y$9)),0))","v":{"$error":"#N/A"}},{"$f":"IF(_xlfn.SINGLE(ACOMPANHAMENTO)<>\"PLE\",0,SUMPRODUCT((OFFSET(CÁLCULO!$AX$15:$BH$15,$A19,0,$B19)<=(PLE.Medicao-1))*OFFSET(CÁLCULO!$AB$15:$AL$15,$A19,0,$B19)*OFFSET(ORÇAMENTO!$AB$15,$A19,0,$B19)/(OFFSET(ORÇAMENTO!$X$15,$A19,0,$B19)+10^-12))+IF(AUTOEVENTO=\"Manual\",SUMPRODUCT((OFFSET(CÁLCULO!$M$15,$A19,0,$B19)=1)*OFFSET(ORÇAMENTO!$AB$15,$A19,0,$B19)*(PLE!$AE$9-PLE!$Y$9)),0))","v":{"$error":"#N/A"}},{"$f":"ROUND(\n            IF(ACOMPANHAMENTO<>\"PLE\",0,\n                      SUMIF(OFFSET(CÁLCULO!$AX$15:$BH$15,$A19,0,$B19),\"<=\"&(PLE.Medicao-1),OFFSET(CÁLCULO!$AB$15:$AL$15,$A19,0,$B19))\n                      +IF(AdmLocal=\"Automática\",\n                              SUMIF(OFFSET(CÁLCULO!$M$15,$A19,0,$B19),1,OFFSET(ORÇAMENTO!$X$15,$A19,0,$B19))*(PLE!$AE$9-PLE!$Y$9),\n                              0)),\n            2)","v":{"$error":"#N/A"}},{"$f":"IF(_xlfn.SINGLE(ACOMPANHAMENTO)<>\"PLE\",0,SUMPRODUCT((OFFSET(CÁLCULO!$AX$15:$BH$15,$A19,0,$B19)<=PLE.Medicao)*OFFSET(CÁLCULO!$AB$15:$AL$15,$A19,0,$B19)*OFFSET(ORÇAMENTO!$AA$15,$A19,0,$B19)/(OFFSET(ORÇAMENTO!$X$15,$A19,0,$B19)+10^-12))+IF(AUTOEVENTO=\"Manual\",SUMPRODUCT((OFFSET(CÁLCULO!$M$15,$A19,0,$B19)=1)*OFFSET(ORÇAMENTO!$AA$15,$A19,0,$B19)*PLE!$AE$9),0))","v":{"$error":"#N/A"}},{"$f":"IF(_xlfn.SINGLE(ACOMPANHAMENTO)<>\"PLE\",0,SUMPRODUCT((OFFSET(CÁLCULO!$AX$15:$BH$15,$A19,0,$B19)<=PLE.Medicao)*OFFSET(CÁLCULO!$AB$15:$AL$15,$A19,0,$B19)*OFFSET(ORÇAMENTO!$AB$15,$A19,0,$B19)/(OFFSET(ORÇAMENTO!$X$15,$A19,0,$B19)+10^-12))+IF(AUTOEVENTO=\"Manual\",SUMPRODUCT((OFFSET(CÁLCULO!$M$15,$A19,0,$B19)=1)*OFFSET(ORÇAMENTO!$AB$15,$A19,0,$B19)*PLE!$AE$9),0))","v":{"$error":"#N/A"}},{"$f":"ROUND(IF(_xlfn.SINGLE(ACOMPANHAMENTO)<>\"PLE\",0,SUMIF(OFFSET(CÁLCULO!$AX$15:$BH$15,$A19,0,$B19),\"<=\"&PLE.Medicao,OFFSET(CÁLCULO!$AB$15:$AL$15,$A19,0,$B19))+IF(AdmLocal=\"Automática\",SUMIF(OFFSET(CÁLCULO!$M$15,$A19,0,$B19),1,OFFSET(ORÇAMENTO!$X$15,$A19,0,$B19))*PLE!$AE$9,0)),2)","v":{"$error":"#N/A"}},null,{"$f":"IF(_xlfn.SINGLE(ACOMPANHAMENTO)<>\"BM\",0,SUMPRODUCT(OFFSET(BM!$M$15,$A19,0,$B19)*(OFFSET(BM!$A$15,$A19,0,$B19)=\"S\")*OFFSET(ORÇAMENTO!AA$15,$A19,0,$B19)/(OFFSET(ORÇAMENTO!$X$15,$A19,0,$B19)+10^-12)))","v":0},{"$f":"IF(_xlfn.SINGLE(ACOMPANHAMENTO)<>\"BM\",0,SUMPRODUCT(OFFSET(BM!$M$15,$A19,0,$B19)*(OFFSET(BM!$A$15,$A19,0,$B19)=\"S\")*OFFSET(ORÇAMENTO!AB$15,$A19,0,$B19)/(OFFSET(ORÇAMENTO!$X$15,$A19,0,$B19)+10^-12)))","v":0},{"$f":"IF(_xlfn.SINGLE(ACOMPANHAMENTO)<>\"BM\",0,OFFSET(BM!$M$15,$A19,0))","v":0},{"$f":"IF(_xlfn.SINGLE(ACOMPANHAMENTO)<>\"BM\",0,SUMPRODUCT(OFFSET(BM!$O$15,$A19,0,$B19)*(OFFSET(BM!$A$15,$A19,0,$B19)=\"S\")*OFFSET(ORÇAMENTO!AA$15,$A19,0,$B19)/(OFFSET(ORÇAMENTO!$X$15,$A19,0,$B19)+10^-12)))","v":0},{"$f":"IF(_xlfn.SINGLE(ACOMPANHAMENTO)<>\"BM\",0,SUMPRODUCT(OFFSET(BM!$O$15,$A19,0,$B19)*(OFFSET(BM!$A$15,$A19,0,$B19)=\"S\")*OFFSET(ORÇAMENTO!AB$15,$A19,0,$B19)/(OFFSET(ORÇAMENTO!$X$15,$A19,0,$B19)+10^-12)))","v":0},{"$f":"IF(_xlfn.SINGLE(ACOMPANHAMENTO)<>\"BM\",0,OFFSET(BM!$O$15,$A19,0))","v":0}]
[{"$f":"MATCH(E20,ORÇAMENTO!$E$15:$E$27,0)-1","v":{"$error":"#N/A"}},{"$f":"IF(ISERROR($A20),NA(),OFFSET(ORÇAMENTO!$D$15,$A20,0))","v":{"$error":"#N/A"}},{"$f":"QCI!B20","v":"Branco"},"",{"$f":"QCI!D20","v":7},{"$f":"QCI!G20","v":""},{"$f":"QCI!H20","v":0},{"$f":"QCI!I20","v":0},{"$f":"QCI!J20","v":""},{"$f":"QCI!K20","v":""},{"$f":"_xlfn.SINGLE(IF($C20=\"Automático\",IF(_xlfn.SINGLE(ACOMPANHAMENTO)=\"BM\",BM.medicao,PLE.Medicao),IF(ISBLANK($X20),\"\",$X20)))","v":""},{"$f":"QCI!$O20","v":0},0,0,0,0,null,{"$f":"ROUND(IF($C20=\"Automático\",AC20+AJ20,$Y20*IF(ISERROR(QCI!$AA20/QCI!$O20),0,QCI!$AA20/QCI!$O20)),2)","v":0},{"$f":"ROUND(IF($C20=\"Automático\",AD20+AK20,$Y20*IF(ISERROR(QCI!$AB20/QCI!$O20),0,QCI!$AB20/QCI!$O20)),2)","v":0},{"$f":"ROUND(IF($C20=\"Automático\",AF20+AM20,$Z20*IF(ISERROR(QCI!$AA20/QCI!$O20),0,QCI!$AA20/QCI!$O20)),2)","v":0},{"$f":"ROUND(IF($C20=\"Automático\",AG20+AN20,$Z20*IF(ISERROR(QCI!$AB20/QCI!$O20),0,QCI!$AB20/QCI!$O20)),2)","v":0},{"$f":"IF(AND($L20>0,$J20<>0,$J20<>\"\",COUNTIF($J$13:$J20,$J20)=1),OFFSET(V20,-1,0)+1,OFFSET(V20,-1,0))","v":1},null,null,null,null,null,null,{"$f":"IF(_xlfn.SINGLE(ACOMPANHAMENTO)<>\"PLE\",0,SUMPRODUCT((OFFSET(CÁLCULO!$AX$15:$BH$15,$A20,0,$B20)<=(PLE.Medicao-1))*OFFSET(CÁLCULO!$AB$15:$AL$15,$A20,0,$B20)*OFFSET(ORÇAMENTO!$AA$15,$A20,0,$B20)/(OFFSET(ORÇAMENTO!$X$15,$A20,0,$B20)+10^-12))+IF(AUTOEVENTO=\"Manual\",SUMPRODUCT((OFFSET(CÁLCULO!$M$15,$A20,0,$B20)=1)*OFFSET(ORÇAMENTO!$AA$15,$A20,0,$B20)*(PLE!$AE$9-PLE!$Y$9)),0))","v":{"$error":"#N/A"}},{"$f":"IF(_xlfn.SINGLE(ACOMPANHAMENTO)<>\"PLE\",0,SUMPRODUCT((OFFSET(CÁLCULO!$AX$15:$BH$15,$A20,0,$B20)<=(PLE.Medicao-1))*OFFSET(CÁLCULO!$AB$15:$AL$15,$A20,0,$B20)*OFFSET(ORÇAMENTO!$AB$15,$A20,0,$B20)/(OFFSET(ORÇAMENTO!$X$15,$A20,0,$B20)+10^-12))+IF(AUTOEVENTO=\"Manual\",SUMPRODUCT((OFFSET(CÁLCULO!$M$15,$A20,0,$B20)=1)*OFFSET(ORÇAMENTO!$AB$15,$A20,0,$B20)*(PLE!$AE$9-PLE!$Y$9)),0))","v":{"$error":"#N/A"}},{"$f":"ROUND(\n            IF(ACOMPANHAMENTO<>\"PLE\",0,\n                      SUMIF(OFFSET(CÁLCULO!$AX$15:$BH$15,$A20,0,$B20),\"<=\"&(PLE.Medicao-1),OFFSET(CÁLCULO!$AB$15:$AL$15,$A20,0,$B20))\n                      +IF(AdmLocal=\"Automática\",\n                              SUMIF(OFFSET(CÁLCULO!$M$15,$A20,0,$B20),1,OFFSET(ORÇAMENTO!$X$15,$A20,0,$B20))*(PLE!$AE$9-PLE!$Y$9),\n                              0)),\n            2)","v":{"$error":"#N/A"}},{"$f":"IF(_xlfn.SINGLE(ACOMPANHAMENTO)<>\"PLE\",0,SUMPRODUCT((OFFSET(CÁLCULO!$AX$15:$BH$15,$A20,0,$B20)<=PLE.Medicao)*OFFSET(CÁLCULO!$AB$15:$AL$15,$A20,0,$B20)*OFFSET(ORÇAMENTO!$AA$15,$A20,0,$B20)/(OFFSET(ORÇAMENTO!$X$15,$A20,0,$B20)+10^-12))+IF(AUTOEVENTO=\"Manual\",SUMPRODUCT((OFFSET(CÁLCULO!$M$15,$A20,0,$B20)=1)*OFFSET(ORÇAMENTO!$AA$15,$A20,0,$B20)*PLE!$AE$9),0))","v":{"$error":"#N/A"}},{"$f":"IF(_xlfn.SINGLE(ACOMPANHAMENTO)<>\"PLE\",0,SUMPRODUCT((OFFSET(CÁLCULO!$AX$15:$BH$15,$A20,0,$B20)<=PLE.Medicao)*OFFSET(CÁLCULO!$AB$15:$AL$15,$A20,0,$B20)*OFFSET(ORÇAMENTO!$AB$15,$A20,0,$B20)/(OFFSET(ORÇAMENTO!$X$15,$A20,0,$B20)+10^-12))+IF(AUTOEVENTO=\"Manual\",SUMPRODUCT((OFFSET(CÁLCULO!$M$15,$A20,0,$B20)=1)*OFFSET(ORÇAMENTO!$AB$15,$A20,0,$B20)*PLE!$AE$9),0))","v":{"$error":"#N/A"}},{"$f":"ROUND(IF(_xlfn.SINGLE(ACOMPANHAMENTO)<>\"PLE\",0,SUMIF(OFFSET(CÁLCULO!$AX$15:$BH$15,$A20,0,$B20),\"<=\"&PLE.Medicao,OFFSET(CÁLCULO!$AB$15:$AL$15,$A20,0,$B20))+IF(AdmLocal=\"Automática\",SUMIF(OFFSET(CÁLCULO!$M$15,$A20,0,$B20),1,OFFSET(ORÇAMENTO!$X$15,$A20,0,$B20))*PLE!$AE$9,0)),2)","v":{"$error":"#N/A"}},null,{"$f":"IF(_xlfn.SINGLE(ACOMPANHAMENTO)<>\"BM\",0,SUMPRODUCT(OFFSET(BM!$M$15,$A20,0,$B20)*(OFFSET(BM!$A$15,$A20,0,$B20)=\"S\")*OFFSET(ORÇAMENTO!AA$15,$A20,0,$B20)/(OFFSET(ORÇAMENTO!$X$15,$A20,0,$B20)+10^-12)))","v":0},{"$f":"IF(_xlfn.SINGLE(ACOMPANHAMENTO)<>\"BM\",0,SUMPRODUCT(OFFSET(BM!$M$15,$A20,0,$B20)*(OFFSET(BM!$A$15,$A20,0,$B20)=\"S\")*OFFSET(ORÇAMENTO!AB$15,$A20,0,$B20)/(OFFSET(ORÇAMENTO!$X$15,$A20,0,$B20)+10^-12)))","v":0},{"$f":"IF(_xlfn.SINGLE(ACOMPANHAMENTO)<>\"BM\",0,OFFSET(BM!$M$15,$A20,0))","v":0},{"$f":"IF(_xlfn.SINGLE(ACOMPANHAMENTO)<>\"BM\",0,SUMPRODUCT(OFFSET(BM!$O$15,$A20,0,$B20)*(OFFSET(BM!$A$15,$A20,0,$B20)=\"S\")*OFFSET(ORÇAMENTO!AA$15,$A20,0,$B20)/(OFFSET(ORÇAMENTO!$X$15,$A20,0,$B20)+10^-12)))","v":0},{"$f":"IF(_xlfn.SINGLE(ACOMPANHAMENTO)<>\"BM\",0,SUMPRODUCT(OFFSET(BM!$O$15,$A20,0,$B20)*(OFFSET(BM!$A$15,$A20,0,$B20)=\"S\")*OFFSET(ORÇAMENTO!AB$15,$A20,0,$B20)/(OFFSET(ORÇAMENTO!$X$15,$A20,0,$B20)+10^-12)))","v":0},{"$f":"IF(_xlfn.SINGLE(ACOMPANHAMENTO)<>\"BM\",0,OFFSET(BM!$O$15,$A20,0))","v":0}]
[{"$f":"MATCH(E21,ORÇAMENTO!$E$15:$E$27,0)-1","v":{"$error":"#N/A"}},{"$f":"IF(ISERROR($A21),NA(),OFFSET(ORÇAMENTO!$D$15,$A21,0))","v":{"$error":"#N/A"}},{"$f":"QCI!B21","v":"Branco"},"",{"$f":"QCI!D21","v":8},{"$f":"QCI!G21","v":""},{"$f":"QCI!H21","v":0},{"$f":"QCI!I21","v":0},{"$f":"QCI!J21","v":""},{"$f":"QCI!K21","v":""},{"$f":"_xlfn.SINGLE(IF($C21=\"Automático\",IF(_xlfn.SINGLE(ACOMPANHAMENTO)=\"BM\",BM.medicao,PLE.Medicao),IF(ISBLANK($X21),\"\",$X21)))","v":""},{"$f":"QCI!$O21","v":0},0,0,0,0,null,{"$f":"ROUND(IF($C21=\"Automático\",AC21+AJ21,$Y21*IF(ISERROR(QCI!$AA21/QCI!$O21),0,QCI!$AA21/QCI!$O21)),2)","v":0},{"$f":"ROUND(IF($C21=\"Automático\",AD21+AK21,$Y21*IF(ISERROR(QCI!$AB21/QCI!$O21),0,QCI!$AB21/QCI!$O21)),2)","v":0},{"$f":"ROUND(IF($C21=\"Automático\",AF21+AM21,$Z21*IF(ISERROR(QCI!$AA21/QCI!$O21),0,QCI!$AA21/QCI!$O21)),2)","v":0},{"$f":"ROUND(IF($C21=\"Automático\",AG21+AN21,$Z21*IF(ISERROR(QCI!$AB21/QCI!$O21),0,QCI!$AB21/QCI!$O21)),2)","v":0},{"$f":"IF(AND($L21>0,$J21<>0,$J21<>\"\",COUNTIF($J$13:$J21,$J21)=1),OFFSET(V21,-1,0)+1,OFFSET(V21,-1,0))","v":1},null,null,null,null,null,null,{"$f":"IF(_xlfn.SINGLE(ACOMPANHAMENTO)<>\"PLE\",0,SUMPRODUCT((OFFSET(CÁLCULO!$AX$15:$BH$15,$A21,0,$B21)<=(PLE.Medicao-1))*OFFSET(CÁLCULO!$AB$15:$AL$15,$A21,0,$B21)*OFFSET(ORÇAMENTO!$AA$15,$A21,0,$B21)/(OFFSET(ORÇAMENTO!$X$15,$A21,0,$B21)+10^-12))+IF(AUTOEVENTO=\"Manual\",SUMPRODUCT((OFFSET(CÁLCULO!$M$15,$A21,0,$B21)=1)*OFFSET(ORÇAMENTO!$AA$15,$A21,0,$B21)*(PLE!$AE$9-PLE!$Y$9)),0))","v":{"$error":"#N/A"}},{"$f":"IF(_xlfn.SINGLE(ACOMPANHAMENTO)<>\"PLE\",0,SUMPRODUCT((OFFSET(CÁLCULO!$AX$15:$BH$15,$A21,0,$B21)<=(PLE.Medicao-1))*OFFSET(CÁLCULO!$AB$15:$AL$15,$A21,0,$B21)*OFFSET(ORÇAMENTO!$AB$15,$A21,0,$B21)/(OFFSET(ORÇAMENTO!$X$15,$A21,0,$B21)+10^-12))+IF(AUTOEVENTO=\"Manual\",SUMPRODUCT((OFFSET(CÁLCULO!$M$15,$A21,0,$B21)=1)*OFFSET(ORÇAMENTO!$AB$15,$A21,0,$B21)*(PLE!$AE$9-PLE!$Y$9)),0))","v":{"$error":"#N/A"}},{"$f":"ROUND(\n            IF(ACOMPANHAMENTO<>\"PLE\",0,\n                      SUMIF(OFFSET(CÁLCULO!$AX$15:$BH$15,$A21,0,$B21),\"<=\"&(PLE.Medicao-1),OFFSET(CÁLCULO!$AB$15:$AL$15,$A21,0,$B21))\n                      +IF(AdmLocal=\"Automática\",\n                              SUMIF(OFFSET(CÁLCULO!$M$15,$A21,0,$B21),1,OFFSET(ORÇAMENTO!$X$15,$A21,0,$B21))*(PLE!$AE$9-PLE!$Y$9),\n                              0)),\n            2)","v":{"$error":"#N/A"}},{"$f":"IF(_xlfn.SINGLE(ACOMPANHAMENTO)<>\"PLE\",0,SUMPRODUCT((OFFSET(CÁLCULO!$AX$15:$BH$15,$A21,0,$B21)<=PLE.Medicao)*OFFSET(CÁLCULO!$AB$15:$AL$15,$A21,0,$B21)*OFFSET(ORÇAMENTO!$AA$15,$A21,0,$B21)/(OFFSET(ORÇAMENTO!$X$15,$A21,0,$B21)+10^-12))+IF(AUTOEVENTO=\"Manual\",SUMPRODUCT((OFFSET(CÁLCULO!$M$15,$A21,0,$B21)=1)*OFFSET(ORÇAMENTO!$AA$15,$A21,0,$B21)*PLE!$AE$9),0))","v":{"$error":"#N/A"}},{"$f":"IF(_xlfn.SINGLE(ACOMPANHAMENTO)<>\"PLE\",0,SUMPRODUCT((OFFSET(CÁLCULO!$AX$15:$BH$15,$A21,0,$B21)<=PLE.Medicao)*OFFSET(CÁLCULO!$AB$15:$AL$15,$A21,0,$B21)*OFFSET(ORÇAMENTO!$AB$15,$A21,0,$B21)/(OFFSET(ORÇAMENTO!$X$15,$A21,0,$B21)+10^-12))+IF(AUTOEVENTO=\"Manual\",SUMPRODUCT((OFFSET(CÁLCULO!$M$15,$A21,0,$B21)=1)*OFFSET(ORÇAMENTO!$AB$15,$A21,0,$B21)*PLE!$AE$9),0))","v":{"$error":"#N/A"}},{"$f":"ROUND(IF(_xlfn.SINGLE(ACOMPANHAMENTO)<>\"PLE\",0,SUMIF(OFFSET(CÁLCULO!$AX$15:$BH$15,$A21,0,$B21),\"<=\"&PLE.Medicao,OFFSET(CÁLCULO!$AB$15:$AL$15,$A21,0,$B21))+IF(AdmLocal=\"Automática\",SUMIF(OFFSET(CÁLCULO!$M$15,$A21,0,$B21),1,OFFSET(ORÇAMENTO!$X$15,$A21,0,$B21))*PLE!$AE$9,0)),2)","v":{"$error":"#N/A"}},null,{"$f":"IF(_xlfn.SINGLE(ACOMPANHAMENTO)<>\"BM\",0,SUMPRODUCT(OFFSET(BM!$M$15,$A21,0,$B21)*(OFFSET(BM!$A$15,$A21,0,$B21)=\"S\")*OFFSET(ORÇAMENTO!AA$15,$A21,0,$B21)/(OFFSET(ORÇAMENTO!$X$15,$A21,0,$B21)+10^-12)))","v":0},{"$f":"IF(_xlfn.SINGLE(ACOMPANHAMENTO)<>\"BM\",0,SUMPRODUCT(OFFSET(BM!$M$15,$A21,0,$B21)*(OFFSET(BM!$A$15,$A21,0,$B21)=\"S\")*OFFSET(ORÇAMENTO!AB$15,$A21,0,$B21)/(OFFSET(ORÇAMENTO!$X$15,$A21,0,$B21)+10^-12)))","v":0},{"$f":"IF(_xlfn.SINGLE(ACOMPANHAMENTO)<>\"BM\",0,OFFSET(BM!$M$15,$A21,0))","v":0},{"$f":"IF(_xlfn.SINGLE(ACOMPANHAMENTO)<>\"BM\",0,SUMPRODUCT(OFFSET(BM!$O$15,$A21,0,$B21)*(OFFSET(BM!$A$15,$A21,0,$B21)=\"S\")*OFFSET(ORÇAMENTO!AA$15,$A21,0,$B21)/(OFFSET(ORÇAMENTO!$X$15,$A21,0,$B21)+10^-12)))","v":0},{"$f":"IF(_xlfn.SINGLE(ACOMPANHAMENTO)<>\"BM\",0,SUMPRODUCT(OFFSET(BM!$O$15,$A21,0,$B21)*(OFFSET(BM!$A$15,$A21,0,$B21)=\"S\")*OFFSET(ORÇAMENTO!AB$15,$A21,0,$B21)/(OFFSET(ORÇAMENTO!$X$15,$A21,0,$B21)+10^-12)))","v":0},{"$f":"IF(_xlfn.SINGLE(ACOMPANHAMENTO)<>\"BM\",0,OFFSET(BM!$O$15,$A21,0))","v":0}]
[{"$f":"MATCH(E22,ORÇAMENTO!$E$15:$E$27,0)-1","v":{"$error":"#N/A"}},{"$f":"IF(ISERROR($A22),NA(),OFFSET(ORÇAMENTO!$D$15,$A22,0))","v":{"$error":"#N/A"}},{"$f":"QCI!B22","v":"Branco"},"",{"$f":"QCI!D22","v":9},{"$f":"QCI!G22","v":""},{"$f":"QCI!H22","v":0},{"$f":"QCI!I22","v":0},{"$f":"QCI!J22","v":""},{"$f":"QCI!K22","v":""},{"$f":"_xlfn.SINGLE(IF($C22=\"Automático\",IF(_xlfn.SINGLE(ACOMPANHAMENTO)=\"BM\",BM.medicao,PLE.Medicao),IF(ISBLANK($X22),\"\",$X22)))","v":""},{"$f":"QCI!$O22","v":0},0,0,0,0,null,{"$f":"ROUND(IF($C22=\"Automático\",AC22+AJ22,$Y22*IF(ISERROR(QCI!$AA22/QCI!$O22),0,QCI!$AA22/QCI!$O22)),2)","v":0},{"$f":"ROUND(IF($C22=\"Automático\",AD22+AK22,$Y22*IF(ISERROR(QCI!$AB22/QCI!$O22),0,QCI!$AB22/QCI!$O22)),2)","v":0},{"$f":"ROUND(IF($C22=\"Automático\",AF22+AM22,$Z22*IF(ISERROR(QCI!$AA22/QCI!$O22),0,QCI!$AA22/QCI!$O22)),2)","v":0},{"$f":"ROUND(IF($C22=\"Automático\",AG22+AN22,$Z22*IF(ISERROR(QCI!$AB22/QCI!$O22),0,QCI!$AB22/QCI!$O22)),2)","v":0},{"$f":"IF(AND($L22>0,$J22<>0,$J22<>\"\",COUNTIF($J$13:$J22,$J22)=1),OFFSET(V22,-1,0)+1,OFFSET(V22,-1,0))","v":1},null,null,null,null,null,null,{"$f":"IF(_xlfn.SINGLE(ACOMPANHAMENTO)<>\"PLE\",0,SUMPRODUCT((OFFSET(CÁLCULO!$AX$15:$BH$15,$A22,0,$B22)<=(PLE.Medicao-1))*OFFSET(CÁLCULO!$AB$15:$AL$15,$A22,0,$B22)*OFFSET(ORÇAMENTO!$AA$15,$A22,0,$B22)/(OFFSET(ORÇAMENTO!$X$15,$A22,0,$B22)+10^-12))+IF(AUTOEVENTO=\"Manual\",SUMPRODUCT((OFFSET(CÁLCULO!$M$15,$A22,0,$B22)=1)*OFFSET(ORÇAMENTO!$AA$15,$A22,0,$B22)*(PLE!$AE$9-PLE!$Y$9)),0))","v":{"$error":"#N/A"}},{"$f":"IF(_xlfn.SINGLE(ACOMPANHAMENTO)<>\"PLE\",0,SUMPRODUCT((OFFSET(CÁLCULO!$AX$15:$BH$15,$A22,0,$B22)<=(PLE.Medicao-1))*OFFSET(CÁLCULO!$AB$15:$AL$15,$A22,0,$B22)*OFFSET(ORÇAMENTO!$AB$15,$A22,0,$B22)/(OFFSET(ORÇAMENTO!$X$15,$A22,0,$B22)+10^-12))+IF(AUTOEVENTO=\"Manual\",SUMPRODUCT((OFFSET(CÁLCULO!$M$15,$A22,0,$B22)=1)*OFFSET(ORÇAMENTO!$AB$15,$A22,0,$B22)*(PLE!$AE$9-PLE!$Y$9)),0))","v":{"$error":"#N/A"}},{"$f":"ROUND(\n            IF(ACOMPANHAMENTO<>\"PLE\",0,\n                      SUMIF(OFFSET(CÁLCULO!$AX$15:$BH$15,$A22,0,$B22),\"<=\"&(PLE.Medicao-1),OFFSET(CÁLCULO!$AB$15:$AL$15,$A22,0,$B22))\n                      +IF(AdmLocal=\"Automática\",\n                              SUMIF(OFFSET(CÁLCULO!$M$15,$A22,0,$B22),1,OFFSET(ORÇAMENTO!$X$15,$A22,0,$B22))*(PLE!$AE$9-PLE!$Y$9),\n                              0)),\n            2)","v":{"$error":"#N/A"}},{"$f":"IF(_xlfn.SINGLE(ACOMPANHAMENTO)<>\"PLE\",0,SUMPRODUCT((OFFSET(CÁLCULO!$AX$15:$BH$15,$A22,0,$B22)<=PLE.Medicao)*OFFSET(CÁLCULO!$AB$15:$AL$15,$A22,0,$B22)*OFFSET(ORÇAMENTO!$AA$15,$A22,0,$B22)/(OFFSET(ORÇAMENTO!$X$15,$A22,0,$B22)+10^-12))+IF(AUTOEVENTO=\"Manual\",SUMPRODUCT((OFFSET(CÁLCULO!$M$15,$A22,0,$B22)=1)*OFFSET(ORÇAMENTO!$AA$15,$A22,0,$B22)*PLE!$AE$9),0))","v":{"$error":"#N/A"}},{"$f":"IF(_xlfn.SINGLE(ACOMPANHAMENTO)<>\"PLE\",0,SUMPRODUCT((OFFSET(CÁLCULO!$AX$15:$BH$15,$A22,0,$B22)<=PLE.Medicao)*OFFSET(CÁLCULO!$AB$15:$AL$15,$A22,0,$B22)*OFFSET(ORÇAMENTO!$AB$15,$A22,0,$B22)/(OFFSET(ORÇAMENTO!$X$15,$A22,0,$B22)+10^-12))+IF(AUTOEVENTO=\"Manual\",SUMPRODUCT((OFFSET(CÁLCULO!$M$15,$A22,0,$B22)=1)*OFFSET(ORÇAMENTO!$AB$15,$A22,0,$B22)*PLE!$AE$9),0))","v":{"$error":"#N/A"}},{"$f":"ROUND(IF(_xlfn.SINGLE(ACOMPANHAMENTO)<>\"PLE\",0,SUMIF(OFFSET(CÁLCULO!$AX$15:$BH$15,$A22,0,$B22),\"<=\"&PLE.Medicao,OFFSET(CÁLCULO!$AB$15:$AL$15,$A22,0,$B22))+IF(AdmLocal=\"Automática\",SUMIF(OFFSET(CÁLCULO!$M$15,$A22,0,$B22),1,OFFSET(ORÇAMENTO!$X$15,$A22,0,$B22))*PLE!$AE$9,0)),2)","v":{"$error":"#N/A"}},null,{"$f":"IF(_xlfn.SINGLE(ACOMPANHAMENTO)<>\"BM\",0,SUMPRODUCT(OFFSET(BM!$M$15,$A22,0,$B22)*(OFFSET(BM!$A$15,$A22,0,$B22)=\"S\")*OFFSET(ORÇAMENTO!AA$15,$A22,0,$B22)/(OFFSET(ORÇAMENTO!$X$15,$A22,0,$B22)+10^-12)))","v":0},{"$f":"IF(_xlfn.SINGLE(ACOMPANHAMENTO)<>\"BM\",0,SUMPRODUCT(OFFSET(BM!$M$15,$A22,0,$B22)*(OFFSET(BM!$A$15,$A22,0,$B22)=\"S\")*OFFSET(ORÇAMENTO!AB$15,$A22,0,$B22)/(OFFSET(ORÇAMENTO!$X$15,$A22,0,$B22)+10^-12)))","v":0},{"$f":"IF(_xlfn.SINGLE(ACOMPANHAMENTO)<>\"BM\",0,OFFSET(BM!$M$15,$A22,0))","v":0},{"$f":"IF(_xlfn.SINGLE(ACOMPANHAMENTO)<>\"BM\",0,SUMPRODUCT(OFFSET(BM!$O$15,$A22,0,$B22)*(OFFSET(BM!$A$15,$A22,0,$B22)=\"S\")*OFFSET(ORÇAMENTO!AA$15,$A22,0,$B22)/(OFFSET(ORÇAMENTO!$X$15,$A22,0,$B22)+10^-12)))","v":0},{"$f":"IF(_xlfn.SINGLE(ACOMPANHAMENTO)<>\"BM\",0,SUMPRODUCT(OFFSET(BM!$O$15,$A22,0,$B22)*(OFFSET(BM!$A$15,$A22,0,$B22)=\"S\")*OFFSET(ORÇAMENTO!AB$15,$A22,0,$B22)/(OFFSET(ORÇAMENTO!$X$15,$A22,0,$B22)+10^-12)))","v":0},{"$f":"IF(_xlfn.SINGLE(ACOMPANHAMENTO)<>\"BM\",0,OFFSET(BM!$O$15,$A22,0))","v":0}]
[{"$f":"MATCH(E23,ORÇAMENTO!$E$15:$E$27,0)-1","v":{"$error":"#N/A"}},{"$f":"IF(ISERROR($A23),NA(),OFFSET(ORÇAMENTO!$D$15,$A23,0))","v":{"$error":"#N/A"}},{"$f":"QCI!B23","v":"Branco"},{"$f":"IF(L23>0,\"F\",\"\")","v":""},{"$f":"QCI!D23","v":10},{"$f":"QCI!G23","v":""},{"$f":"QCI!H23","v":0},{"$f":"QCI!I23","v":0},{"$f":"QCI!J23","v":""},{"$f":"QCI!K23","v":""},{"$f":"_xlfn.SINGLE(IF($C23=\"Automático\",IF(_xlfn.SINGLE(ACOMPANHAMENTO)=\"BM\",BM.medicao,PLE.Medicao),IF(ISBLANK($X23),\"\",$X23)))","v":""},{"$f":"QCI!$O23","v":0},{"$f":"ROUND(IF(C23=\"Automático\",AE23+AL23,Y23),2)","v":0},{"$f":"O23-M23","v":0},{"$f":"ROUND(IF(C23=\"Automático\",AH23+AO23,Z23),2)","v":0},{"$f":"O23/(L23+10^-12)","v":0},null,{"$f":"ROUND(IF($C23=\"Automático\",AC23+AJ23,$Y23*IF(ISERROR(QCI!$AA23/QCI!$O23),0,QCI!$AA23/QCI!$O23)),2)","v":0},{"$f":"ROUND(IF($C23=\"Automático\",AD23+AK23,$Y23*IF(ISERROR(QCI!$AB23/QCI!$O23),0,QCI!$AB23/QCI!$O23)),2)","v":0},{"$f":"ROUND(IF($C23=\"Automático\",AF23+AM23,$Z23*IF(ISERROR(QCI!$AA23/QCI!$O23),0,QCI!$AA23/QCI!$O23)),2)","v":0},{"$f":"ROUND(IF($C23=\"Automático\",AG23+AN23,$Z23*IF(ISERROR(QCI!$AB23/QCI!$O23),0,QCI!$AB23/QCI!$O23)),2)","v":0},{"$f":"IF(AND($L23>0,$J23<>0,$J23<>\"\",COUNTIF($J$13:$J23,$J23)=1),OFFSET(V23,-1,0)+1,OFFSET(V23,-1,0))","v":1},null,null,null,null,null,null,{"$f":"IF(_xlfn.SINGLE(ACOMPANHAMENTO)<>\"PLE\",0,SUMPRODUCT((OFFSET(CÁLCULO!$AX$15:$BH$15,$A23,0,$B23)<=(PLE.Medicao-1))*OFFSET(CÁLCULO!$AB$15:$AL$15,$A23,0,$B23)*OFFSET(ORÇAMENTO!$AA$15,$A23,0,$B23)/(OFFSET(ORÇAMENTO!$X$15,$A23,0,$B23)+10^-12))+IF(AUTOEVENTO=\"Manual\",SUMPRODUCT((OFFSET(CÁLCULO!$M$15,$A23,0,$B23)=1)*OFFSET(ORÇAMENTO!$AA$15,$A23,0,$B23)*(PLE!$AE$9-PLE!$Y$9)),0))","v":{"$error":"#N/A"}},{"$f":"IF(_xlfn.SINGLE(ACOMPANHAMENTO)<>\"PLE\",0,SUMPRODUCT((OFFSET(CÁLCULO!$AX$15:$BH$15,$A23,0,$B23)<=(PLE.Medicao-1))*OFFSET(CÁLCULO!$AB$15:$AL$15,$A23,0,$B23)*OFFSET(ORÇAMENTO!$AB$15,$A23,0,$B23)/(OFFSET(ORÇAMENTO!$X$15,$A23,0,$B23)+10^-12))+IF(AUTOEVENTO=\"Manual\",SUMPRODUCT((OFFSET(CÁLCULO!$M$15,$A23,0,$B23)=1)*OFFSET(ORÇAMENTO!$AB$15,$A23,0,$B23)*(PLE!$AE$9-PLE!$Y$9)),0))","v":{"$error":"#N/A"}},{"$f":"ROUND(\n            IF(ACOMPANHAMENTO<>\"PLE\",0,\n                      SUMIF(OFFSET(CÁLCULO!$AX$15:$BH$15,$A23,0,$B23),\"<=\"&(PLE.Medicao-1),OFFSET(CÁLCULO!$AB$15:$AL$15,$A23,0,$B23))\n                      +IF(AdmLocal=\"Automática\",\n                              SUMIF(OFFSET(CÁLCULO!$M$15,$A23,0,$B23),1,OFFSET(ORÇAMENTO!$X$15,$A23,0,$B23))*(PLE!$AE$9-PLE!$Y$9),\n                              0)),\n            2)","v":{"$error":"#N/A"}},{"$f":"IF(_xlfn.SINGLE(ACOMPANHAMENTO)<>\"PLE\",0,SUMPRODUCT((OFFSET(CÁLCULO!$AX$15:$BH$15,$A23,0,$B23)<=PLE.Medicao)*OFFSET(CÁLCULO!$AB$15:$AL$15,$A23,0,$B23)*OFFSET(ORÇAMENTO!$AA$15,$A23,0,$B23)/(OFFSET(ORÇAMENTO!$X$15,$A23,0,$B23)+10^-12))+IF(AUTOEVENTO=\"Manual\",SUMPRODUCT((OFFSET(CÁLCULO!$M$15,$A23,0,$B23)=1)*OFFSET(ORÇAMENTO!$AA$15,$A23,0,$B23)*PLE!$AE$9),0))","v":{"$error":"#N/A"}},{"$f":"IF(_xlfn.SINGLE(ACOMPANHAMENTO)<>\"PLE\",0,SUMPRODUCT((OFFSET(CÁLCULO!$AX$15:$BH$15,$A23,0,$B23)<=PLE.Medicao)*OFFSET(CÁLCULO!$AB$15:$AL$15,$A23,0,$B23)*OFFSET(ORÇAMENTO!$AB$15,$A23,0,$B23)/(OFFSET(ORÇAMENTO!$X$15,$A23,0,$B23)+10^-12))+IF(AUTOEVENTO=\"Manual\",SUMPRODUCT((OFFSET(CÁLCULO!$M$15,$A23,0,$B23)=1)*OFFSET(ORÇAMENTO!$AB$15,$A23,0,$B23)*PLE!$AE$9),0))","v":{"$error":"#N/A"}},{"$f":"ROUND(IF(_xlfn.SINGLE(ACOMPANHAMENTO)<>\"PLE\",0,SUMIF(OFFSET(CÁLCULO!$AX$15:$BH$15,$A23,0,$B23),\"<=\"&PLE.Medicao,OFFSET(CÁLCULO!$AB$15:$AL$15,$A23,0,$B23))+IF(AdmLocal=\"Automática\",SUMIF(OFFSET(CÁLCULO!$M$15,$A23,0,$B23),1,OFFSET(ORÇAMENTO!$X$15,$A23,0,$B23))*PLE!$AE$9,0)),2)","v":{"$error":"#N/A"}},null,{"$f":"IF(_xlfn.SINGLE(ACOMPANHAMENTO)<>\"BM\",0,SUMPRODUCT(OFFSET(BM!$M$15,$A23,0,$B23)*(OFFSET(BM!$A$15,$A23,0,$B23)=\"S\")*OFFSET(ORÇAMENTO!AA$15,$A23,0,$B23)/(OFFSET(ORÇAMENTO!$X$15,$A23,0,$B23)+10^-12)))","v":0},{"$f":"IF(_xlfn.SINGLE(ACOMPANHAMENTO)<>\"BM\",0,SUMPRODUCT(OFFSET(BM!$M$15,$A23,0,$B23)*(OFFSET(BM!$A$15,$A23,0,$B23)=\"S\")*OFFSET(ORÇAMENTO!AB$15,$A23,0,$B23)/(OFFSET(ORÇAMENTO!$X$15,$A23,0,$B23)+10^-12)))","v":0},{"$f":"IF(_xlfn.SINGLE(ACOMPANHAMENTO)<>\"BM\",0,OFFSET(BM!$M$15,$A23,0))","v":0},{"$f":"IF(_xlfn.SINGLE(ACOMPANHAMENTO)<>\"BM\",0,SUMPRODUCT(OFFSET(BM!$O$15,$A23,0,$B23)*(OFFSET(BM!$A$15,$A23,0,$B23)=\"S\")*OFFSET(ORÇAMENTO!AA$15,$A23,0,$B23)/(OFFSET(ORÇAMENTO!$X$15,$A23,0,$B23)+10^-12)))","v":0},{"$f":"IF(_xlfn.SINGLE(ACOMPANHAMENTO)<>\"BM\",0,SUMPRODUCT(OFFSET(BM!$O$15,$A23,0,$B23)*(OFFSET(BM!$A$15,$A23,0,$B23)=\"S\")*OFFSET(ORÇAMENTO!AB$15,$A23,0,$B23)/(OFFSET(ORÇAMENTO!$X$15,$A23,0,$B23)+10^-12)))","v":0},{"$f":"IF(_xlfn.SINGLE(ACOMPANHAMENTO)<>\"BM\",0,OFFSET(BM!$O$15,$A23,0))","v":0}]
[null,null,null,"F",null,null,null,null,null,"(%)",null,{"$f":"IF(ISERROR(L28/$L28),0,ROUND(L28/$L28,4))","v":1},{"$f":"IF(ISERROR(M28/$L28),0,ROUND(M28/$L28,4))","v":0},{"$f":"IF(ISERROR(N28/$L28),0,ROUND(N28/$L28,4))","v":0},{"$f":"IF(ISERROR(O28/$L28),0,ROUND(O28/$L28,4))","v":0},{"$f":"O28/(L28+10^-12)","v":0}]
[null,null,null,"F",null,null,null,null,null,{"$f":"IF(import.recurso=\"FGTS\",\"Financiamento\",\"Repasse\")","v":"Repasse"},null,{"$f":"QCI!L24","v":0},{"$f":"M28-M27-M26","v":0},{"$f":"O25-M25","v":0},{"$f":"O28-O27-O26","v":0},null,null,null,null,null,null,null,null,null,"Anterior (R$)","Acumulado (R$)",null,null,"Max CP/OU Ant.","Max CP/OU Acum."]
[null,null,null,"F",null,null,null,null,null,"Contrapartida",null,{"$f":"QCI!M24","v":134660.96},{"$f":"ROUND(IF(OFFSET($X$26,0,1)<>\"\",OFFSET($X$26,0,1),SUM(R13:OFFSET(R24,-1,0))),2)","v":0},{"$f":"O26-M26","v":0},{"$f":"IF(OFFSET($X$26,0,2)<>\"\",OFFSET($X$26,0,2),$AE$3)","v":0},null,null,null,null,null,null,null,null,"CP",null,null,null,null,{"$f":"MIN($L26,$O$28-OFFSET($X$27,0,1))","v":0},{"$f":"MIN($L26,$O$28-OFFSET($X$27,0,2))","v":0}]
[null,null,null,"F",null,null,null,null,null,"Outros",null,{"$f":"QCI!N24","v":0},{"$f":"ROUND(IF(OFFSET($X$27,0,1)<>\"\",OFFSET($X$27,0,1),SUM(S13:OFFSET(S24,-1,0))),2)","v":0},{"$f":"O27-M27","v":0},{"$f":"IF(OFFSET($X$27,0,2)<>\"\",OFFSET($X$27,0,2),$AE$4)","v":0},null,null,null,null,null,null,null,null,"OU",null,null,null,null,{"$f":"MIN($L27,$O$28-OFFSET($X$26,0,1))","v":0},{"$f":"MIN($L27,$O$28-OFFSET($X$26,0,2))","v":0}]
[null,null,null,"F",null,null,null,null,null,"Investimento",null,{"$f":"SUM(L13:OFFSET(L24,-1,0))","v":134660.96},{"$f":"ROUND(SUM(M13:OFFSET(M24,-1,0)),2)","v":0},{"$f":"O28-M28","v":0},{"$f":"SUM(O13:OFFSET(O24,-1,0))","v":0}]
[null,null,null,null,null,null,null,null,null,null,null,null,null,null,{"$f":"\"Acumulado Anterior:  \"&TEXT($M$28/($L$28+10^-12),\"0,00%\")","v":"Acumulado Anterior:  0,00%"}]
[null,null,null,null,"Observações:"]
[]
[]
[]
[null,null,null,null,null,null,null,null,null,null,null,{"$f":"IF(L35=0,\"Preencher a data de fechamento do RRE na aba DADOS (célula \"&ADDRESS(ROW(Import.DataFechaRRE),COLUMN(Import.DataFechaRRE),4)&\")\",\"\")","v":"Preencher a data de fechamento do RRE na aba DADOS (célula C48)"}]
[null,null,null,null,{"$f":"Import.Município","v":"SÃO VALENTIM/RS"},null,null,null,null,null,null,{"$f":"DADOS!$C$48","v":"00:00:00"}]
[null,null,null,null,"Local",null,null,null,null,null,null,"Data"]
[]
[]
[null,null,null,null,{"$f":"IF(CAIXA.Modo,\"Responsável Gerencial CAIXA\",\"Representante Tomador\")","v":"Representante Tomador"},null,null,null,null,null,null,{"$f":"IF(CAIXA.Modo,\"Responsável Técnico CAIXA\",\"Responsável Técnico pela Fiscalização\")","v":"Responsável Técnico pela Fiscalização"}]
[null,null,null,null,"Nome:",{"$f":"IF(CAIXA.Modo,DADOS!C60,DADOS!C28)","v":0},null,null,null,null,null,"Nome:",{"$f":"IF(CAIXA.Modo,BM!X39,DADOS!C51)","v":0}]
[null,null,null,null,{"$f":"IF(CAIXA.Modo,\"Função:\",\"Cargo:\")","v":"Cargo:"},{"$f":"IF(CAIXA.Modo,DADOS!C61,DADOS!C29)","v":0},null,null,null,null,null,{"$f":"IF(CAIXA.Modo,\"Matrícula:\",\"Profissão:\")","v":"Profissão:"},{"$f":"IF(CAIXA.Modo,BM!X40,DADOS!C52)","v":0}]
[null,null,null,null,null,null,null,null,null,null,null,"CREA/CAU:",{"$f":"IF(CAIXA.Modo,BM!X41,DADOS!C53)","v":0}]
[null,null,null,null,null,null,null,null,null,null,null,{"$f":"IF(CAIXA.Modo,\"\",\"ART/RRT:\")","v":"ART/RRT:"},{"$f":"IF(CAIXA.Modo,\"\",DADOS!C54)","v":0}]
[]
[]
[null,null,null,null,{"$f":"IF(CAIXA.Modo,\"Responsável Social CAIXA\",\"Responsável Social\")","v":"Responsável Social"},null,null,null,null,null,null,{"$f":"IF(CAIXA.Modo,\"Responsável Operacional CAIXA\",\"Responsável Financeiro\")","v":"Responsável Financeiro"}]
[null,null,null,null,"Nome:",null,null,null,null,null,null,"Nome:"]
[null,null,null,null,{"$f":"IF(CAIXA.Modo,\"Função:\",\"Cargo:\")","v":"Cargo:"},null,null,null,null,null,null,{"$f":"IF(CAIXA.Modo,\"Função:\",\"Cargo:\")","v":"Cargo:"}]
[null,null,null,null,{"$f":"IF(CAIXA.Modo,\"Matr:\",\"\")","v":""},null,null,null,null,null,null,{"$f":"IF(CAIXA.Modo,\"Matrícula:\",\"\")","v":""}]

{"sheet":"OFÍCIO","index":13,"n_rows":55,"n_cols":7,"rows_kept":55,"cut":false,"hidden":true,"merged":[[54,1,55,6],[32,1,32,2],[32,5,32,6],[33,1,33,2],[33,5,33,6],[36,1,37,6],[38,1,39,6],[41,1,45,6],[30,1,30,2],[30,5,30,6],[29,1,29,2],[29,5,29,6],[53,1,53,6],[31,1,31,2],[31,5,31,6],[27,1,28,2],[18,1,19,1],[18,2,19,6],[10,2,10,3],[13,2,13,6],[14,2,15,6],[17,2,17,6],[27,3,28,3],[27,4,28,4],[27,5,28,6],[5,2,5,3],[7,1,7,6],[9,1,9,3],[0,1,3,2],[23,1,25,6]]}
[null,null,null,null,null,null,"Grau de Sigilo"]
[null,null,null,null,null,null,"# PÚBLICO"]
[]
[]
[null,null,{"$f":"IF(Import.Ofício.Num=0,\"Preencher o número do Ofício\",\"\")","v":"Preencher o número do Ofício"}]
[null,"Ofício n°:"]
[]
[null,{"$f":"CONCATENATE(RRE!$E$35,\", \",TEXT(RRE!$L$35,\"dd\"\" de \"\"mmmm\"\" de \"\"aaaa\"))","v":"SÃO VALENTIM/RS, 00 de janeiro de 1900"}]
[null,"À"]
[null,"CAIXA ECONÔMICA FEDERAL"]
[null,"GIGOV"]
[]
[]
[null,"Assunto:",{"$f":"CONCATENATE(RRE.Numero,\"ª\",\" Solicitação de \",IF(import.recurso=\"OGU\",\"Desbloqueio\",\"Desembolso\"),\" de Recursos.\")","v":"1ª Solicitação de Desbloqueio de Recursos."}]
[null,"REF:",{"$f":"CONCATENATE(\"Contrato de \",IF(import.recurso=\"OGU\",\"Repasse\",\"Financiamento\"),\" - Operação nº \",Import.CR,IF(Import.TransfereGOV=\"\",\"\",CONCATENATE(\" - TransfereGOV nº \",Import.TransfereGOV)))","v":"Contrato de Repasse - Operação nº "}]
[]
[]
[null,"Objeto:",{"$f":"Import.DescLote","v":0}]
[null,"Proponente / Tomador:",{"$f":"Import.Proponente","v":"MUNICÍPIO DE SÃO VALENTIN"}]
[]
[]
[null,{"$f":"IF(B11=\"GIGOV\",\"Senhor Gerente\",\"Senhor Superintendente\")","v":"Senhor Gerente"}]
[]
[null,{"$f":"CONCATENATE(\"1. Vimos pelo presente, solicitar à Caixa Econômica Federal autorização para \",IF(import.recurso=\"OGU\",\"desbloqueio\",\"desembolso\"),\" da parcela de recursos relativa ao Contrato de \",IF(import.recurso=\"OGU\",\"Repasse\",\"Financiamento\"),\" em referência, conforme valores abaixo discriminados e, para tanto, anexamos a documentação necessária ao pleito.\")","v":"1. Vimos pelo presente, solicitar à Caixa Econômica Federal autorização para desbloqueio da parcela de recursos relativa ao Contrato de Repasse em referência, conforme valores abaixo discriminados e, para tanto, anexamos a documentação necessária ao pleito."}]
[]
[]
[]
[null,null,null,"Valores Vigentes do TC/CR",{"$f":"\"Evolução da \"&RRE.Numero&\"ª Medição\"","v":"Evolução da 1ª Medição"},"Valores Medidos Acumulados"]
[]
[null,{"$f":"IF(import.recurso=\"FGTS\",\"Financiamento:\",\"Repasse:\")","v":"Repasse:"},null,{"$f":"RRE!L25","v":0},{"$f":"RRE!N25","v":0},{"$f":"RRE!O25","v":0}]
[null,"Contrapartida Financeira:",null,{"$f":"RRE!L26","v":134660.96},{"$f":"RRE!N26","v":0},{"$f":"RRE!O26","v":0}]
[null,"Outros:",null,{"$f":"RRE!L27","v":0},{"$f":"RRE!N27","v":0},{"$f":"RRE!O27","v":0}]
[null,"Investimento:",null,{"$f":"RRE!L28","v":134660.96},{"$f":"RRE!N28","v":0},{"$f":"RRE!O28","v":0}]
[null,"Execução Física:",null,"-",{"$f":"RRE!$N$28/(RRE!$L$28+10^-12)","v":0},{"$f":"RRE!P24","v":0}]
[]
[]
[null,{"$f":"IF(RRE.Numero>1,\"2. Encaminhamos ainda a documentação relativa à prestação de contas da etapa físico-financeira anterior.\",\"\")","v":""}]
[]
[null,{"$f":"IF(AND(RRE.Numero>1,NOT(ISBLANK(Import.TransfereGOV))),\"3. Na oportunidade, informamos que a execução financeira da parcela anterior está devidamente comprovada no TransfereGOV.\",\"\")","v":""}]
[]
[]
[null,{"$f":"IF($B$37=\"\",0,1)+IF($B$39=\"\",0,1)+2&\". Informamos também a manutenção da Placa de Obra em local visível e de acordo com padrão estabelecido pela Presidência da República, constante do Manual Visual de Placas e Adesivos de Obra.\"","v":"2. Informamos também a manutenção da Placa de Obra em local visível e de acordo com padrão estabelecido pela Presidência da República, constante do Manual Visual de Placas e Adesivos de Obra."}]
[]
[]
[]
[]
[]
[]
[null,"Atenciosamente,"]
[]
[]
[]
[]
[null,{"$f":"DADOS!$C$28","v":0}]
[null,{"$f":"DADOS!$C$29","v":0}]

{"sheet":"PO-PLE","index":14,"n_rows":1,"n_cols":19,"rows_kept":1,"cut":false,"hidden":true,"merged":[]}
["Nivel","N° Macrosserviço / Serviço","Fonte","Código","Descrição Macrosserviço / Serviço","Qtd. (valor calculado)","Und.","Custo Unitário Referência","Custo Unitário","BDI","Preço Unitário (valor calculado)","Preço Total (valor calculado)","Observação","N° Evento","Evento","N° Frente de Obra","Frente de Obra","Qtd.","Valor"]

{"sheet":"CFF-PLE","index":15,"n_rows":1,"n_cols":5,"rows_kept":1,"cut":false,"hidden":true,"merged":[]}
["N° do Evento","Título do Evento","N° da Frente de Obra","Frente de Obra","N° do Período de Conclusão do Evento"]

{"sheet":"PO-BM","index":16,"n_rows":1,"n_cols":17,"rows_kept":1,"cut":false,"hidden":true,"merged":[]}
["Nivel","N° Macrosserviço / Serviço","Fonte","Código","Descrição Macrosserviço / Serviço","Qtd. (valor calculado)","Und.","Custo Unitário Referência","Custo Unitário","BDI","Preço Unitário (valor calculado)","Preço Total (valor calculado)","Observação","N° Frente de Obra","Frente de Obra","Qtd.","Valor"]

{"sheet":"CFF-BM","index":17,"n_rows":1,"n_cols":4,"rows_kept":1,"cut":false,"hidden":true,"merged":[]}
["Número","Macrosserviço","Parcela","Percentual Parcela"]